{
  "data_qualities": {
    "quality": [
      {
        "name": "AutoCorrelation",
        "value": "-0.207452736318408"
      },
      {
        "name": "ClassEntropy",
        "value": []
      },
      {
        "name": "Dimensionality",
        "value": "0.32673267326732675"
      },
      {
        "name": "EquivalentNumberOfAtts",
        "value": []
      },
      {
        "name": "MajorityClassPercentage",
        "value": []
      },
      {
        "name": "MajorityClassSize",
        "value": []
      },
      {
        "name": "MaxAttributeEntropy",
        "value": []
      },
      {
        "name": "MaxKurtosisOfNumericAtts",
        "value": "12.276072066118028"
      },
      {
        "name": "MaxMeansOfNumericAtts",
        "value": "39118.22772277228"
      },
      {
        "name": "MaxMutualInformation",
        "value": []
      },
      {
        "name": "MaxNominalAttDistinctValues",
        "value": []
      },
      {
        "name": "MaxSkewnessOfNumericAtts",
        "value": "0.9913618163567106"
      },
      {
        "name": "MaxStdDevOfNumericAtts",
        "value": "20144.502511367013"
      },
      {
        "name": "MeanAttributeEntropy",
        "value": []
      },
      {
        "name": "MeanKurtosisOfNumericAtts",
        "value": "2.5484438617041367"
      },
      {
        "name": "MeanMeansOfNumericAtts",
        "value": "625.9574477532369"
      },
      {
        "name": "MeanMutualInformation",
        "value": []
      },
      {
        "name": "MeanNoiseToSignalRatio",
        "value": []
      },
      {
        "name": "MeanNominalAttDistinctValues",
        "value": []
      },
      {
        "name": "MeanSkewnessOfNumericAtts",
        "value": "-0.8087071610414797"
      },
      {
        "name": "MeanStdDevOfNumericAtts",
        "value": "313.09703731969586"
      },
      {
        "name": "MinAttributeEntropy",
        "value": []
      },
      {
        "name": "MinKurtosisOfNumericAtts",
        "value": "-0.5146907030417114"
      },
      {
        "name": "MinMeansOfNumericAtts",
        "value": "0.1100049504950495"
      },
      {
        "name": "MinMutualInformation",
        "value": []
      },
      {
        "name": "MinNominalAttDistinctValues",
        "value": []
      },
      {
        "name": "MinSkewnessOfNumericAtts",
        "value": "-2.940645754766201"
      },
      {
        "name": "MinStdDevOfNumericAtts",
        "value": "0.020484309618456764"
      },
      {
        "name": "MinorityClassPercentage",
        "value": []
      },
      {
        "name": "MinorityClassSize",
        "value": []
      },
      {
        "name": "NumberOfBinaryFeatures",
        "value": "0.0"
      },
      {
        "name": "NumberOfClasses",
        "value": "0.0"
      },
      {
        "name": "NumberOfFeatures",
        "value": "66.0"
      },
      {
        "name": "NumberOfInstances",
        "value": "202.0"
      },
      {
        "name": "NumberOfInstancesWithMissingValues",
        "value": "0.0"
      },
      {
        "name": "NumberOfMissingValues",
        "value": "0.0"
      },
      {
        "name": "NumberOfNumericFeatures",
        "value": "65.0"
      },
      {
        "name": "NumberOfSymbolicFeatures",
        "value": "1.0"
      },
      {
        "name": "PercentageOfBinaryFeatures",
        "value": "0.0"
      },
      {
        "name": "PercentageOfInstancesWithMissingValues",
        "value": "0.0"
      },
      {
        "name": "PercentageOfMissingValues",
        "value": "0.0"
      },
      {
        "name": "PercentageOfNumericFeatures",
        "value": "98.48484848484848"
      },
      {
        "name": "PercentageOfSymbolicFeatures",
        "value": "1.5151515151515151"
      },
      {
        "name": "Quartile1AttributeEntropy",
        "value": []
      },
      {
        "name": "Quartile1KurtosisOfNumericAtts",
        "value": "0.2043699993949628"
      },
      {
        "name": "Quartile1MeansOfNumericAtts",
        "value": "3.022121287128713"
      },
      {
        "name": "Quartile1MutualInformation",
        "value": []
      },
      {
        "name": "Quartile1SkewnessOfNumericAtts",
        "value": "-1.43532460943194"
      },
      {
        "name": "Quartile1StdDevOfNumericAtts",
        "value": "0.22519928891906116"
      },
      {
        "name": "Quartile2AttributeEntropy",
        "value": []
      },
      {
        "name": "Quartile2KurtosisOfNumericAtts",
        "value": "0.8975425444752205"
      },
      {
        "name": "Quartile2MeansOfNumericAtts",
        "value": "7.084049504950495"
      },
      {
        "name": "Quartile2MutualInformation",
        "value": []
      },
      {
        "name": "Quartile2SkewnessOfNumericAtts",
        "value": "-0.670522131533476"
      },
      {
        "name": "Quartile2StdDevOfNumericAtts",
        "value": "0.41374412324792126"
      },
      {
        "name": "Quartile3AttributeEntropy",
        "value": []
      },
      {
        "name": "Quartile3KurtosisOfNumericAtts",
        "value": "3.4019971854676294"
      },
      {
        "name": "Quartile3MeansOfNumericAtts",
        "value": "23.958908415841584"
      },
      {
        "name": "Quartile3MutualInformation",
        "value": []
      },
      {
        "name": "Quartile3SkewnessOfNumericAtts",
        "value": "0.20632241594531747"
      },
      {
        "name": "Quartile3StdDevOfNumericAtts",
        "value": "0.9880296173333294"
      },
      {
        "name": "StdvNominalAttDistinctValues",
        "value": []
      }
    ]
  }
}