{
  "data_qualities": {
    "quality": [
      {
        "name": "AutoCorrelation",
        "value": "-0.14251639344262249"
      },
      {
        "name": "ClassEntropy",
        "value": []
      },
      {
        "name": "Dimensionality",
        "value": "0.36585365853658536"
      },
      {
        "name": "EquivalentNumberOfAtts",
        "value": []
      },
      {
        "name": "MajorityClassPercentage",
        "value": []
      },
      {
        "name": "MajorityClassSize",
        "value": []
      },
      {
        "name": "MaxAttributeEntropy",
        "value": []
      },
      {
        "name": "MaxKurtosisOfNumericAtts",
        "value": "122.99999999999999"
      },
      {
        "name": "MaxMeansOfNumericAtts",
        "value": "361.7847154471545"
      },
      {
        "name": "MaxMutualInformation",
        "value": []
      },
      {
        "name": "MaxNominalAttDistinctValues",
        "value": []
      },
      {
        "name": "MaxSkewnessOfNumericAtts",
        "value": "11.090536506409425"
      },
      {
        "name": "MaxStdDevOfNumericAtts",
        "value": "39.239383221644644"
      },
      {
        "name": "MeanAttributeEntropy",
        "value": []
      },
      {
        "name": "MeanKurtosisOfNumericAtts",
        "value": "3.8130728461830072"
      },
      {
        "name": "MeanMeansOfNumericAtts",
        "value": "20.21321406134516"
      },
      {
        "name": "MeanMutualInformation",
        "value": []
      },
      {
        "name": "MeanNoiseToSignalRatio",
        "value": []
      },
      {
        "name": "MeanNominalAttDistinctValues",
        "value": []
      },
      {
        "name": "MeanSkewnessOfNumericAtts",
        "value": "0.9689202136467505"
      },
      {
        "name": "MeanStdDevOfNumericAtts",
        "value": "2.3992831447077387"
      },
      {
        "name": "MinAttributeEntropy",
        "value": []
      },
      {
        "name": "MinKurtosisOfNumericAtts",
        "value": "-1.0016960273028328"
      },
      {
        "name": "MinMeansOfNumericAtts",
        "value": "0.0"
      },
      {
        "name": "MinMutualInformation",
        "value": []
      },
      {
        "name": "MinNominalAttDistinctValues",
        "value": []
      },
      {
        "name": "MinSkewnessOfNumericAtts",
        "value": "-0.5619467551973091"
      },
      {
        "name": "MinStdDevOfNumericAtts",
        "value": "0.0"
      },
      {
        "name": "MinorityClassPercentage",
        "value": []
      },
      {
        "name": "MinorityClassSize",
        "value": []
      },
      {
        "name": "NumberOfBinaryFeatures",
        "value": "0.0"
      },
      {
        "name": "NumberOfClasses",
        "value": "0.0"
      },
      {
        "name": "NumberOfFeatures",
        "value": "45.0"
      },
      {
        "name": "NumberOfInstances",
        "value": "123.0"
      },
      {
        "name": "NumberOfInstancesWithMissingValues",
        "value": "0.0"
      },
      {
        "name": "NumberOfMissingValues",
        "value": "0.0"
      },
      {
        "name": "NumberOfNumericFeatures",
        "value": "44.0"
      },
      {
        "name": "NumberOfSymbolicFeatures",
        "value": "1.0"
      },
      {
        "name": "PercentageOfBinaryFeatures",
        "value": "0.0"
      },
      {
        "name": "PercentageOfInstancesWithMissingValues",
        "value": "0.0"
      },
      {
        "name": "PercentageOfMissingValues",
        "value": "0.0"
      },
      {
        "name": "PercentageOfNumericFeatures",
        "value": "97.77777777777777"
      },
      {
        "name": "PercentageOfSymbolicFeatures",
        "value": "2.2222222222222223"
      },
      {
        "name": "Quartile1AttributeEntropy",
        "value": []
      },
      {
        "name": "Quartile1KurtosisOfNumericAtts",
        "value": "-0.16807306487495488"
      },
      {
        "name": "Quartile1MeansOfNumericAtts",
        "value": "0.7034928861788619"
      },
      {
        "name": "Quartile1MutualInformation",
        "value": []
      },
      {
        "name": "Quartile1SkewnessOfNumericAtts",
        "value": "0.1918295136008759"
      },
      {
        "name": "Quartile1StdDevOfNumericAtts",
        "value": "0.4719475276237805"
      },
      {
        "name": "Quartile2AttributeEntropy",
        "value": []
      },
      {
        "name": "Quartile2KurtosisOfNumericAtts",
        "value": "0.1626096778939936"
      },
      {
        "name": "Quartile2MeansOfNumericAtts",
        "value": "4.471951219512196"
      },
      {
        "name": "Quartile2MutualInformation",
        "value": []
      },
      {
        "name": "Quartile2SkewnessOfNumericAtts",
        "value": "0.5674510996075843"
      },
      {
        "name": "Quartile2StdDevOfNumericAtts",
        "value": "1.1881488455992475"
      },
      {
        "name": "Quartile3AttributeEntropy",
        "value": []
      },
      {
        "name": "Quartile3KurtosisOfNumericAtts",
        "value": "1.1513984535658812"
      },
      {
        "name": "Quartile3MeansOfNumericAtts",
        "value": "25.76422764227642"
      },
      {
        "name": "Quartile3MutualInformation",
        "value": []
      },
      {
        "name": "Quartile3SkewnessOfNumericAtts",
        "value": "1.2614845015158394"
      },
      {
        "name": "Quartile3StdDevOfNumericAtts",
        "value": "2.5657816649235703"
      },
      {
        "name": "StdvNominalAttDistinctValues",
        "value": []
      }
    ]
  }
}