{
  "data_features": {
    "feature": [
      {
        "data_type": "nominal",
        "index": "0",
        "is_ignore": "false",
        "is_row_identifier": "true",
        "is_target": "false",
        "name": "molecule_id",
        "nominal_value": [
          "CHEMBL102994",
          "CHEMBL105406",
          "CHEMBL105514",
          "CHEMBL115277",
          "CHEMBL116226",
          "CHEMBL117045",
          "CHEMBL125343",
          "CHEMBL1253499",
          "CHEMBL125350",
          "CHEMBL125358",
          "CHEMBL1253853",
          "CHEMBL1254024",
          "CHEMBL1254025",
          "CHEMBL125406",
          "CHEMBL1254117",
          "CHEMBL125748",
          "CHEMBL125847",
          "CHEMBL126025",
          "CHEMBL126026",
          "CHEMBL126029",
          "CHEMBL126194",
          "CHEMBL126195",
          "CHEMBL126232",
          "CHEMBL126371",
          "CHEMBL126381",
          "CHEMBL126453",
          "CHEMBL126565",
          "CHEMBL126708",
          "CHEMBL126709",
          "CHEMBL126717",
          "CHEMBL126731",
          "CHEMBL126765",
          "CHEMBL126773",
          "CHEMBL126785",
          "CHEMBL126796",
          "CHEMBL126824",
          "CHEMBL126883",
          "CHEMBL126951",
          "CHEMBL126962",
          "CHEMBL126999",
          "CHEMBL127016",
          "CHEMBL127049",
          "CHEMBL127056",
          "CHEMBL127063",
          "CHEMBL127117",
          "CHEMBL127118",
          "CHEMBL127119",
          "CHEMBL127445",
          "CHEMBL127686",
          "CHEMBL127957",
          "CHEMBL128124",
          "CHEMBL128163",
          "CHEMBL128194",
          "CHEMBL128216",
          "CHEMBL128219",
          "CHEMBL128228",
          "CHEMBL128258",
          "CHEMBL128327",
          "CHEMBL128328",
          "CHEMBL128383",
          "CHEMBL128388",
          "CHEMBL128398",
          "CHEMBL128417",
          "CHEMBL128422",
          "CHEMBL128423",
          "CHEMBL128489",
          "CHEMBL128497",
          "CHEMBL128652",
          "CHEMBL128680",
          "CHEMBL128712",
          "CHEMBL128726",
          "CHEMBL128749",
          "CHEMBL128879",
          "CHEMBL128978",
          "CHEMBL129001",
          "CHEMBL129031",
          "CHEMBL129089",
          "CHEMBL129104",
          "CHEMBL129234",
          "CHEMBL129246",
          "CHEMBL129268",
          "CHEMBL129413",
          "CHEMBL129414",
          "CHEMBL129498",
          "CHEMBL129513",
          "CHEMBL129581",
          "CHEMBL129647",
          "CHEMBL129708",
          "CHEMBL129733",
          "CHEMBL129955",
          "CHEMBL129971",
          "CHEMBL129983",
          "CHEMBL130186",
          "CHEMBL130351",
          "CHEMBL130476",
          "CHEMBL130695",
          "CHEMBL130742",
          "CHEMBL130768",
          "CHEMBL130770",
          "CHEMBL130803",
          "CHEMBL130848",
          "CHEMBL130887",
          "CHEMBL130891",
          "CHEMBL130905",
          "CHEMBL130993",
          "CHEMBL131101",
          "CHEMBL131168",
          "CHEMBL131235",
          "CHEMBL131239",
          "CHEMBL131269",
          "CHEMBL131388",
          "CHEMBL131477",
          "CHEMBL131499",
          "CHEMBL131538",
          "CHEMBL131551",
          "CHEMBL131564",
          "CHEMBL131581",
          "CHEMBL131613",
          "CHEMBL131650",
          "CHEMBL132064",
          "CHEMBL132157",
          "CHEMBL132165",
          "CHEMBL132210",
          "CHEMBL132211",
          "CHEMBL132389",
          "CHEMBL132391",
          "CHEMBL132496",
          "CHEMBL13477",
          "CHEMBL142324",
          "CHEMBL143304",
          "CHEMBL143341",
          "CHEMBL1790192",
          "CHEMBL1790198",
          "CHEMBL1790200",
          "CHEMBL1790201",
          "CHEMBL1790202",
          "CHEMBL1790307",
          "CHEMBL1790310",
          "CHEMBL1790312",
          "CHEMBL1790313",
          "CHEMBL1790314",
          "CHEMBL1790315",
          "CHEMBL1790542",
          "CHEMBL1790543",
          "CHEMBL1790544",
          "CHEMBL1790546",
          "CHEMBL1790547",
          "CHEMBL1790548",
          "CHEMBL1790549",
          "CHEMBL1790550",
          "CHEMBL1790551",
          "CHEMBL1790552",
          "CHEMBL1790762",
          "CHEMBL1790937",
          "CHEMBL1790938",
          "CHEMBL19658",
          "CHEMBL199623",
          "CHEMBL20002",
          "CHEMBL20126",
          "CHEMBL20171",
          "CHEMBL201889",
          "CHEMBL20205",
          "CHEMBL2021547",
          "CHEMBL2021554",
          "CHEMBL20230",
          "CHEMBL20319",
          "CHEMBL20757",
          "CHEMBL208787",
          "CHEMBL2111847",
          "CHEMBL2111851",
          "CHEMBL2112247",
          "CHEMBL2112248",
          "CHEMBL2112249",
          "CHEMBL2112250",
          "CHEMBL2112650",
          "CHEMBL2112651",
          "CHEMBL2112654",
          "CHEMBL2112655",
          "CHEMBL2112656",
          "CHEMBL2112663",
          "CHEMBL2112666",
          "CHEMBL2112893",
          "CHEMBL2112894",
          "CHEMBL2112895",
          "CHEMBL2112896",
          "CHEMBL2112897",
          "CHEMBL2112898",
          "CHEMBL2112899",
          "CHEMBL2112900",
          "CHEMBL2112901",
          "CHEMBL2112902",
          "CHEMBL2112903",
          "CHEMBL2113177",
          "CHEMBL2113185",
          "CHEMBL2113189",
          "CHEMBL2113200",
          "CHEMBL2113201",
          "CHEMBL2113203",
          "CHEMBL2113208",
          "CHEMBL2113211",
          "CHEMBL219272",
          "CHEMBL221436",
          "CHEMBL221485",
          "CHEMBL232501",
          "CHEMBL233080",
          "CHEMBL233281",
          "CHEMBL233328",
          "CHEMBL234377",
          "CHEMBL24456",
          "CHEMBL24526",
          "CHEMBL24682",
          "CHEMBL24781",
          "CHEMBL25120",
          "CHEMBL25353",
          "CHEMBL25502",
          "CHEMBL25611",
          "CHEMBL261914",
          "CHEMBL261938",
          "CHEMBL262157",
          "CHEMBL263090",
          "CHEMBL263153",
          "CHEMBL263219",
          "CHEMBL263355",
          "CHEMBL263521",
          "CHEMBL264449",
          "CHEMBL265048",
          "CHEMBL265070",
          "CHEMBL265073",
          "CHEMBL265357",
          "CHEMBL265490",
          "CHEMBL265630",
          "CHEMBL265858",
          "CHEMBL265859",
          "CHEMBL266643",
          "CHEMBL266898",
          "CHEMBL267214",
          "CHEMBL26877",
          "CHEMBL268778",
          "CHEMBL268779",
          "CHEMBL269624",
          "CHEMBL27157",
          "CHEMBL274955",
          "CHEMBL276079",
          "CHEMBL276906",
          "CHEMBL276990",
          "CHEMBL277022",
          "CHEMBL278377",
          "CHEMBL278818",
          "CHEMBL279022",
          "CHEMBL279230",
          "CHEMBL279281",
          "CHEMBL280202",
          "CHEMBL280356",
          "CHEMBL281361",
          "CHEMBL283126",
          "CHEMBL283317",
          "CHEMBL283524",
          "CHEMBL283994",
          "CHEMBL284442",
          "CHEMBL291005",
          "CHEMBL292579",
          "CHEMBL292848",
          "CHEMBL296908",
          "CHEMBL297725",
          "CHEMBL299502",
          "CHEMBL300103",
          "CHEMBL300642",
          "CHEMBL300803",
          "CHEMBL300978",
          "CHEMBL301595",
          "CHEMBL301708",
          "CHEMBL302297",
          "CHEMBL303487",
          "CHEMBL303700",
          "CHEMBL304577",
          "CHEMBL306010",
          "CHEMBL306416",
          "CHEMBL306645",
          "CHEMBL308673",
          "CHEMBL31065",
          "CHEMBL325752",
          "CHEMBL326085",
          "CHEMBL326142",
          "CHEMBL331591",
          "CHEMBL334332",
          "CHEMBL334610",
          "CHEMBL334953",
          "CHEMBL335170",
          "CHEMBL335182",
          "CHEMBL335634",
          "CHEMBL335876",
          "CHEMBL335886",
          "CHEMBL335944",
          "CHEMBL336082",
          "CHEMBL336195",
          "CHEMBL336362",
          "CHEMBL336742",
          "CHEMBL336857",
          "CHEMBL336992",
          "CHEMBL337212",
          "CHEMBL337221",
          "CHEMBL337519",
          "CHEMBL337615",
          "CHEMBL337667",
          "CHEMBL337842",
          "CHEMBL337853",
          "CHEMBL337888",
          "CHEMBL337889",
          "CHEMBL337959",
          "CHEMBL337976",
          "CHEMBL338018",
          "CHEMBL338020",
          "CHEMBL338118",
          "CHEMBL338170",
          "CHEMBL338177",
          "CHEMBL338182",
          "CHEMBL338221",
          "CHEMBL338235",
          "CHEMBL338294",
          "CHEMBL338308",
          "CHEMBL338318",
          "CHEMBL338324",
          "CHEMBL338336",
          "CHEMBL338362",
          "CHEMBL338383",
          "CHEMBL338409",
          "CHEMBL338470",
          "CHEMBL338490",
          "CHEMBL338499",
          "CHEMBL338503",
          "CHEMBL338522",
          "CHEMBL338548",
          "CHEMBL338570",
          "CHEMBL338576",
          "CHEMBL338605",
          "CHEMBL338635",
          "CHEMBL338636",
          "CHEMBL338711",
          "CHEMBL338757",
          "CHEMBL338814",
          "CHEMBL338921",
          "CHEMBL338951",
          "CHEMBL338981",
          "CHEMBL338984",
          "CHEMBL339093",
          "CHEMBL339096",
          "CHEMBL339118",
          "CHEMBL339124",
          "CHEMBL339132",
          "CHEMBL339151",
          "CHEMBL339155",
          "CHEMBL339302",
          "CHEMBL339357",
          "CHEMBL339366",
          "CHEMBL339433",
          "CHEMBL339450",
          "CHEMBL339452",
          "CHEMBL339464",
          "CHEMBL339472",
          "CHEMBL339493",
          "CHEMBL339497",
          "CHEMBL339498",
          "CHEMBL339524",
          "CHEMBL339681",
          "CHEMBL339698",
          "CHEMBL339756",
          "CHEMBL339768",
          "CHEMBL339783",
          "CHEMBL339866",
          "CHEMBL339929",
          "CHEMBL340016",
          "CHEMBL340102",
          "CHEMBL340141",
          "CHEMBL340149",
          "CHEMBL340150",
          "CHEMBL340153",
          "CHEMBL340204",
          "CHEMBL340237",
          "CHEMBL340320",
          "CHEMBL340334",
          "CHEMBL340362",
          "CHEMBL340383",
          "CHEMBL340388",
          "CHEMBL340465",
          "CHEMBL340479",
          "CHEMBL340531",
          "CHEMBL340581",
          "CHEMBL340588",
          "CHEMBL340589",
          "CHEMBL340639",
          "CHEMBL340676",
          "CHEMBL340695",
          "CHEMBL340772",
          "CHEMBL340897",
          "CHEMBL340915",
          "CHEMBL340920",
          "CHEMBL340964",
          "CHEMBL341021",
          "CHEMBL341039",
          "CHEMBL341049",
          "CHEMBL341077",
          "CHEMBL341095",
          "CHEMBL341108",
          "CHEMBL341119",
          "CHEMBL341267",
          "CHEMBL341274",
          "CHEMBL341289",
          "CHEMBL341311",
          "CHEMBL341338",
          "CHEMBL341339",
          "CHEMBL341470",
          "CHEMBL341482",
          "CHEMBL341490",
          "CHEMBL341507",
          "CHEMBL344752",
          "CHEMBL352836",
          "CHEMBL353396",
          "CHEMBL358793",
          "CHEMBL373742",
          "CHEMBL373968",
          "CHEMBL375096",
          "CHEMBL375187",
          "CHEMBL375188",
          "CHEMBL375323",
          "CHEMBL375324",
          "CHEMBL375325",
          "CHEMBL376412",
          "CHEMBL376685",
          "CHEMBL377414",
          "CHEMBL382301",
          "CHEMBL385062",
          "CHEMBL385068",
          "CHEMBL385739",
          "CHEMBL386547",
          "CHEMBL393020",
          "CHEMBL393021",
          "CHEMBL394266",
          "CHEMBL394267",
          "CHEMBL394268",
          "CHEMBL394411",
          "CHEMBL395429",
          "CHEMBL397407",
          "CHEMBL402693",
          "CHEMBL405005",
          "CHEMBL405016",
          "CHEMBL405289",
          "CHEMBL405440",
          "CHEMBL406533",
          "CHEMBL406896",
          "CHEMBL407977",
          "CHEMBL408786",
          "CHEMBL412192",
          "CHEMBL412616",
          "CHEMBL412742",
          "CHEMBL412806",
          "CHEMBL412942",
          "CHEMBL412972",
          "CHEMBL412973",
          "CHEMBL415160",
          "CHEMBL415417",
          "CHEMBL415418",
          "CHEMBL417458",
          "CHEMBL419422",
          "CHEMBL419603",
          "CHEMBL419793",
          "CHEMBL419973",
          "CHEMBL420144",
          "CHEMBL421090",
          "CHEMBL421248",
          "CHEMBL422080",
          "CHEMBL422612",
          "CHEMBL423156",
          "CHEMBL424905",
          "CHEMBL425991",
          "CHEMBL428187",
          "CHEMBL429161",
          "CHEMBL429971",
          "CHEMBL432515",
          "CHEMBL433662",
          "CHEMBL434193",
          "CHEMBL434825",
          "CHEMBL434993",
          "CHEMBL435009",
          "CHEMBL435019",
          "CHEMBL435021",
          "CHEMBL435159",
          "CHEMBL435398",
          "CHEMBL435409",
          "CHEMBL435613",
          "CHEMBL435716",
          "CHEMBL435815",
          "CHEMBL436189",
          "CHEMBL436397",
          "CHEMBL438849",
          "CHEMBL439098",
          "CHEMBL439482",
          "CHEMBL441128",
          "CHEMBL441195",
          "CHEMBL445816",
          "CHEMBL449399",
          "CHEMBL52176",
          "CHEMBL52813",
          "CHEMBL53065",
          "CHEMBL538934",
          "CHEMBL539918",
          "CHEMBL540754",
          "CHEMBL541246",
          "CHEMBL54443",
          "CHEMBL552946",
          "CHEMBL553710",
          "CHEMBL558740",
          "CHEMBL558950",
          "CHEMBL563952",
          "CHEMBL60954",
          "CHEMBL65949",
          "CHEMBL65950",
          "CHEMBL66240",
          "CHEMBL66567",
          "CHEMBL66749",
          "CHEMBL66985",
          "CHEMBL66992",
          "CHEMBL68199",
          "CHEMBL68480",
          "CHEMBL68800",
          "CHEMBL68914",
          "CHEMBL68978",
          "CHEMBL69201",
          "CHEMBL69202",
          "CHEMBL69265",
          "CHEMBL69520",
          "CHEMBL69539",
          "CHEMBL71540"
        ],
        "number_of_missing_values": "0"
      },
      {
        "data_type": "numeric",
        "index": "1",
        "is_ignore": "false",
        "is_row_identifier": "false",
        "is_target": "false",
        "name": "Eig15_AEA.ri.",
        "number_of_missing_values": "0"
      },
      {
        "data_type": "numeric",
        "index": "2",
        "is_ignore": "false",
        "is_row_identifier": "false",
        "is_target": "false",
        "name": "CMC.80",
        "number_of_missing_values": "0"
      },
      {
        "data_type": "numeric",
        "index": "3",
        "is_ignore": "false",
        "is_row_identifier": "false",
        "is_target": "false",
        "name": "Eig11_EA.ri.",
        "number_of_missing_values": "0"
      },
      {
        "data_type": "numeric",
        "index": "4",
        "is_ignore": "false",
        "is_row_identifier": "false",
        "is_target": "false",
        "name": "AECC",
        "number_of_missing_values": "0"
      },
      {
        "data_type": "numeric",
        "index": "5",
        "is_ignore": "false",
        "is_row_identifier": "false",
        "is_target": "false",
        "name": "SpAD_EA.bo.",
        "number_of_missing_values": "0"
      },
      {
        "data_type": "numeric",
        "index": "6",
        "is_ignore": "false",
        "is_row_identifier": "false",
        "is_target": "false",
        "name": "IDE",
        "number_of_missing_values": "0"
      },
      {
        "data_type": "numeric",
        "index": "7",
        "is_ignore": "false",
        "is_row_identifier": "false",
        "is_target": "false",
        "name": "SpMin6_Bh.p.",
        "number_of_missing_values": "0"
      },
      {
        "data_type": "numeric",
        "index": "8",
        "is_ignore": "false",
        "is_row_identifier": "false",
        "is_target": "false",
        "name": "ATS8m",
        "number_of_missing_values": "0"
      },
      {
        "data_type": "numeric",
        "index": "9",
        "is_ignore": "false",
        "is_row_identifier": "false",
        "is_target": "false",
        "name": "ATS8v",
        "number_of_missing_values": "0"
      },
      {
        "data_type": "numeric",
        "index": "10",
        "is_ignore": "false",
        "is_row_identifier": "false",
        "is_target": "false",
        "name": "HVcpx",
        "number_of_missing_values": "0"
      },
      {
        "data_type": "numeric",
        "index": "11",
        "is_ignore": "false",
        "is_row_identifier": "false",
        "is_target": "false",
        "name": "piPC02",
        "number_of_missing_values": "0"
      },
      {
        "data_type": "numeric",
        "index": "12",
        "is_ignore": "false",
        "is_row_identifier": "false",
        "is_target": "false",
        "name": "SM02_EA.bo.",
        "number_of_missing_values": "0"
      },
      {
        "data_type": "numeric",
        "index": "13",
        "is_ignore": "false",
        "is_row_identifier": "false",
        "is_target": "false",
        "name": "SpMax7_Bh.p.",
        "number_of_missing_values": "0"
      },
      {
        "data_type": "numeric",
        "index": "14",
        "is_ignore": "false",
        "is_row_identifier": "false",
        "is_target": "false",
        "name": "SpMax4_Bh.e.",
        "number_of_missing_values": "0"
      },
      {
        "data_type": "numeric",
        "index": "15",
        "is_ignore": "false",
        "is_row_identifier": "false",
        "is_target": "false",
        "name": "SpMin7_Bh.v.",
        "number_of_missing_values": "0"
      },
      {
        "data_type": "numeric",
        "index": "16",
        "is_ignore": "false",
        "is_row_identifier": "false",
        "is_target": "false",
        "name": "ATS7m",
        "number_of_missing_values": "0"
      },
      {
        "data_type": "numeric",
        "index": "17",
        "is_ignore": "false",
        "is_row_identifier": "false",
        "is_target": "false",
        "name": "Infective.80",
        "number_of_missing_values": "0"
      },
      {
        "data_type": "numeric",
        "index": "18",
        "is_ignore": "false",
        "is_row_identifier": "false",
        "is_target": "false",
        "name": "LLS_02",
        "number_of_missing_values": "0"
      },
      {
        "data_type": "numeric",
        "index": "19",
        "is_ignore": "false",
        "is_row_identifier": "false",
        "is_target": "false",
        "name": "SpMaxA_AEA.dm.",
        "number_of_missing_values": "0"
      },
      {
        "data_type": "numeric",
        "index": "20",
        "is_ignore": "false",
        "is_row_identifier": "false",
        "is_target": "false",
        "name": "Chi0_EA.dm.",
        "number_of_missing_values": "0"
      },
      {
        "data_type": "numeric",
        "index": "21",
        "is_ignore": "false",
        "is_row_identifier": "false",
        "is_target": "false",
        "name": "SpMax7_Bh.v.",
        "number_of_missing_values": "0"
      },
      {
        "data_type": "numeric",
        "index": "22",
        "is_ignore": "false",
        "is_row_identifier": "false",
        "is_target": "false",
        "name": "Eig12_AEA.bo.",
        "number_of_missing_values": "0"
      },
      {
        "data_type": "numeric",
        "index": "23",
        "is_ignore": "false",
        "is_row_identifier": "false",
        "is_target": "false",
        "name": "Eig14_AEA.ed.",
        "number_of_missing_values": "0"
      },
      {
        "data_type": "numeric",
        "index": "24",
        "is_ignore": "false",
        "is_row_identifier": "false",
        "is_target": "false",
        "name": "ATS7s",
        "number_of_missing_values": "0"
      },
      {
        "data_type": "numeric",
        "index": "25",
        "is_ignore": "false",
        "is_row_identifier": "false",
        "is_target": "false",
        "name": "N.072",
        "number_of_missing_values": "0"
      },
      {
        "data_type": "numeric",
        "index": "26",
        "is_ignore": "false",
        "is_row_identifier": "false",
        "is_target": "false",
        "name": "SpMax4_Bh.v.",
        "number_of_missing_values": "0"
      },
      {
        "data_type": "numeric",
        "index": "27",
        "is_ignore": "false",
        "is_row_identifier": "false",
        "is_target": "false",
        "name": "SpMin8_Bh.m.",
        "number_of_missing_values": "0"
      },
      {
        "data_type": "numeric",
        "index": "28",
        "is_ignore": "false",
        "is_row_identifier": "false",
        "is_target": "false",
        "name": "ATS2m",
        "number_of_missing_values": "0"
      },
      {
        "data_type": "numeric",
        "index": "29",
        "is_ignore": "false",
        "is_row_identifier": "false",
        "is_target": "false",
        "name": "Neoplastic.80",
        "number_of_missing_values": "0"
      },
      {
        "data_type": "numeric",
        "index": "30",
        "is_ignore": "false",
        "is_row_identifier": "false",
        "is_target": "false",
        "name": "Psychotic.80",
        "number_of_missing_values": "0"
      },
      {
        "data_type": "numeric",
        "index": "31",
        "is_ignore": "false",
        "is_row_identifier": "false",
        "is_target": "false",
        "name": "SpMin6_Bh.i.",
        "number_of_missing_values": "0"
      },
      {
        "data_type": "numeric",
        "index": "32",
        "is_ignore": "false",
        "is_row_identifier": "false",
        "is_target": "false",
        "name": "Eig06_AEA.bo.",
        "number_of_missing_values": "0"
      },
      {
        "data_type": "numeric",
        "index": "33",
        "is_ignore": "false",
        "is_row_identifier": "false",
        "is_target": "false",
        "name": "X2sol",
        "number_of_missing_values": "0"
      },
      {
        "data_type": "numeric",
        "index": "34",
        "is_ignore": "false",
        "is_row_identifier": "false",
        "is_target": "false",
        "name": "SpMin3_Bh.v.",
        "number_of_missing_values": "0"
      },
      {
        "data_type": "numeric",
        "index": "35",
        "is_ignore": "false",
        "is_row_identifier": "false",
        "is_target": "false",
        "name": "Hypertens.80",
        "number_of_missing_values": "0"
      },
      {
        "data_type": "numeric",
        "index": "36",
        "is_ignore": "false",
        "is_row_identifier": "false",
        "is_target": "false",
        "name": "SM03_AEA.bo.",
        "number_of_missing_values": "0"
      },
      {
        "data_type": "numeric",
        "index": "37",
        "is_ignore": "false",
        "is_row_identifier": "false",
        "is_target": "false",
        "name": "Eig06_EA.ed.",
        "number_of_missing_values": "0"
      },
      {
        "data_type": "numeric",
        "index": "38",
        "is_ignore": "false",
        "is_row_identifier": "false",
        "is_target": "false",
        "name": "SM15_AEA.dm.",
        "number_of_missing_values": "0"
      },
      {
        "data_type": "numeric",
        "index": "39",
        "is_ignore": "false",
        "is_row_identifier": "false",
        "is_target": "false",
        "name": "SpMin7_Bh.e.",
        "number_of_missing_values": "0"
      },
      {
        "data_type": "numeric",
        "index": "40",
        "is_ignore": "false",
        "is_row_identifier": "false",
        "is_target": "false",
        "name": "SpMin6_Bh.e.",
        "number_of_missing_values": "0"
      },
      {
        "data_type": "numeric",
        "index": "41",
        "is_ignore": "false",
        "is_row_identifier": "false",
        "is_target": "false",
        "name": "DLS_06",
        "number_of_missing_values": "0"
      },
      {
        "data_type": "numeric",
        "index": "42",
        "is_ignore": "false",
        "is_row_identifier": "false",
        "is_target": "false",
        "name": "SpMin4_Bh.i.",
        "number_of_missing_values": "0"
      },
      {
        "data_type": "numeric",
        "index": "43",
        "is_ignore": "false",
        "is_row_identifier": "false",
        "is_target": "false",
        "name": "SpMin4_Bh.e.",
        "number_of_missing_values": "0"
      },
      {
        "data_type": "numeric",
        "index": "44",
        "is_ignore": "false",
        "is_row_identifier": "false",
        "is_target": "false",
        "name": "SpMin6_Bh.m.",
        "number_of_missing_values": "0"
      },
      {
        "data_type": "numeric",
        "index": "45",
        "is_ignore": "false",
        "is_row_identifier": "false",
        "is_target": "false",
        "name": "ATSC6v",
        "number_of_missing_values": "0"
      },
      {
        "data_type": "numeric",
        "index": "46",
        "is_ignore": "false",
        "is_row_identifier": "false",
        "is_target": "false",
        "name": "SpMin6_Bh.v.",
        "number_of_missing_values": "0"
      },
      {
        "data_type": "numeric",
        "index": "47",
        "is_ignore": "false",
        "is_row_identifier": "false",
        "is_target": "false",
        "name": "SpMax4_Bh.p.",
        "number_of_missing_values": "0"
      },
      {
        "data_type": "numeric",
        "index": "48",
        "is_ignore": "false",
        "is_row_identifier": "false",
        "is_target": "false",
        "name": "P_VSA_e_3",
        "number_of_missing_values": "0"
      },
      {
        "data_type": "numeric",
        "index": "49",
        "is_ignore": "false",
        "is_row_identifier": "false",
        "is_target": "false",
        "name": "P_VSA_p_1",
        "number_of_missing_values": "0"
      },
      {
        "data_type": "numeric",
        "index": "50",
        "is_ignore": "false",
        "is_row_identifier": "false",
        "is_target": "false",
        "name": "GGI6",
        "number_of_missing_values": "0"
      },
      {
        "data_type": "numeric",
        "index": "51",
        "is_ignore": "false",
        "is_row_identifier": "false",
        "is_target": "false",
        "name": "Mi",
        "number_of_missing_values": "0"
      },
      {
        "data_type": "numeric",
        "index": "52",
        "is_ignore": "false",
        "is_row_identifier": "false",
        "is_target": "false",
        "name": "nH",
        "number_of_missing_values": "0"
      },
      {
        "data_type": "numeric",
        "index": "53",
        "is_ignore": "false",
        "is_row_identifier": "false",
        "is_target": "false",
        "name": "MAXDP",
        "number_of_missing_values": "0"
      },
      {
        "data_type": "numeric",
        "index": "54",
        "is_ignore": "false",
        "is_row_identifier": "false",
        "is_target": "false",
        "name": "P_VSA_e_1",
        "number_of_missing_values": "0"
      },
      {
        "data_type": "numeric",
        "index": "55",
        "is_ignore": "false",
        "is_row_identifier": "false",
        "is_target": "false",
        "name": "P_VSA_m_1",
        "number_of_missing_values": "0"
      },
      {
        "data_type": "numeric",
        "index": "56",
        "is_ignore": "false",
        "is_row_identifier": "false",
        "is_target": "false",
        "name": "P_VSA_s_2",
        "number_of_missing_values": "0"
      },
      {
        "data_type": "numeric",
        "index": "57",
        "is_ignore": "false",
        "is_row_identifier": "false",
        "is_target": "false",
        "name": "P_VSA_v_1",
        "number_of_missing_values": "0"
      },
      {
        "data_type": "numeric",
        "index": "58",
        "is_ignore": "false",
        "is_row_identifier": "false",
        "is_target": "false",
        "name": "GGI7",
        "number_of_missing_values": "0"
      },
      {
        "data_type": "numeric",
        "index": "59",
        "is_ignore": "false",
        "is_row_identifier": "false",
        "is_target": "false",
        "name": "C.040",
        "number_of_missing_values": "0"
      },
      {
        "data_type": "numeric",
        "index": "60",
        "is_ignore": "false",
        "is_row_identifier": "false",
        "is_target": "false",
        "name": "D.Dtr06",
        "number_of_missing_values": "0"
      },
      {
        "data_type": "numeric",
        "index": "61",
        "is_ignore": "false",
        "is_row_identifier": "false",
        "is_target": "false",
        "name": "P_VSA_LogP_7",
        "number_of_missing_values": "0"
      },
      {
        "data_type": "numeric",
        "index": "62",
        "is_ignore": "false",
        "is_row_identifier": "false",
        "is_target": "false",
        "name": "ATSC2m",
        "number_of_missing_values": "0"
      },
      {
        "data_type": "numeric",
        "index": "63",
        "is_ignore": "false",
        "is_row_identifier": "false",
        "is_target": "false",
        "name": "CIC0",
        "number_of_missing_values": "0"
      },
      {
        "data_type": "numeric",
        "index": "64",
        "is_ignore": "false",
        "is_row_identifier": "false",
        "is_target": "false",
        "name": "ZM2Mad",
        "number_of_missing_values": "0"
      },
      {
        "data_type": "numeric",
        "index": "65",
        "is_ignore": "false",
        "is_row_identifier": "false",
        "is_target": "false",
        "name": "DLS_01",
        "number_of_missing_values": "0"
      },
      {
        "data_type": "numeric",
        "index": "66",
        "is_ignore": "false",
        "is_row_identifier": "false",
        "is_target": "false",
        "name": "NssCH2",
        "number_of_missing_values": "0"
      },
      {
        "data_type": "numeric",
        "index": "67",
        "is_ignore": "false",
        "is_row_identifier": "false",
        "is_target": "false",
        "name": "SpMin5_Bh.s.",
        "number_of_missing_values": "0"
      },
      {
        "data_type": "numeric",
        "index": "68",
        "is_ignore": "false",
        "is_row_identifier": "false",
        "is_target": "true",
        "name": "pXC50",
        "number_of_missing_values": "0"
      }
    ]
  }
}