{
  "data_qualities": {
    "quality": [
      {
        "name": "AutoCorrelation",
        "value": "-0.14611439999999876"
      },
      {
        "name": "ClassEntropy",
        "value": []
      },
      {
        "name": "Dimensionality",
        "value": "0.08313349320543566"
      },
      {
        "name": "EquivalentNumberOfAtts",
        "value": []
      },
      {
        "name": "MajorityClassPercentage",
        "value": []
      },
      {
        "name": "MajorityClassSize",
        "value": []
      },
      {
        "name": "MaxAttributeEntropy",
        "value": []
      },
      {
        "name": "MaxKurtosisOfNumericAtts",
        "value": "120.59430287675202"
      },
      {
        "name": "MaxMeansOfNumericAtts",
        "value": "7.625797761790567"
      },
      {
        "name": "MaxMutualInformation",
        "value": []
      },
      {
        "name": "MaxNominalAttDistinctValues",
        "value": []
      },
      {
        "name": "MaxSkewnessOfNumericAtts",
        "value": "11.063521525302923"
      },
      {
        "name": "MaxStdDevOfNumericAtts",
        "value": "1.407356693900657"
      },
      {
        "name": "MeanAttributeEntropy",
        "value": []
      },
      {
        "name": "MeanKurtosisOfNumericAtts",
        "value": "16.203767953392767"
      },
      {
        "name": "MeanMeansOfNumericAtts",
        "value": "0.2960340310276051"
      },
      {
        "name": "MeanMutualInformation",
        "value": []
      },
      {
        "name": "MeanNoiseToSignalRatio",
        "value": []
      },
      {
        "name": "MeanNominalAttDistinctValues",
        "value": []
      },
      {
        "name": "MeanSkewnessOfNumericAtts",
        "value": "2.925606123121863"
      },
      {
        "name": "MeanStdDevOfNumericAtts",
        "value": "0.3378852488495041"
      },
      {
        "name": "MinAttributeEntropy",
        "value": []
      },
      {
        "name": "MinKurtosisOfNumericAtts",
        "value": "-1.9996889878077966"
      },
      {
        "name": "MinMeansOfNumericAtts",
        "value": "0.007993605115907255"
      },
      {
        "name": "MinMutualInformation",
        "value": []
      },
      {
        "name": "MinNominalAttDistinctValues",
        "value": []
      },
      {
        "name": "MinSkewnessOfNumericAtts",
        "value": "-1.4660005672258938"
      },
      {
        "name": "MinStdDevOfNumericAtts",
        "value": "0.089084516943588"
      },
      {
        "name": "MinorityClassPercentage",
        "value": []
      },
      {
        "name": "MinorityClassSize",
        "value": []
      },
      {
        "name": "NumberOfBinaryFeatures",
        "value": "0.0"
      },
      {
        "name": "NumberOfClasses",
        "value": "0.0"
      },
      {
        "name": "NumberOfFeatures",
        "value": "104.0"
      },
      {
        "name": "NumberOfInstances",
        "value": "1251.0"
      },
      {
        "name": "NumberOfInstancesWithMissingValues",
        "value": "0.0"
      },
      {
        "name": "NumberOfMissingValues",
        "value": "0.0"
      },
      {
        "name": "NumberOfNumericFeatures",
        "value": "103.0"
      },
      {
        "name": "NumberOfSymbolicFeatures",
        "value": "1.0"
      },
      {
        "name": "PercentageOfBinaryFeatures",
        "value": "0.0"
      },
      {
        "name": "PercentageOfInstancesWithMissingValues",
        "value": "0.0"
      },
      {
        "name": "PercentageOfMissingValues",
        "value": "0.0"
      },
      {
        "name": "PercentageOfNumericFeatures",
        "value": "99.03846153846155"
      },
      {
        "name": "PercentageOfSymbolicFeatures",
        "value": "0.9615384615384616"
      },
      {
        "name": "Quartile1AttributeEntropy",
        "value": []
      },
      {
        "name": "Quartile1KurtosisOfNumericAtts",
        "value": "-1.045278201522431"
      },
      {
        "name": "Quartile1MeansOfNumericAtts",
        "value": "0.0319744204636291"
      },
      {
        "name": "Quartile1MutualInformation",
        "value": []
      },
      {
        "name": "Quartile1SkewnessOfNumericAtts",
        "value": "0.44088564714798195"
      },
      {
        "name": "Quartile1StdDevOfNumericAtts",
        "value": "0.17600232539703267"
      },
      {
        "name": "Quartile2AttributeEntropy",
        "value": []
      },
      {
        "name": "Quartile2KurtosisOfNumericAtts",
        "value": "0.7404413234156517"
      },
      {
        "name": "Quartile2MeansOfNumericAtts",
        "value": "0.18145483613109484"
      },
      {
        "name": "Quartile2MutualInformation",
        "value": []
      },
      {
        "name": "Quartile2SkewnessOfNumericAtts",
        "value": "1.655071031934369"
      },
      {
        "name": "Quartile2StdDevOfNumericAtts",
        "value": "0.3855487021876713"
      },
      {
        "name": "Quartile3AttributeEntropy",
        "value": []
      },
      {
        "name": "Quartile3KurtosisOfNumericAtts",
        "value": "26.41829349111036"
      },
      {
        "name": "Quartile3MeansOfNumericAtts",
        "value": "0.39248601119104765"
      },
      {
        "name": "Quartile3MutualInformation",
        "value": []
      },
      {
        "name": "Quartile3SkewnessOfNumericAtts",
        "value": "5.326918481997927"
      },
      {
        "name": "Quartile3StdDevOfNumericAtts",
        "value": "0.4506238681024321"
      },
      {
        "name": "StdvNominalAttDistinctValues",
        "value": []
      }
    ]
  }
}