"molecule_id","AMW","C.","H.","Me","Mi","Mp","Mv","MW","N.","nAB","nAT","nB","nBM","nBO","nBR","nBT","nC","nCL","nCsp","nCsp2","nCsp3","nDB","nF","nH","nHet","nHM","nI","nN","nO","nP","nS","nSK","nTB","nX","O.","RBF","RBN","SCBO","Se","Si","Sp","Sv","X.","pXC50"
{1 5.415,2 29.7,3 62.2,4 0.984,5 1.149,6 0.578,7 0.521,8 400.71,9 4.1,11 74,13 2,14 27,16 73,17 22,20 2,21 20,22 2,24 46,25 6,28 3,29 3,32 28,35 4.1,36 0.247,37 18,38 29,39 72.785,40 85.05,41 42.751,42 38.535,44 6.796}
{0 CHEMBL1231507,1 5.33,2 30.7,3 62.7,4 0.981,5 1.146,6 0.58,7 0.521,8 399.72,9 2.7,11 75,13 2,14 27,16 74,17 23,20 2,21 21,22 2,24 47,25 5,28 2,29 3,32 28,35 4,36 0.257,37 19,38 29,39 73.567,40 85.967,41 43.506,42 39.04,44 6.854}
{0 CHEMBL1232077,1 7.961,2 38.1,3 42.9,4 1.029,5 1.133,6 0.639,7 0.632,8 167.18,9 4.8,10 6,11 21,13 7,14 12,16 21,17 8,20 7,21 1,22 1,24 9,25 4,28 1,29 3,32 12,35 14.3,36 0.095,37 2,38 16,39 21.618,40 23.787,41 13.415,42 13.273,44 4}
{0 CHEMBL129918,1 9.23,2 44.4,3 33.3,4 1.053,5 1.116,6 0.672,7 0.691,8 166.14,10 6,11 18,13 8,14 12,16 18,17 8,20 8,22 2,24 6,25 4,29 4,32 12,35 22.2,36 0.111,37 2,38 17,39 18.96,40 20.083,41 12.102,42 12.44,44 4}
{0 CHEMBL203266,1 6.497,2 34.1,3 53.7,4 1.001,5 1.141,6 0.609,7 0.572,8 266.38,9 4.9,10 6,11 41,13 6,14 20,16 42,17 14,20 6,21 8,24 22,25 5,28 2,29 3,32 19,35 7.3,36 0.119,37 5,38 23,39 41.022,40 46.777,41 24.989,42 23.455,44 4}
{0 CHEMBL2114397,1 5.759,2 25,3 60.7,4 0.999,5 1.162,6 0.558,7 0.515,8 161.26,9 7.1,11 28,13 1,14 10,16 27,17 7,20 1,21 6,22 1,24 17,25 4,28 2,29 2,32 11,35 7.1,36 0.148,37 4,38 11,39 27.985,40 32.529,41 15.631,42 14.423,44 5.409}
{0 CHEMBL2216771,1 9.01,2 47.4,3 36.8,4 1.024,5 1.102,6 0.717,7 0.696,8 342.39,10 16,11 38,13 18,14 26,16 40,17 18,20 16,21 2,22 2,24 14,25 6,26 1,29 5,31 1,32 24,35 13.2,36 0.175,37 7,38 36,39 38.898,40 41.873,41 27.25,42 26.449,44 5.328}
{0 CHEMBL2216774,1 7.907,2 43.8,3 43.8,4 1,5 1.116,6 0.696,7 0.655,8 379.52,9 6.3,10 17,11 48,13 18,14 30,16 51,17 21,20 15,21 6,22 1,24 21,25 6,26 1,28 3,29 2,31 1,32 27,35 4.2,36 0.098,37 5,38 39.5,39 47.989,40 53.571,41 33.426,42 31.422,44 5.319}
{0 CHEMBL2216777,1 8.108,2 42.6,3 42.6,4 1.014,5 1.117,6 0.681,7 0.653,8 494.61,9 3.3,10 18,11 61,13 22,14 38,16 64,17 26,20 20,21 6,22 4,24 26,25 9,26 1,28 2,29 6,31 1,32 35,35 9.8,36 0.109,37 7,38 51,39 61.847,40 68.155,41 41.523,42 39.84,44 5.553}
{0 CHEMBL2216778,1 9.829,2 43.4,3 34,4 1.045,5 1.121,6 0.707,7 0.702,8 520.95,9 3.8,10 18,11 53,13 22,14 38,16 56,17 23,18 1,20 20,21 3,22 4,23 1,24 18,25 12,26 2,28 2,29 7,31 1,32 35,34 2,35 13.2,36 0.107,37 6,38 51,39 55.36,40 59.403,41 37.489,42 37.185,43 3.8,44 4}
{0 CHEMBL2216779,1 9.365,2 44.2,3 36.5,4 1.029,5 1.113,6 0.713,7 0.694,8 486.96,9 3.8,10 18,11 52,13 22,14 36,16 55,17 23,18 1,20 20,21 3,22 4,24 19,25 10,26 2,28 2,29 6,31 1,32 33,34 1,35 11.5,36 0.109,37 6,38 49,39 53.52,40 57.854,41 37.097,42 36.087,43 1.9,44 6.131}
{0 CHEMBL2216785,1 6.117,2 32.4,3 56.8,4 0.996,5 1.144,6 0.596,7 0.553,8 452.69,9 4.1,10 6,11 74,13 8,14 32,16 74,17 24,20 8,21 16,22 2,24 42,25 8,28 3,29 5,32 32,35 6.8,36 0.23,37 17,38 37,39 73.672,40 84.638,41 44.137,42 40.911,44 5.268}
{0 CHEMBL48257,1 5.415,2 31.1,3 62.2,4 0.984,5 1.144,6 0.58,7 0.523,8 400.7,9 1.4,11 74,13 1,14 28,16 74,17 23,20 1,21 22,22 1,24 46,25 5,28 1,29 4,32 28,35 5.4,36 0.216,37 16,38 29,39 72.792,40 84.678,41 42.955,42 38.734,44 5.465}
{0 CHEMBL633,1 10.756,2 41.7,3 48.3,4 0.991,5 1.113,6 0.735,7 0.645,8 645.35,9 1.7,10 16,11 60,13 17,14 33,16 62,17 25,20 15,21 10,22 1,24 29,25 6,26 2,27 2,28 1,29 3,32 31,34 2,35 5,36 0.177,37 11,38 42,39 59.476,40 66.796,41 44.108,42 38.701,43 3.3,44 4}
{0 CHEMBL75880,1 5.046,2 34.5,3 63.6,4 0.966,5 1.137,6 0.599,7 0.527,8 277.55,9 1.8,11 55,14 22,16 57,17 19,21 19,24 35,25 1,28 1,32 20,36 0.07,37 4,38 22,39 53.123,40 62.557,41 32.95,42 28.977,44 4.138}
