{
  "data_features": {
    "feature": [
      {
        "data_type": "nominal",
        "index": "0",
        "is_ignore": "false",
        "is_row_identifier": "true",
        "is_target": "false",
        "name": "molecule_id",
        "nominal_value": [
          "CHEMBL104369",
          "CHEMBL104675",
          "CHEMBL105006",
          "CHEMBL105283",
          "CHEMBL113816",
          "CHEMBL113999",
          "CHEMBL114058",
          "CHEMBL114354",
          "CHEMBL114833",
          "CHEMBL114839",
          "CHEMBL115427",
          "CHEMBL115428",
          "CHEMBL115474",
          "CHEMBL115787",
          "CHEMBL115804",
          "CHEMBL1160541",
          "CHEMBL116183",
          "CHEMBL116200",
          "CHEMBL116322",
          "CHEMBL116376",
          "CHEMBL116570",
          "CHEMBL116637",
          "CHEMBL116650",
          "CHEMBL116815",
          "CHEMBL116816",
          "CHEMBL116828",
          "CHEMBL116993",
          "CHEMBL117105",
          "CHEMBL117390",
          "CHEMBL117584",
          "CHEMBL117749",
          "CHEMBL117750",
          "CHEMBL117848",
          "CHEMBL118032",
          "CHEMBL1181",
          "CHEMBL118229",
          "CHEMBL118237",
          "CHEMBL118262",
          "CHEMBL118367",
          "CHEMBL118414",
          "CHEMBL118456",
          "CHEMBL118480",
          "CHEMBL118515",
          "CHEMBL118548",
          "CHEMBL118560",
          "CHEMBL118561",
          "CHEMBL118594",
          "CHEMBL118597",
          "CHEMBL118649",
          "CHEMBL118751",
          "CHEMBL118761",
          "CHEMBL118877",
          "CHEMBL118909",
          "CHEMBL119",
          "CHEMBL119068",
          "CHEMBL119080",
          "CHEMBL119101",
          "CHEMBL119204",
          "CHEMBL119206",
          "CHEMBL119230",
          "CHEMBL119302",
          "CHEMBL119326",
          "CHEMBL119378",
          "CHEMBL119403",
          "CHEMBL119421",
          "CHEMBL119476",
          "CHEMBL119503",
          "CHEMBL119583",
          "CHEMBL119601",
          "CHEMBL119640",
          "CHEMBL119762",
          "CHEMBL119777",
          "CHEMBL119891",
          "CHEMBL119902",
          "CHEMBL119948",
          "CHEMBL120034",
          "CHEMBL120348",
          "CHEMBL120366",
          "CHEMBL120368",
          "CHEMBL120572",
          "CHEMBL120807",
          "CHEMBL120920",
          "CHEMBL122122",
          "CHEMBL122351",
          "CHEMBL122468",
          "CHEMBL122883",
          "CHEMBL123013",
          "CHEMBL1237205",
          "CHEMBL124256",
          "CHEMBL129087",
          "CHEMBL134561",
          "CHEMBL13673",
          "CHEMBL13796",
          "CHEMBL13820",
          "CHEMBL13877",
          "CHEMBL13908",
          "CHEMBL14001",
          "CHEMBL14002",
          "CHEMBL14201",
          "CHEMBL146925",
          "CHEMBL148599",
          "CHEMBL149027",
          "CHEMBL149353",
          "CHEMBL149408",
          "CHEMBL150248",
          "CHEMBL150543",
          "CHEMBL150683",
          "CHEMBL150863",
          "CHEMBL154935",
          "CHEMBL157434",
          "CHEMBL1622",
          "CHEMBL170172",
          "CHEMBL170369",
          "CHEMBL171639",
          "CHEMBL171839",
          "CHEMBL172131",
          "CHEMBL172495",
          "CHEMBL172805",
          "CHEMBL172808",
          "CHEMBL173069",
          "CHEMBL173175",
          "CHEMBL173265",
          "CHEMBL173595",
          "CHEMBL173641",
          "CHEMBL173709",
          "CHEMBL173901",
          "CHEMBL174033",
          "CHEMBL174091",
          "CHEMBL174309",
          "CHEMBL174404",
          "CHEMBL174433",
          "CHEMBL176489",
          "CHEMBL18898",
          "CHEMBL18912",
          "CHEMBL18925",
          "CHEMBL18967",
          "CHEMBL19023",
          "CHEMBL19113",
          "CHEMBL19227",
          "CHEMBL192632",
          "CHEMBL19293",
          "CHEMBL193275",
          "CHEMBL19383",
          "CHEMBL19406",
          "CHEMBL19414",
          "CHEMBL19633",
          "CHEMBL19672",
          "CHEMBL19771",
          "CHEMBL19772",
          "CHEMBL19780",
          "CHEMBL19790",
          "CHEMBL2021342",
          "CHEMBL20911",
          "CHEMBL2092925",
          "CHEMBL213053",
          "CHEMBL213969",
          "CHEMBL213970",
          "CHEMBL214882",
          "CHEMBL215709",
          "CHEMBL216195",
          "CHEMBL217099",
          "CHEMBL217157",
          "CHEMBL217260",
          "CHEMBL217294",
          "CHEMBL217809",
          "CHEMBL22",
          "CHEMBL22146",
          "CHEMBL223279",
          "CHEMBL22434",
          "CHEMBL225071",
          "CHEMBL225072",
          "CHEMBL23250",
          "CHEMBL23338",
          "CHEMBL23384",
          "CHEMBL23447",
          "CHEMBL23609",
          "CHEMBL23746",
          "CHEMBL23960",
          "CHEMBL24155",
          "CHEMBL24374",
          "CHEMBL24430",
          "CHEMBL24503",
          "CHEMBL25817",
          "CHEMBL25888",
          "CHEMBL262030",
          "CHEMBL26337",
          "CHEMBL263732",
          "CHEMBL265493",
          "CHEMBL266611",
          "CHEMBL267499",
          "CHEMBL267692",
          "CHEMBL268414",
          "CHEMBL268914",
          "CHEMBL274031",
          "CHEMBL274430",
          "CHEMBL277176",
          "CHEMBL277391",
          "CHEMBL278345",
          "CHEMBL279273",
          "CHEMBL279455",
          "CHEMBL279509",
          "CHEMBL280374",
          "CHEMBL280378",
          "CHEMBL280884",
          "CHEMBL281760",
          "CHEMBL282022",
          "CHEMBL283279",
          "CHEMBL283459",
          "CHEMBL283515",
          "CHEMBL284821",
          "CHEMBL284851",
          "CHEMBL285045",
          "CHEMBL285209",
          "CHEMBL285448",
          "CHEMBL286400",
          "CHEMBL287241",
          "CHEMBL287481",
          "CHEMBL287553",
          "CHEMBL289904",
          "CHEMBL29143",
          "CHEMBL291540",
          "CHEMBL291721",
          "CHEMBL291931",
          "CHEMBL293013",
          "CHEMBL294377",
          "CHEMBL294655",
          "CHEMBL29712",
          "CHEMBL298955",
          "CHEMBL300114",
          "CHEMBL300545",
          "CHEMBL301030",
          "CHEMBL301236",
          "CHEMBL301629",
          "CHEMBL301769",
          "CHEMBL303075",
          "CHEMBL30734",
          "CHEMBL30932",
          "CHEMBL30937",
          "CHEMBL30938",
          "CHEMBL309713",
          "CHEMBL30999",
          "CHEMBL31055",
          "CHEMBL310759",
          "CHEMBL31235",
          "CHEMBL31249",
          "CHEMBL312688",
          "CHEMBL31351",
          "CHEMBL31402",
          "CHEMBL31462",
          "CHEMBL31487",
          "CHEMBL31547",
          "CHEMBL31619",
          "CHEMBL31713",
          "CHEMBL318078",
          "CHEMBL31887",
          "CHEMBL31891",
          "CHEMBL31912",
          "CHEMBL31924",
          "CHEMBL31946",
          "CHEMBL32039",
          "CHEMBL320596",
          "CHEMBL32063",
          "CHEMBL32067",
          "CHEMBL32113",
          "CHEMBL321942",
          "CHEMBL322001",
          "CHEMBL32266",
          "CHEMBL323889",
          "CHEMBL325434",
          "CHEMBL325482",
          "CHEMBL325533",
          "CHEMBL325717",
          "CHEMBL325907",
          "CHEMBL326184",
          "CHEMBL326245",
          "CHEMBL326266",
          "CHEMBL326377",
          "CHEMBL32708",
          "CHEMBL32793",
          "CHEMBL33045",
          "CHEMBL330799",
          "CHEMBL331292",
          "CHEMBL331415",
          "CHEMBL331685",
          "CHEMBL331701",
          "CHEMBL33208",
          "CHEMBL332237",
          "CHEMBL332254",
          "CHEMBL332292",
          "CHEMBL332325",
          "CHEMBL332481",
          "CHEMBL332515",
          "CHEMBL332518",
          "CHEMBL332543",
          "CHEMBL333022",
          "CHEMBL333024",
          "CHEMBL333295",
          "CHEMBL333424",
          "CHEMBL333695",
          "CHEMBL333696",
          "CHEMBL333752",
          "CHEMBL333852",
          "CHEMBL333951",
          "CHEMBL334021",
          "CHEMBL33815",
          "CHEMBL339058",
          "CHEMBL340759",
          "CHEMBL34259",
          "CHEMBL346871",
          "CHEMBL355793",
          "CHEMBL357960",
          "CHEMBL357973",
          "CHEMBL358879",
          "CHEMBL36",
          "CHEMBL36310",
          "CHEMBL365307",
          "CHEMBL366561",
          "CHEMBL366869",
          "CHEMBL367061",
          "CHEMBL367218",
          "CHEMBL368393",
          "CHEMBL369057",
          "CHEMBL369211",
          "CHEMBL374172",
          "CHEMBL37520",
          "CHEMBL376180",
          "CHEMBL37696",
          "CHEMBL38332",
          "CHEMBL384631",
          "CHEMBL385516",
          "CHEMBL385547",
          "CHEMBL386409",
          "CHEMBL387262",
          "CHEMBL389643",
          "CHEMBL412659",
          "CHEMBL412892",
          "CHEMBL416177",
          "CHEMBL417095",
          "CHEMBL417833",
          "CHEMBL418293",
          "CHEMBL418347",
          "CHEMBL418492",
          "CHEMBL418584",
          "CHEMBL418763",
          "CHEMBL418769",
          "CHEMBL418865",
          "CHEMBL420384",
          "CHEMBL421896",
          "CHEMBL421959",
          "CHEMBL422316",
          "CHEMBL422395",
          "CHEMBL423434",
          "CHEMBL424738",
          "CHEMBL427305",
          "CHEMBL430872",
          "CHEMBL432987",
          "CHEMBL434787",
          "CHEMBL439816",
          "CHEMBL439973",
          "CHEMBL439995",
          "CHEMBL440334",
          "CHEMBL440946",
          "CHEMBL449543",
          "CHEMBL46294",
          "CHEMBL48203",
          "CHEMBL492836",
          "CHEMBL492837",
          "CHEMBL492838",
          "CHEMBL492839",
          "CHEMBL494067",
          "CHEMBL495124",
          "CHEMBL495125",
          "CHEMBL522363",
          "CHEMBL522517",
          "CHEMBL538395",
          "CHEMBL55764",
          "CHEMBL56129",
          "CHEMBL56146",
          "CHEMBL56170",
          "CHEMBL56282",
          "CHEMBL56325",
          "CHEMBL56468",
          "CHEMBL56602",
          "CHEMBL56719",
          "CHEMBL56757",
          "CHEMBL56977",
          "CHEMBL57034",
          "CHEMBL57318",
          "CHEMBL57582",
          "CHEMBL57878",
          "CHEMBL58366",
          "CHEMBL58481",
          "CHEMBL58550",
          "CHEMBL58908",
          "CHEMBL59369",
          "CHEMBL59416",
          "CHEMBL59470",
          "CHEMBL59703",
          "CHEMBL59946",
          "CHEMBL59952",
          "CHEMBL60029",
          "CHEMBL60069",
          "CHEMBL60486",
          "CHEMBL60639",
          "CHEMBL60821",
          "CHEMBL60827",
          "CHEMBL608610",
          "CHEMBL60883",
          "CHEMBL60913",
          "CHEMBL61287",
          "CHEMBL61356",
          "CHEMBL61357",
          "CHEMBL61708",
          "CHEMBL61857",
          "CHEMBL6742",
          "CHEMBL6948",
          "CHEMBL7070",
          "CHEMBL7130",
          "CHEMBL7357",
          "CHEMBL7435",
          "CHEMBL7492",
          "CHEMBL78648",
          "CHEMBL79890",
          "CHEMBL80014",
          "CHEMBL82334",
          "CHEMBL82825",
          "CHEMBL82985",
          "CHEMBL83547",
          "CHEMBL84108",
          "CHEMBL85364"
        ],
        "number_of_missing_values": "0"
      },
      {
        "data_type": "numeric",
        "index": "1",
        "is_ignore": "false",
        "is_row_identifier": "false",
        "is_target": "false",
        "name": "AMW",
        "number_of_missing_values": "0"
      },
      {
        "data_type": "numeric",
        "index": "2",
        "is_ignore": "false",
        "is_row_identifier": "false",
        "is_target": "false",
        "name": "C.",
        "number_of_missing_values": "0"
      },
      {
        "data_type": "numeric",
        "index": "3",
        "is_ignore": "false",
        "is_row_identifier": "false",
        "is_target": "false",
        "name": "H.",
        "number_of_missing_values": "0"
      },
      {
        "data_type": "numeric",
        "index": "4",
        "is_ignore": "false",
        "is_row_identifier": "false",
        "is_target": "false",
        "name": "Me",
        "number_of_missing_values": "0"
      },
      {
        "data_type": "numeric",
        "index": "5",
        "is_ignore": "false",
        "is_row_identifier": "false",
        "is_target": "false",
        "name": "Mi",
        "number_of_missing_values": "0"
      },
      {
        "data_type": "numeric",
        "index": "6",
        "is_ignore": "false",
        "is_row_identifier": "false",
        "is_target": "false",
        "name": "Mp",
        "number_of_missing_values": "0"
      },
      {
        "data_type": "numeric",
        "index": "7",
        "is_ignore": "false",
        "is_row_identifier": "false",
        "is_target": "false",
        "name": "Mv",
        "number_of_missing_values": "0"
      },
      {
        "data_type": "numeric",
        "index": "8",
        "is_ignore": "false",
        "is_row_identifier": "false",
        "is_target": "false",
        "name": "MW",
        "number_of_missing_values": "0"
      },
      {
        "data_type": "numeric",
        "index": "9",
        "is_ignore": "false",
        "is_row_identifier": "false",
        "is_target": "false",
        "name": "N.",
        "number_of_missing_values": "0"
      },
      {
        "data_type": "numeric",
        "index": "10",
        "is_ignore": "false",
        "is_row_identifier": "false",
        "is_target": "false",
        "name": "nAB",
        "number_of_missing_values": "0"
      },
      {
        "data_type": "numeric",
        "index": "11",
        "is_ignore": "false",
        "is_row_identifier": "false",
        "is_target": "false",
        "name": "nAT",
        "number_of_missing_values": "0"
      },
      {
        "data_type": "numeric",
        "index": "12",
        "is_ignore": "false",
        "is_row_identifier": "false",
        "is_target": "false",
        "name": "nB",
        "number_of_missing_values": "0"
      },
      {
        "data_type": "numeric",
        "index": "13",
        "is_ignore": "false",
        "is_row_identifier": "false",
        "is_target": "false",
        "name": "nBM",
        "number_of_missing_values": "0"
      },
      {
        "data_type": "numeric",
        "index": "14",
        "is_ignore": "false",
        "is_row_identifier": "false",
        "is_target": "false",
        "name": "nBO",
        "number_of_missing_values": "0"
      },
      {
        "data_type": "numeric",
        "index": "15",
        "is_ignore": "false",
        "is_row_identifier": "false",
        "is_target": "false",
        "name": "nBR",
        "number_of_missing_values": "0"
      },
      {
        "data_type": "numeric",
        "index": "16",
        "is_ignore": "false",
        "is_row_identifier": "false",
        "is_target": "false",
        "name": "nBT",
        "number_of_missing_values": "0"
      },
      {
        "data_type": "numeric",
        "index": "17",
        "is_ignore": "false",
        "is_row_identifier": "false",
        "is_target": "false",
        "name": "nC",
        "number_of_missing_values": "0"
      },
      {
        "data_type": "numeric",
        "index": "18",
        "is_ignore": "false",
        "is_row_identifier": "false",
        "is_target": "false",
        "name": "nCL",
        "number_of_missing_values": "0"
      },
      {
        "data_type": "numeric",
        "index": "19",
        "is_ignore": "false",
        "is_row_identifier": "false",
        "is_target": "false",
        "name": "nCsp",
        "number_of_missing_values": "0"
      },
      {
        "data_type": "numeric",
        "index": "20",
        "is_ignore": "false",
        "is_row_identifier": "false",
        "is_target": "false",
        "name": "nCsp2",
        "number_of_missing_values": "0"
      },
      {
        "data_type": "numeric",
        "index": "21",
        "is_ignore": "false",
        "is_row_identifier": "false",
        "is_target": "false",
        "name": "nCsp3",
        "number_of_missing_values": "0"
      },
      {
        "data_type": "numeric",
        "index": "22",
        "is_ignore": "false",
        "is_row_identifier": "false",
        "is_target": "false",
        "name": "nDB",
        "number_of_missing_values": "0"
      },
      {
        "data_type": "numeric",
        "index": "23",
        "is_ignore": "false",
        "is_row_identifier": "false",
        "is_target": "false",
        "name": "nF",
        "number_of_missing_values": "0"
      },
      {
        "data_type": "numeric",
        "index": "24",
        "is_ignore": "false",
        "is_row_identifier": "false",
        "is_target": "false",
        "name": "nH",
        "number_of_missing_values": "0"
      },
      {
        "data_type": "numeric",
        "index": "25",
        "is_ignore": "false",
        "is_row_identifier": "false",
        "is_target": "false",
        "name": "nHet",
        "number_of_missing_values": "0"
      },
      {
        "data_type": "numeric",
        "index": "26",
        "is_ignore": "false",
        "is_row_identifier": "false",
        "is_target": "false",
        "name": "nHM",
        "number_of_missing_values": "0"
      },
      {
        "data_type": "numeric",
        "index": "27",
        "is_ignore": "false",
        "is_row_identifier": "false",
        "is_target": "false",
        "name": "nI",
        "number_of_missing_values": "0"
      },
      {
        "data_type": "numeric",
        "index": "28",
        "is_ignore": "false",
        "is_row_identifier": "false",
        "is_target": "false",
        "name": "nN",
        "number_of_missing_values": "0"
      },
      {
        "data_type": "numeric",
        "index": "29",
        "is_ignore": "false",
        "is_row_identifier": "false",
        "is_target": "false",
        "name": "nO",
        "number_of_missing_values": "0"
      },
      {
        "data_type": "numeric",
        "index": "30",
        "is_ignore": "false",
        "is_row_identifier": "false",
        "is_target": "false",
        "name": "nP",
        "number_of_missing_values": "0"
      },
      {
        "data_type": "numeric",
        "index": "31",
        "is_ignore": "false",
        "is_row_identifier": "false",
        "is_target": "false",
        "name": "nS",
        "number_of_missing_values": "0"
      },
      {
        "data_type": "numeric",
        "index": "32",
        "is_ignore": "false",
        "is_row_identifier": "false",
        "is_target": "false",
        "name": "nSK",
        "number_of_missing_values": "0"
      },
      {
        "data_type": "numeric",
        "index": "33",
        "is_ignore": "false",
        "is_row_identifier": "false",
        "is_target": "false",
        "name": "nTB",
        "number_of_missing_values": "0"
      },
      {
        "data_type": "numeric",
        "index": "34",
        "is_ignore": "false",
        "is_row_identifier": "false",
        "is_target": "false",
        "name": "nX",
        "number_of_missing_values": "0"
      },
      {
        "data_type": "numeric",
        "index": "35",
        "is_ignore": "false",
        "is_row_identifier": "false",
        "is_target": "false",
        "name": "O.",
        "number_of_missing_values": "0"
      },
      {
        "data_type": "numeric",
        "index": "36",
        "is_ignore": "false",
        "is_row_identifier": "false",
        "is_target": "false",
        "name": "RBF",
        "number_of_missing_values": "0"
      },
      {
        "data_type": "numeric",
        "index": "37",
        "is_ignore": "false",
        "is_row_identifier": "false",
        "is_target": "false",
        "name": "RBN",
        "number_of_missing_values": "0"
      },
      {
        "data_type": "numeric",
        "index": "38",
        "is_ignore": "false",
        "is_row_identifier": "false",
        "is_target": "false",
        "name": "SCBO",
        "number_of_missing_values": "0"
      },
      {
        "data_type": "numeric",
        "index": "39",
        "is_ignore": "false",
        "is_row_identifier": "false",
        "is_target": "false",
        "name": "Se",
        "number_of_missing_values": "0"
      },
      {
        "data_type": "numeric",
        "index": "40",
        "is_ignore": "false",
        "is_row_identifier": "false",
        "is_target": "false",
        "name": "Si",
        "number_of_missing_values": "0"
      },
      {
        "data_type": "numeric",
        "index": "41",
        "is_ignore": "false",
        "is_row_identifier": "false",
        "is_target": "false",
        "name": "Sp",
        "number_of_missing_values": "0"
      },
      {
        "data_type": "numeric",
        "index": "42",
        "is_ignore": "false",
        "is_row_identifier": "false",
        "is_target": "false",
        "name": "Sv",
        "number_of_missing_values": "0"
      },
      {
        "data_type": "numeric",
        "index": "43",
        "is_ignore": "false",
        "is_row_identifier": "false",
        "is_target": "false",
        "name": "X.",
        "number_of_missing_values": "0"
      },
      {
        "data_type": "numeric",
        "index": "44",
        "is_ignore": "false",
        "is_row_identifier": "false",
        "is_target": "true",
        "name": "pXC50",
        "number_of_missing_values": "0"
      }
    ]
  }
}