{
  "data_set_description": {
    "collection_date": "November 2013",
    "creator": "Dr Jeremy Besnard, Dr Ivan Olier, Dr Noureddin Sadawi, Dr Larisa Soldatova, Dr Crina Grosan, Prof Ross King, Dr Richard Bickerton, Prof Andrew Hopkins and Dr Willem van Hoorn",
    "default_target_attribute": "pXC50",
    "description": "This dataset contains QSAR data (from ChEMBL version 17) showing activity values (unit is pseudo-pCI50) of several compounds on drug target ChEMBL_ID: CHEMBL4789 (TID: 11042), and it has 207 rows and 9 features (not including molecule IDs and class feature: molecule_id and pXC50). The features represent Basic Molecular Descriptors which were generated from SMILES strings. Missing value imputation was applied to this dataset (By choosing the Median). Feature selection was also applied.",
    "description_version": "1",
    "file_id": "3524742",
    "format": "ARFF",
    "id": "34267",
    "licence": "Public",
    "md5_checksum": "e0edbe6bfa762c1d8c83f30320af83ea",
    "minio_url": "https://data.openml.org/datasets/0003/34267/dataset_34267.pq",
    "name": "QSAR-DATASET-FOR-DRUG-TARGET-CHEMBL4789",
    "original_data_url": "https://www.ebi.ac.uk/chembl/target/inspect/CHEMBL4789",
    "parquet_url": "https://data.openml.org/datasets/0003/34267/dataset_34267.pq",
    "processing_date": "2018-10-04 03:47:53",
    "row_id_attribute": "molecule_id",
    "status": "deactivated",
    "tag": [
      "MetaQSAR",
      "study_13"
    ],
    "upload_date": "2016-07-15T14:54:59",
    "url": "https://api.openml.org/data/v1/download/3524742/QSAR-DATASET-FOR-DRUG-TARGET-CHEMBL4789.arff",
    "version": "9",
    "visibility": "public"
  }
}