"molecule_id","AMR","ATS1p","ATS1v","ATS2p","ATS2v","ATS3p","ATS3v","ATS4p","ATS5p","ATS5v","ATS6p","ATS6v","ATS7e","ATS7i","ATS7p","ATS7v","ATS8e","ATS8i","ATS8p","ATS8v","ATSC1v","ATSC2v","ATSC3p","ATSC3v","ATSC4m","ATSC4v","ATSC5m","ATSC5p","ATSC5v","ATSC6p","ATSC6v","ATSC7p","ATSC7v","ATSC8m","ATSC8p","ATSC8v","C.029","CATS2D_02_DA","CATS2D_03_AA","CATS2D_04_AA","CATS2D_05_AL","CATS2D_05_LL","CATS2D_06_AL","CATS2D_07_AL","CATS2D_07_LL","CATS2D_09_AL","CIC0","Eig01_AEA.ri.","Eig01_EA.ri.","Eig06_EA.ri.","Eig08_AEA.ri.","Eig08_EA.ri.","Eig09_AEA.ri.","Eig09_EA.ri.","Eig11_AEA.ri.","Eig11_EA","pXC50"
{1 98.689,2 3.532,3 3.485,4 3.903,5 3.863,6 3.982,7 3.929,8 3.9,9 3.786,10 3.704,11 3.635,12 3.542,13 4.144,14 4.351,15 3.479,16 3.367,17 4.034,18 4.227,19 3.382,20 3.305,21 4.038,22 7.218,23 8.507,24 8.76,25 19.317,26 8.672,27 20.369,28 8.084,29 9.515,30 6.781,31 8.111,32 5.72,33 6.862,34 14.042,35 5.356,36 6.041,38 1,41 1,42 12,43 1,44 3,45 5,46 5,47 3.635,48 4.214,49 3.003,50 1.577,51 2.383,52 1.358,53 2.291,54 1.276,55 1.994,56 1,57 4.301}
{0 CHEMBL493960,1 138.595,2 3.756,3 3.739,4 4.132,5 4.098,6 4.294,7 4.237,8 4.275,9 4.26,10 4.183,11 4.262,12 4.191,13 4.965,14 5.152,15 4.283,16 4.203,17 5.009,18 5.225,19 4.232,20 4.147,21 6.065,22 10.381,23 11.036,24 13.298,25 32.313,26 14.854,27 36.502,28 12.442,29 16.004,30 11.518,31 14.681,32 12.108,33 15.545,34 35.775,35 12.508,36 15.881,38 1,39 2,41 6,42 9,43 2,44 5,45 8,46 9,47 4.187,48 4.223,49 3.143,50 2.145,51 3.017,52 1.871,53 2.625,54 1.601,55 2.231,56 1.247,57 7.523}
{0 CHEMBL494748,1 139.764,2 3.772,3 3.782,4 4.144,5 4.147,6 4.308,7 4.287,8 4.314,9 4.286,10 4.245,11 4.281,12 4.234,13 5.019,14 5.208,15 4.295,16 4.236,17 5.059,18 5.27,19 4.25,20 4.203,21 6.124,22 10.422,23 11.493,24 13.294,25 38.301,26 14.929,27 34.694,28 13.002,29 16,30 12.366,31 14.767,32 12.698,33 15.596,34 33.332,35 12.674,36 15.83,38 1,39 2,41 6,42 9,43 2,44 5,45 7,46 9,47 4.128,48 4.244,49 3.143,50 2.229,51 3.094,52 2.03,53 2.924,54 1.695,55 2.231,56 1.247,57 7.523}
{0 CHEMBL494750,1 135.519,2 3.702,3 3.703,4 4.07,5 4.055,6 4.217,7 4.182,8 4.181,9 4.159,10 4.112,11 4.134,12 4.105,13 4.864,14 5.045,15 4.133,16 4.103,17 4.894,18 5.102,19 4.102,20 4.063,21 5.345,22 9.272,23 9.91,24 11.602,25 29.513,26 12.2,27 32.01,28 10.43,29 13.152,30 9.299,31 11.612,32 9.011,33 11.284,34 28.559,35 9.54,36 11.861,37 1,38 3,39 4,40 2,41 11,43 7,44 11,46 7,47 4.042,48 4.214,49 3.12,50 2.111,51 2.996,52 1.85,53 2.615,54 1.584,55 2.207,56 1.247,57 7.523}
{0 CHEMBL495001,1 128.445,2 3.659,3 3.653,4 4.032,5 4.008,6 4.17,7 4.125,8 4.111,9 4.105,10 4.062,11 4.126,12 4.081,13 4.862,14 5.061,15 4.129,16 4.068,17 4.84,18 5.061,19 4.061,20 3.988,21 4.861,22 8.474,23 9.405,24 11.096,25 28.015,26 11.373,27 28.316,28 9.449,29 11.473,30 9.131,31 11.049,32 9.715,33 12.073,34 28.935,35 9.82,36 12.261,37 2,38 2,39 3,40 2,41 7,42 5,43 5,44 8,45 3,46 6,47 3.962,48 4.214,49 3.12,50 2.049,51 2.831,52 1.786,53 2.307,54 1.294,55 2.217,56 1.244,57 7.523}
{0 CHEMBL495191,1 137.065,2 3.729,3 3.721,4 4.099,5 4.075,6 4.248,7 4.205,8 4.217,9 4.207,10 4.146,11 4.204,12 4.152,13 4.923,14 5.108,15 4.213,16 4.155,17 4.956,18 5.171,19 4.169,20 4.106,21 5.705,22 9.835,23 10.377,24 12.338,25 30.746,26 13.128,27 33.64,28 11.193,29 14.239,30 10.456,31 13.149,32 10.673,33 13.58,34 32.614,35 11.015,36 13.932,37 2,38 2,39 3,40 1,41 9,42 6,43 5,44 8,45 4,46 8,47 4.112,48 4.215,49 3.123,50 2.132,51 3.008,52 1.863,53 2.619,54 1.591,55 2.218,56 1.247,57 7.523}
{0 CHEMBL495194,1 136.752,2 3.729,3 3.721,4 4.101,5 4.077,6 4.26,7 4.214,8 4.239,9 4.215,10 4.15,11 4.196,12 4.145,13 4.909,14 5.093,15 4.209,16 4.153,17 4.95,18 5.159,19 4.168,20 4.106,21 5.705,22 9.756,23 10.43,24 12.359,25 30.693,26 13.763,27 34.993,28 11.681,29 14.927,30 10.37,31 13.146,32 10.452,33 13.263,34 31.872,35 11.035,36 13.829,37 1,38 2,39 3,40 1,41 8,42 3,43 4,44 8,45 4,46 8,47 4.112,48 4.221,49 3.138,50 2.121,51 3.007,52 1.862,53 2.621,54 1.593,55 2.22,56 1.247,57 7.523}
{0 CHEMBL521993,1 128.642,2 3.688,3 3.713,4 4.053,5 4.072,6 4.189,7 4.191,8 4.188,9 4.186,10 4.176,11 4.168,12 4.153,13 4.931,14 5.128,15 4.148,16 4.112,17 4.921,18 5.138,19 4.073,20 4.044,21 5.497,22 9.454,23 10.023,24 11.869,25 30.493,26 12.547,27 29.754,28 10.818,29 13.135,30 10.355,31 12.325,32 10.479,33 13.021,34 28.674,35 10.065,36 13.221,37 2,38 2,39 3,40 2,41 9,42 8,43 6,44 8,45 7,46 9,47 4.057,48 4.216,49 3.124,50 2.265,51 3.053,52 1.997,53 2.604,54 1.572,55 2.097,56 1.12,57 7.523}
{0 CHEMBL523356,1 132.278,2 3.692,3 3.688,4 4.07,5 4.048,6 4.217,7 4.177,8 4.18,9 4.17,10 4.122,11 4.165,12 4.124,13 4.877,14 5.067,15 4.152,16 4.091,17 4.862,18 5.076,19 4.08,20 4.013,21 5.101,22 9.021,23 9.94,24 11.461,25 29.044,26 12.102,27 30.698,28 10.433,29 12.847,30 9.77,31 11.875,32 10.204,33 12.638,34 29.299,35 10.382,36 13.088,37 2,38 2,39 3,40 2,41 9,42 8,43 5,44 8,45 6,46 8,47 4.012,48 4.216,49 3.124,50 2.113,51 3.004,52 1.862,53 2.602,54 1.571,55 2.045,56 1.082,57 7.523}
{0 CHEMBL573829,1 110.082,2 3.539,3 3.562,4 3.902,5 3.917,6 4.047,7 4.037,8 4.048,9 4.019,10 3.971,11 3.963,12 3.902,13 4.773,14 5.006,15 3.905,16 3.86,17 4.697,18 4.892,19 3.837,20 3.831,21 5.215,22 8.861,23 9.026,24 11.433,25 29.671,26 12.082,27 28.415,28 10.207,29 12.944,30 9.613,31 12.682,32 8.997,33 11.955,34 23.005,35 8.141,36 10.137,38 1,39 2,41 1,42 7,43 2,44 4,45 4,46 6,47 3.884,48 4.181,49 3.074,50 2.053,51 2.527,52 1.465,53 2.261,54 1.248,55 2.042,56 1.05,57 4.523}
