"molecule_id","FCFP4_1024b140","FCFP4_1024b555","FCFP4_1024b986","FCFP4_1024b419","FCFP4_1024b942","FCFP4_1024b781","FCFP4_1024b303","FCFP4_1024b507","FCFP4_1024b668","FCFP4_1024b178","FCFP4_1024b826","FCFP4_1024b870","FCFP4_1024b1006","FCFP4_1024b695","FCFP4_1024b800","FCFP4_1024b730","FCFP4_1024b490","FCFP4_1024b669","FCFP4_1024b855","FCFP4_1024b429","FCFP4_1024b971","FCFP4_1024b409","FCFP4_1024b574","FCFP4_1024b925","FCFP4_1024b632","FCFP4_1024b1","FCFP4_1024b10","FCFP4_1024b100","FCFP4_1024b1000","FCFP4_1024b1001","FCFP4_1024b1002","FCFP4_1024b1003","FCFP4_1024b1004","FCFP4_1024b1005","FCFP4_1024b1007","FCFP4_1024b1008","FCFP4_1024b1009","FCFP4_1024b101","FCFP4_1024b1010","FCFP4_1024b1011","FCFP4_1024b1012","FCFP4_1024b1013","FCFP4_1024b1014","FCFP4_1024b1015","FCFP4_1024b1016","FCFP4_1024b1017","FCFP4_1024b1018","FCFP4_1024b1019","FCFP4_1024b102","FCFP4_1024b1020","FCFP4_1024b1021","FCFP4_1024b1022","FCFP4_1024b1023","FCFP4_1024b1024","FCFP4_1024b103","FCFP4_1024b104","FCFP4_1024b105","FCFP4_1024b106","FCFP4_1024b107","FCFP4_1024b108","FCFP4_1024b109","FCFP4_1024b11","FCFP4_1024b110","FCFP4_1024b111","FCFP4_1024b112","FCFP4_1024b113","FCFP4_1024b114","FCFP4_1024b115","FCFP4_1024b116","FCFP4_1024b117","FCFP4_1024b118","FCFP4_1024b119","FCFP4_1024b12","FCFP4_1024b120","FCFP4_1024b121","FCFP4_1024b122","FCFP4_1024b123","FCFP4_1024b124","FCFP4_1024b125","FCFP4_1024b126","FCFP4_1024b127","FCFP4_1024b128","FCFP4_1024b129","FCFP4_1024b13","FCFP4_1024b130","FCFP4_1024b131","FCFP4_1024b132","FCFP4_1024b133","FCFP4_1024b134","FCFP4_1024b135","FCFP4_1024b136","FCFP4_1024b137","FCFP4_1024b138","FCFP4_1024b139","FCFP4_1024b14","FCFP4_1024b141","FCFP4_1024b142","FCFP4_1024b143","FCFP4_1024b144","FCFP4_1024b145","FCFP4_1024b146","FCFP4_1024b147","FCFP4_1024b148","FCFP4_1024b149","FCFP4_1024b15","FCFP4_1024b150","FCFP4_1024b151","FCFP4_1024b152","FCFP4_1024b153","FCFP4_1024b154","FCFP4_1024b155","FCFP4_1024b156","FCFP4_1024b157","FCFP4_1024b158","FCFP4_1024b159","FCFP4_1024b16","FCFP4_1024b160","FCFP4_1024b161","FCFP4_1024b162","FCFP4_1024b163","FCFP4_1024b164","FCFP4_1024b165","FCFP4_1024b166","FCFP4_1024b167","FCFP4_1024b168","FCFP4_1024b169","FCFP4_1024b17","FCFP4_1024b170","FCFP4_1024b171","FCFP4_1024b172","FCFP4_1024b173","FCFP4_1024b174","FCFP4_1024b175","FCFP4_1024b176","FCFP4_1024b177","FCFP4_1024b179","FCFP4_1024b18","FCFP4_1024b180","FCFP4_1024b181","FCFP4_1024b182","FCFP4_1024b183","FCFP4_1024b184","FCFP4_1024b185","FCFP4_1024b186","FCFP4_1024b187","FCFP4_1024b188","FCFP4_1024b189","FCFP4_1024b19","FCFP4_1024b190","FCFP4_1024b191","FCFP4_1024b192","FCFP4_1024b193","FCFP4_1024b194","FCFP4_1024b195","FCFP4_1024b196","FCFP4_1024b197","FCFP4_1024b198","FCFP4_1024b199","FCFP4_1024b2","FCFP4_1024b20","FCFP4_1024b200","FCFP4_1024b201","FCFP4_1024b202","FCFP4_1024b203","FCFP4_1024b204","FCFP4_1024b205","FCFP4_1024b206","FCFP4_1024b207","FCFP4_1024b208","FCFP4_1024b209","FCFP4_1024b21","FCFP4_1024b210","FCFP4_1024b211","FCFP4_1024b212","FCFP4_1024b213","FCFP4_1024b214","FCFP4_1024b215","FCFP4_1024b216","FCFP4_1024b217","FCFP4_1024b218","FCFP4_1024b219","FCFP4_1024b22","FCFP4_1024b220","FCFP4_1024b221","FCFP4_1024b222","FCFP4_1024b223","FCFP4_1024b224","FCFP4_1024b225","FCFP4_1024b226","FCFP4_1024b227","FCFP4_1024b228","FCFP4_1024b229","FCFP4_1024b23","FCFP4_1024b230","FCFP4_1024b231","FCFP4_1024b232","FCFP4_1024b233","FCFP4_1024b234","FCFP4_1024b235","FCFP4_1024b236","FCFP4_1024b237","FCFP4_1024b238","FCFP4_1024b239","FCFP4_1024b24","FCFP4_1024b240","pXC50"
{1 1,2 1,3 1,4 1,5 1,6 1,7 1,8 1,9 1,10 1,11 1,12 1,13 1,14 1,15 1,16 1,17 1,18 1,19 1,20 1,21 1,22 1,23 1,24 1,25 1,26 1,28 1,50 1,59 1,127 1,128 1,137 1,159 1,206 7}
{0 CHEMBL1232702,1 1,2 1,3 1,4 1,5 1,6 1,7 1,8 1,9 1,10 1,11 1,12 1,13 1,14 1,15 1,16 1,17 1,18 1,19 1,20 1,21 1,22 1,23 1,24 1,25 1,26 1,50 1,127 1,128 1,131 1,137 1,159 1,206 7.432}
{0 CHEMBL1413383,25 1,34 1,50 1,94 1,127 1,128 1,137 1,155 1,206 4.102}
{0 CHEMBL1650277,21 1,50 1,90 1,92 1,127 1,128 1,137 1,199 1,206 4.509}
{0 CHEMBL1650282,25 1,29 1,50 1,77 1,85 1,92 1,127 1,128 1,137 1,160 1,199 1,206 4.62}
{0 CHEMBL1650283,20 1,24 1,26 1,50 1,94 1,127 1,128 1,137 1,159 1,204 1,206 4.658}
{0 CHEMBL1650287,11 1,21 1,23 1,24 1,26 1,50 1,92 1,127 1,128 1,137 1,159 1,204 1,206 4.538}
{0 CHEMBL1650288,23 1,24 1,26 1,50 1,94 1,127 1,128 1,137 1,159 1,169 1,204 1,205 1,206 4.051}
{0 CHEMBL1650465,23 1,24 1,26 1,59 1,108 1,119 1,127 1,137 1,159 1,204 1,206 4.032}
{0 CHEMBL1650466,17 1,18 1,24 1,26 1,59 1,108 1,127 1,128 1,131 1,137 1,159 1,204 1,206 5.046}
{0 CHEMBL2177120,1 1,2 1,3 1,4 1,5 1,6 1,7 1,8 1,9 1,10 1,11 1,12 1,13 1,14 1,15 1,16 1,17 1,18 1,19 1,20 1,21 1,22 1,23 1,24 1,25 1,26 1,28 1,48 1,50 1,59 1,127 1,128 1,137 1,159 1,206 7.108}
{0 CHEMBL2178599,4 1,6 1,7 1,8 1,9 1,11 1,12 1,13 1,14 1,15 1,16 1,17 1,18 1,19 1,20 1,21 1,22 1,23 1,24 1,25 1,26 1,28 1,50 1,59 1,106 1,108 1,127 1,128 1,137 1,159 1,206 6.409}
{0 CHEMBL2178600,1 1,2 1,3 1,4 1,5 1,6 1,7 1,8 1,9 1,10 1,11 1,12 1,13 1,14 1,15 1,16 1,17 1,18 1,19 1,20 1,21 1,22 1,23 1,24 1,25 1,26 1,28 1,50 1,59 1,92 1,127 1,128 1,137 1,159 1,206 6.678}
{0 CHEMBL2178601,1 1,2 1,3 1,4 1,5 1,6 1,7 1,8 1,9 1,10 1,11 1,12 1,13 1,14 1,15 1,16 1,17 1,18 1,19 1,20 1,21 1,22 1,23 1,24 1,25 1,26 1,48 1,50 1,91 1,127 1,128 1,131 1,137 1,157 1,159 1,206 7}
{0 CHEMBL2178602,1 1,2 1,3 1,4 1,5 1,6 1,7 1,8 1,9 1,10 1,11 1,12 1,13 1,14 1,15 1,16 1,17 1,18 1,19 1,20 1,21 1,22 1,23 1,24 1,25 1,26 1,50 1,91 1,127 1,128 1,131 1,137 1,159 1,206 7.523}
{0 CHEMBL2178603,1 1,2 1,3 1,4 1,5 1,6 1,7 1,8 1,9 1,10 1,11 1,12 1,13 1,14 1,15 1,16 1,17 1,18 1,19 1,20 1,21 1,22 1,23 1,24 1,25 1,26 1,28 1,50 1,59 1,127 1,128 1,137 1,159 1,206 7.222}
{0 CHEMBL2178604,4 1,6 1,7 1,8 1,9 1,11 1,12 1,13 1,14 1,15 1,16 1,17 1,18 1,19 1,20 1,21 1,22 1,23 1,24 1,25 1,26 1,28 1,50 1,59 1,127 1,128 1,137 1,159 1,162 1,206 5.38}
{0 CHEMBL219544,23 1,24 1,26 1,106 1,108 1,137 1,155 1,159 1,201 1,206 4.569}
{0 CHEMBL318275,10 1,12 1,25 1,50 1,127 1,128 1,137 1,155 1,159 1,206 4.398}
{0 CHEMBL34259,4 1,5 1,6 1,7 1,8 1,9 1,11 1,12 1,16 1,19 1,21 1,22 1,23 1,24 1,25 1,26 1,50 1,127 1,128 1,131 1,137 1,159 1,206 6.745}
{0 CHEMBL432942,24 1,25 1,26 1,50 1,127 1,128 1,137 1,155 1,159 1,206 4.796}
{0 CHEMBL566271,19 1,26 1,36 1,50 1,59 1,127 1,137 1,159 1,206 4.921}
{0 CHEMBL566272,23 1,50 1,109 1,127 1,128 1,137 1,151 1,158 1,159 1,160 1,206 4.569}
{0 CHEMBL566947,19 1,23 1,26 1,50 1,59 1,127 1,128 1,137 1,196 1,206 4.569}
{0 CHEMBL566948,19 1,20 1,26 1,40 1,50 1,109 1,127 1,128 1,129 1,131 1,137 1,159 1,206 6.222}
{0 CHEMBL567351,16 1,21 1,22 1,26 1,45 1,50 1,127 1,128 1,137 1,158 1,160 1,164 1,206 4.569}
{0 CHEMBL567352,22 1,26 1,27 1,45 1,50 1,92 1,127 1,137 1,158 1,160 1,164 1,206 4.569}
{0 CHEMBL567353,22 1,26 1,27 1,45 1,50 1,92 1,105 1,127 1,128 1,137 1,158 1,160 1,164 1,206 4.785}
{0 CHEMBL568202,6 1,7 1,8 1,9 1,11 1,12 1,19 1,22 1,25 1,26 1,50 1,114 1,127 1,137 1,206 6.62}
{0 CHEMBL568414,20 1,22 1,26 1,27 1,45 1,50 1,92 1,105 1,111 1,127 1,128 1,137 1,158 1,159 1,160 1,164 1,206 5.585}
{0 CHEMBL571518,19 1,50 1,127 1,128 1,137 1,206 4.569}
{0 CHEMBL577120,16 1,21 1,22 1,26 1,27 1,45 1,50 1,92 1,127 1,137 1,158 1,160 1,164 1,206 4.569}
{0 CHEMBL577502,5 1,19 1,20 1,26 1,40 1,50 1,82 1,109 1,127 1,128 1,129 1,131 1,137 1,159 1,206 5.569}
{0 CHEMBL577934,5 1,20 1,22 1,26 1,27 1,45 1,50 1,82 1,92 1,105 1,127 1,128 1,137 1,158 1,159 1,160 1,164 1,206 5.469}
{0 CHEMBL578160,22 1,26 1,27 1,45 1,50 1,92 1,105 1,127 1,128 1,137 1,158 1,160 1,164 1,206 4.569}
{0 CHEMBL578168,22 1,24 1,26 1,27 1,31 1,45 1,48 1,50 1,92 1,105 1,127 1,128 1,137 1,158 1,159 1,160 1,164 1,184 1,206 5.377}
{0 CHEMBL578789,19 1,26 1,40 1,50 1,89 1,109 1,127 1,128 1,137 1,159 1,206 4.569}
{0 CHEMBL585,7 1,8 1,9 1,12 1,19 1,22 1,25 1,37 1,50 1,121 1,127 1,128 1,137 1,166 1,206 5.469}
{0 CHEMBL744,20 1,25 1,26 1,50 1,127 1,128 1,137 1,155 1,159 1,206 4.301}
