"molecule_id","AMW","C.","pXC50"
{1 7.009,2 35.4,3 5.699}
{0 CHEMBL1161392,1 7.009,2 35.4,3 4.745}
{0 CHEMBL1161394,1 7.009,2 35.4,3 4.959}
{0 CHEMBL1161395,1 7.009,2 35.4,3 4}
{0 CHEMBL1161396,1 6.987,2 37,3 6.097}
{0 CHEMBL1161397,1 7.148,2 37.2,3 6.155}
{0 CHEMBL1161398,1 7.547,2 35.9,3 6.301}
{0 CHEMBL1161399,1 6.872,2 35.3,3 4.959}
{0 CHEMBL154492,1 7.161,2 36.4,3 6}
{0 CHEMBL157699,1 6.628,2 35.7,3 4.699}
{0 CHEMBL273853,1 7.614,2 39.6,3 8.602}
