"molecule_id","FCFP4_1024b649","FCFP4_1024b1","FCFP4_1024b10","FCFP4_1024b100","FCFP4_1024b1000","FCFP4_1024b1001","FCFP4_1024b1002","FCFP4_1024b1003","FCFP4_1024b1004","FCFP4_1024b1005","FCFP4_1024b1006","FCFP4_1024b1007","FCFP4_1024b1008","FCFP4_1024b1009","FCFP4_1024b101","FCFP4_1024b1010","FCFP4_1024b1011","FCFP4_1024b1012","FCFP4_1024b1013","FCFP4_1024b1014","FCFP4_1024b1015","FCFP4_1024b1016","FCFP4_1024b1017","FCFP4_1024b1018","FCFP4_1024b1019","FCFP4_1024b102","FCFP4_1024b1020","FCFP4_1024b1021","FCFP4_1024b1022","FCFP4_1024b1023","FCFP4_1024b1024","FCFP4_1024b103","FCFP4_1024b104","FCFP4_1024b105","FCFP4_1024b106","FCFP4_1024b107","FCFP4_1024b108","FCFP4_1024b109","FCFP4_1024b11","FCFP4_1024b110","FCFP4_1024b111","FCFP4_1024b112","FCFP4_1024b113","FCFP4_1024b114","FCFP4_1024b115","FCFP4_1024b116","FCFP4_1024b117","FCFP4_1024b118","FCFP4_1024b119","FCFP4_1024b12","FCFP4_1024b120","pXC50"
{2 1,3 1,27 1,52 7.319}
{0 CHEMBL1269384,2 1,3 1,27 1,52 7.638}
{0 CHEMBL1269385,1 1,2 1,3 1,19 1,27 1,52 7.42}
{0 CHEMBL1269386,2 1,3 1,27 1,52 6.983}
{0 CHEMBL1269387,2 1,3 1,27 1,52 6.668}
{0 CHEMBL1269884,2 1,3 1,27 1,52 6.684}
{0 CHEMBL1269885,1 1,2 1,3 1,27 1,52 7.426}
{0 CHEMBL1269992,2 1,3 1,27 1,52 6.301}
{0 CHEMBL1270101,2 1,3 1,27 1,52 7.638}
{0 CHEMBL1270209,2 1,3 1,27 1,52 7.398}
{0 CHEMBL1270303,1 1,2 1,3 1,27 1,52 7.409}
{0 CHEMBL1270400,2 1,3 1,11 1,27 1,52 6.301}
{0 CHEMBL1270401,1 1,2 1,3 1,27 1,52 7.456}
{0 CHEMBL1270493,2 1,3 1,27 1,52 7.77}
{0 CHEMBL1270494,2 1,3 1,27 1,52 7.284}
{0 CHEMBL1270594,2 1,3 1,27 1,52 7.569}
{0 CHEMBL1270595,2 1,3 1,27 1,52 7.658}
{0 CHEMBL1270693,1 1,2 1,3 1,27 1,52 7.456}
{0 CHEMBL1270694,2 1,3 1,27 1,52 7.569}
{0 CHEMBL1270798,1 1,2 1,3 1,27 1,52 7.602}
{0 CHEMBL1270799,2 1,3 1,27 1,52 7.602}
{0 CHEMBL1270900,2 1,3 1,11 1,27 1,52 6.991}
{0 CHEMBL1270901,2 1,3 1,27 1,52 7.536}
{0 CHEMBL1271000,2 1,3 1,27 1,52 7.328}
{0 CHEMBL1271107,2 1,3 1,11 1,27 1,52 7.495}
{0 CHEMBL1271108,2 1,3 1,27 1,52 7.569}
{0 CHEMBL1271207,2 1,3 1,11 1,27 1,52 7.143}
{0 CHEMBL1271208,2 1,3 1,27 1,52 7.509}
{0 CHEMBL1271310,2 1,3 1,11 1,27 1,52 7.167}
{0 CHEMBL1271418,2 1,3 1,27 1,52 6.301}
