{
  "data_set_description": {
    "collection_date": "November 2013",
    "creator": "Dr Jeremy Besnard, Dr Ivan Olier, Dr Noureddin Sadawi, Dr Larisa Soldatova, Dr Crina Grosan, Prof Ross King, Dr Richard Bickerton, Prof Andrew Hopkins and Dr Willem van Hoorn",
    "default_target_attribute": "pXC50",
    "description": "This dataset contains QSAR data (from ChEMBL version 17) showing activity values (unit is pseudo-pCI50) of several compounds on drug target ChEMBL_ID: CHEMBL4898 (TID: 100413), and it has 998 rows and 1386 features (not including molecule IDs and class feature: molecule_id and pXC50). The features represent Molecular Descriptors which were generated from SMILES strings. Missing value imputation was applied to this dataset (By choosing the Median).",
    "description_version": "1",
    "file_id": "3521534",
    "format": "ARFF",
    "id": "34111",
    "licence": "Public",
    "md5_checksum": "9db3e3a0f4a4b022cc50a5047f1fe9f8",
    "minio_url": "https://data.openml.org/datasets/0003/34111/dataset_34111.pq",
    "name": "QSAR-DATASET-FOR-DRUG-TARGET-CHEMBL4898",
    "original_data_url": "https://www.ebi.ac.uk/chembl/target/inspect/CHEMBL4898",
    "parquet_url": "https://data.openml.org/datasets/0003/34111/dataset_34111.pq",
    "processing_date": "2018-10-04 03:40:17",
    "row_id_attribute": "molecule_id",
    "status": "deactivated",
    "tag": [
      "MetaQSAR",
      "study_13"
    ],
    "upload_date": "2016-07-15T14:31:17",
    "url": "https://api.openml.org/data/v1/download/3521534/QSAR-DATASET-FOR-DRUG-TARGET-CHEMBL4898.arff",
    "version": "11",
    "visibility": "public"
  }
}