{
  "data_features": {
    "feature": [
      {
        "data_type": "nominal",
        "index": "0",
        "is_ignore": "false",
        "is_row_identifier": "true",
        "is_target": "false",
        "name": "molecule_id",
        "nominal_value": [
          "CHEMBL10",
          "CHEMBL10188",
          "CHEMBL104",
          "CHEMBL1075735",
          "CHEMBL1076192",
          "CHEMBL1076210",
          "CHEMBL1076245",
          "CHEMBL1076536",
          "CHEMBL1077334",
          "CHEMBL1077335",
          "CHEMBL1078595",
          "CHEMBL1079436",
          "CHEMBL1079437",
          "CHEMBL1079481",
          "CHEMBL1079957",
          "CHEMBL1079958",
          "CHEMBL1080046",
          "CHEMBL1080088",
          "CHEMBL1080293",
          "CHEMBL1080472",
          "CHEMBL1080473",
          "CHEMBL1080717",
          "CHEMBL1080787",
          "CHEMBL1080803",
          "CHEMBL1080982",
          "CHEMBL1081504",
          "CHEMBL1081505",
          "CHEMBL1081687",
          "CHEMBL1081867",
          "CHEMBL1081870",
          "CHEMBL1081957",
          "CHEMBL1082158",
          "CHEMBL1085107",
          "CHEMBL1086579",
          "CHEMBL1087758",
          "CHEMBL1088752",
          "CHEMBL1088874",
          "CHEMBL1089",
          "CHEMBL1089501",
          "CHEMBL1089793",
          "CHEMBL1089865",
          "CHEMBL1089881",
          "CHEMBL1090089",
          "CHEMBL1090479",
          "CHEMBL1091356",
          "CHEMBL10921",
          "CHEMBL1092169",
          "CHEMBL1092238",
          "CHEMBL1092921",
          "CHEMBL1092929",
          "CHEMBL1093469",
          "CHEMBL1093747",
          "CHEMBL1093802",
          "CHEMBL1094348",
          "CHEMBL1094349",
          "CHEMBL1095040",
          "CHEMBL1098230",
          "CHEMBL1098560",
          "CHEMBL1098726",
          "CHEMBL1099323",
          "CHEMBL1099326",
          "CHEMBL1099330",
          "CHEMBL110691",
          "CHEMBL1110",
          "CHEMBL112532",
          "CHEMBL112592",
          "CHEMBL113018",
          "CHEMBL113227",
          "CHEMBL113275",
          "CHEMBL114297",
          "CHEMBL114555",
          "CHEMBL115876",
          "CHEMBL1169660",
          "CHEMBL1169994",
          "CHEMBL1170367",
          "CHEMBL1170725",
          "CHEMBL1171008",
          "CHEMBL1171786",
          "CHEMBL1172744",
          "CHEMBL1173087",
          "CHEMBL1173532",
          "CHEMBL1179",
          "CHEMBL119385",
          "CHEMBL1200324",
          "CHEMBL1200604",
          "CHEMBL1200623",
          "CHEMBL1201146",
          "CHEMBL120426",
          "CHEMBL120797",
          "CHEMBL1209049",
          "CHEMBL1209217",
          "CHEMBL1209322",
          "CHEMBL1209538",
          "CHEMBL1209617",
          "CHEMBL1209685",
          "CHEMBL1209686",
          "CHEMBL1209853",
          "CHEMBL121040",
          "CHEMBL1210434",
          "CHEMBL1210552",
          "CHEMBL1210614",
          "CHEMBL121241",
          "CHEMBL1213341",
          "CHEMBL1214336",
          "CHEMBL1214337",
          "CHEMBL1214338",
          "CHEMBL1214394",
          "CHEMBL1214395",
          "CHEMBL1214396",
          "CHEMBL1214397",
          "CHEMBL1214399",
          "CHEMBL1214447",
          "CHEMBL1214448",
          "CHEMBL1214449",
          "CHEMBL1214450",
          "CHEMBL1214451",
          "CHEMBL1214452",
          "CHEMBL121503",
          "CHEMBL1221",
          "CHEMBL1223751",
          "CHEMBL1224382",
          "CHEMBL1230065",
          "CHEMBL1230122",
          "CHEMBL1231",
          "CHEMBL1232887",
          "CHEMBL1235",
          "CHEMBL1236391",
          "CHEMBL1241546",
          "CHEMBL1241642",
          "CHEMBL1241736",
          "CHEMBL1241738",
          "CHEMBL1241824",
          "CHEMBL1241912",
          "CHEMBL1241913",
          "CHEMBL1241998",
          "CHEMBL1242081",
          "CHEMBL1242167",
          "CHEMBL1242345",
          "CHEMBL1242436",
          "CHEMBL1242533",
          "CHEMBL1242623",
          "CHEMBL1242717",
          "CHEMBL1242904",
          "CHEMBL1243305",
          "CHEMBL1243333",
          "CHEMBL1243335",
          "CHEMBL1243367",
          "CHEMBL1255837",
          "CHEMBL1257215",
          "CHEMBL1257336",
          "CHEMBL1258034",
          "CHEMBL1258035",
          "CHEMBL1258517",
          "CHEMBL1262",
          "CHEMBL1269858",
          "CHEMBL1270269",
          "CHEMBL1270738",
          "CHEMBL1271489",
          "CHEMBL1271960",
          "CHEMBL1272135",
          "CHEMBL1276654",
          "CHEMBL1276946",
          "CHEMBL1276947",
          "CHEMBL1276948",
          "CHEMBL1277126",
          "CHEMBL1277312",
          "CHEMBL1277582",
          "CHEMBL1277677",
          "CHEMBL1277678",
          "CHEMBL1277770",
          "CHEMBL1277935",
          "CHEMBL1287846",
          "CHEMBL1289053",
          "CHEMBL1289283",
          "CHEMBL1289313",
          "CHEMBL1289395",
          "CHEMBL1289396",
          "CHEMBL1289515",
          "CHEMBL1289614",
          "CHEMBL1290004",
          "CHEMBL1290041",
          "CHEMBL1290150",
          "CHEMBL1290155",
          "CHEMBL1290264",
          "CHEMBL1290746",
          "CHEMBL1373",
          "CHEMBL1393",
          "CHEMBL1412368",
          "CHEMBL14276",
          "CHEMBL1428",
          "CHEMBL14460",
          "CHEMBL14563",
          "CHEMBL146826",
          "CHEMBL147587",
          "CHEMBL147806",
          "CHEMBL149750",
          "CHEMBL149808",
          "CHEMBL150146",
          "CHEMBL150278",
          "CHEMBL1504335",
          "CHEMBL150653",
          "CHEMBL150681",
          "CHEMBL150799",
          "CHEMBL150999",
          "CHEMBL151037",
          "CHEMBL151038",
          "CHEMBL151170",
          "CHEMBL151207",
          "CHEMBL151280",
          "CHEMBL151354",
          "CHEMBL151449",
          "CHEMBL151646",
          "CHEMBL151974",
          "CHEMBL1585484",
          "CHEMBL160",
          "CHEMBL162383",
          "CHEMBL1626",
          "CHEMBL1631540",
          "CHEMBL1641613",
          "CHEMBL1642258",
          "CHEMBL164261",
          "CHEMBL1642894",
          "CHEMBL1642895",
          "CHEMBL1642896",
          "CHEMBL1642897",
          "CHEMBL1642906",
          "CHEMBL1642907",
          "CHEMBL1642908",
          "CHEMBL1642912",
          "CHEMBL1642913",
          "CHEMBL1643511",
          "CHEMBL1643512",
          "CHEMBL1643513",
          "CHEMBL1643514",
          "CHEMBL1643880",
          "CHEMBL1643881",
          "CHEMBL1643883",
          "CHEMBL1645462",
          "CHEMBL1649654",
          "CHEMBL1649656",
          "CHEMBL1649667",
          "CHEMBL1649675",
          "CHEMBL1649681",
          "CHEMBL1649682",
          "CHEMBL1649683",
          "CHEMBL1649684",
          "CHEMBL1649685",
          "CHEMBL165",
          "CHEMBL1650404",
          "CHEMBL1650443",
          "CHEMBL1650511",
          "CHEMBL1650645",
          "CHEMBL1650652",
          "CHEMBL1650654",
          "CHEMBL1667925",
          "CHEMBL1667948",
          "CHEMBL1668898",
          "CHEMBL1668909",
          "CHEMBL1671916",
          "CHEMBL1671917",
          "CHEMBL1671918",
          "CHEMBL1671921",
          "CHEMBL1671922",
          "CHEMBL1671936",
          "CHEMBL1672128",
          "CHEMBL1672129",
          "CHEMBL1672131",
          "CHEMBL1672448",
          "CHEMBL1672611",
          "CHEMBL1672627",
          "CHEMBL1672629",
          "CHEMBL1672630",
          "CHEMBL1672632",
          "CHEMBL1672633",
          "CHEMBL1681849",
          "CHEMBL1683577",
          "CHEMBL1684057",
          "CHEMBL1684058",
          "CHEMBL1684059",
          "CHEMBL1688243",
          "CHEMBL1698322",
          "CHEMBL1705230",
          "CHEMBL1738699",
          "CHEMBL1738841",
          "CHEMBL1760005",
          "CHEMBL1760200",
          "CHEMBL1760205",
          "CHEMBL1760206",
          "CHEMBL1760428",
          "CHEMBL1762808",
          "CHEMBL1766005",
          "CHEMBL1766811",
          "CHEMBL1767164",
          "CHEMBL1770317",
          "CHEMBL1770373",
          "CHEMBL1771",
          "CHEMBL1774933",
          "CHEMBL177756",
          "CHEMBL1778481",
          "CHEMBL1778587",
          "CHEMBL1778639",
          "CHEMBL1779512",
          "CHEMBL178090",
          "CHEMBL1782521",
          "CHEMBL1782530",
          "CHEMBL1782531",
          "CHEMBL1784172",
          "CHEMBL178516",
          "CHEMBL178534",
          "CHEMBL178711",
          "CHEMBL178780",
          "CHEMBL178938",
          "CHEMBL179398",
          "CHEMBL1794073",
          "CHEMBL1794074",
          "CHEMBL179529",
          "CHEMBL179621",
          "CHEMBL1796296",
          "CHEMBL1796298",
          "CHEMBL179669",
          "CHEMBL179704",
          "CHEMBL1800137",
          "CHEMBL1800774",
          "CHEMBL1800911",
          "CHEMBL1801060",
          "CHEMBL1801062",
          "CHEMBL1801172",
          "CHEMBL1801233",
          "CHEMBL1801238",
          "CHEMBL1801250",
          "CHEMBL1801364",
          "CHEMBL1801504",
          "CHEMBL1801506",
          "CHEMBL1813067",
          "CHEMBL1813314",
          "CHEMBL1813315",
          "CHEMBL1813316",
          "CHEMBL1813317",
          "CHEMBL1813471",
          "CHEMBL1813472",
          "CHEMBL1813474",
          "CHEMBL1813475",
          "CHEMBL1813476",
          "CHEMBL1813477",
          "CHEMBL1813478",
          "CHEMBL1813484",
          "CHEMBL1818445",
          "CHEMBL1818451",
          "CHEMBL1818452",
          "CHEMBL1818455",
          "CHEMBL1818543",
          "CHEMBL1819090",
          "CHEMBL1821735",
          "CHEMBL1821837",
          "CHEMBL1822515",
          "CHEMBL1822525",
          "CHEMBL1823410",
          "CHEMBL1825089",
          "CHEMBL1825096",
          "CHEMBL1829433",
          "CHEMBL1829472",
          "CHEMBL1829475",
          "CHEMBL1829477",
          "CHEMBL1829485",
          "CHEMBL1830392",
          "CHEMBL1830397",
          "CHEMBL1830424",
          "CHEMBL1831092",
          "CHEMBL1834184",
          "CHEMBL1834345",
          "CHEMBL1834657",
          "CHEMBL1834658",
          "CHEMBL1834659",
          "CHEMBL1834660",
          "CHEMBL1834661",
          "CHEMBL1834662",
          "CHEMBL1834663",
          "CHEMBL1834793",
          "CHEMBL1835113",
          "CHEMBL1835116",
          "CHEMBL1835706",
          "CHEMBL1835772",
          "CHEMBL1835782",
          "CHEMBL1835783",
          "CHEMBL1835784",
          "CHEMBL1835785",
          "CHEMBL1835786",
          "CHEMBL1835787",
          "CHEMBL1835918",
          "CHEMBL1836215",
          "CHEMBL1836317",
          "CHEMBL1837037",
          "CHEMBL1837038",
          "CHEMBL1837040",
          "CHEMBL1837041",
          "CHEMBL186730",
          "CHEMBL188068",
          "CHEMBL189942",
          "CHEMBL1908842",
          "CHEMBL1909048",
          "CHEMBL1909049",
          "CHEMBL1909050",
          "CHEMBL1909051",
          "CHEMBL1909725",
          "CHEMBL1909985",
          "CHEMBL1909986",
          "CHEMBL1909987",
          "CHEMBL1911194",
          "CHEMBL1915274",
          "CHEMBL1915282",
          "CHEMBL1915283",
          "CHEMBL1915284",
          "CHEMBL1915481",
          "CHEMBL1916282",
          "CHEMBL1916288",
          "CHEMBL1916399",
          "CHEMBL1916559",
          "CHEMBL1917464",
          "CHEMBL1917468",
          "CHEMBL1917511",
          "CHEMBL1921961",
          "CHEMBL1921976",
          "CHEMBL19224",
          "CHEMBL1922660",
          "CHEMBL1923502",
          "CHEMBL1923642",
          "CHEMBL1923729",
          "CHEMBL1923983",
          "CHEMBL192530",
          "CHEMBL1927147",
          "CHEMBL1928092",
          "CHEMBL1928095",
          "CHEMBL1928243",
          "CHEMBL1929387",
          "CHEMBL1934424",
          "CHEMBL1934426",
          "CHEMBL1934523",
          "CHEMBL1935100",
          "CHEMBL1935111",
          "CHEMBL1935114",
          "CHEMBL1935416",
          "CHEMBL1935601",
          "CHEMBL193647",
          "CHEMBL1939222",
          "CHEMBL1940296",
          "CHEMBL1940308",
          "CHEMBL1940315",
          "CHEMBL1944698",
          "CHEMBL1945843",
          "CHEMBL1949930",
          "CHEMBL1950351",
          "CHEMBL1950643",
          "CHEMBL1950743",
          "CHEMBL1951055",
          "CHEMBL1951778",
          "CHEMBL1951914",
          "CHEMBL1952142",
          "CHEMBL195217",
          "CHEMBL195561",
          "CHEMBL1955989",
          "CHEMBL1956397",
          "CHEMBL1957350",
          "CHEMBL1957816",
          "CHEMBL196321",
          "CHEMBL196945",
          "CHEMBL196947",
          "CHEMBL197140",
          "CHEMBL197202",
          "CHEMBL2001019",
          "CHEMBL2010836",
          "CHEMBL2010872",
          "CHEMBL2010880",
          "CHEMBL2010883",
          "CHEMBL2011266",
          "CHEMBL2012228",
          "CHEMBL2012951",
          "CHEMBL2012958",
          "CHEMBL2013012",
          "CHEMBL2013045",
          "CHEMBL2013050",
          "CHEMBL2013051",
          "CHEMBL2013052",
          "CHEMBL2013053",
          "CHEMBL2013195",
          "CHEMBL2017281",
          "CHEMBL2018903",
          "CHEMBL2018904",
          "CHEMBL2018905",
          "CHEMBL2018906",
          "CHEMBL2018907",
          "CHEMBL2018908",
          "CHEMBL2018909",
          "CHEMBL2018910",
          "CHEMBL2018911",
          "CHEMBL2018912",
          "CHEMBL2018913",
          "CHEMBL2018914",
          "CHEMBL2018915",
          "CHEMBL2018916",
          "CHEMBL2018917",
          "CHEMBL2018918",
          "CHEMBL2018919",
          "CHEMBL2018920",
          "CHEMBL2018921",
          "CHEMBL2018922",
          "CHEMBL2018923",
          "CHEMBL2018924",
          "CHEMBL2018925",
          "CHEMBL2018926",
          "CHEMBL2019022",
          "CHEMBL2019023",
          "CHEMBL2019024",
          "CHEMBL2019025",
          "CHEMBL2019026",
          "CHEMBL2021577",
          "CHEMBL2021582",
          "CHEMBL2021600",
          "CHEMBL2022495",
          "CHEMBL2022570",
          "CHEMBL2022571",
          "CHEMBL2022739",
          "CHEMBL2022995",
          "CHEMBL2022996",
          "CHEMBL2022997",
          "CHEMBL202376",
          "CHEMBL2023802",
          "CHEMBL2023803",
          "CHEMBL2029351",
          "CHEMBL2029422",
          "CHEMBL2029645",
          "CHEMBL2029648",
          "CHEMBL2029649",
          "CHEMBL2029651",
          "CHEMBL2029652",
          "CHEMBL2029653",
          "CHEMBL2029654",
          "CHEMBL2029655",
          "CHEMBL2029988",
          "CHEMBL2030386",
          "CHEMBL2030402",
          "CHEMBL2031470",
          "CHEMBL2035185",
          "CHEMBL203567",
          "CHEMBL2036017",
          "CHEMBL2036030",
          "CHEMBL2036203",
          "CHEMBL2036210",
          "CHEMBL2036213",
          "CHEMBL2036217",
          "CHEMBL2036220",
          "CHEMBL2036222",
          "CHEMBL2036223",
          "CHEMBL2036225",
          "CHEMBL2036268",
          "CHEMBL2036270",
          "CHEMBL2036273",
          "CHEMBL2036635",
          "CHEMBL2036643",
          "CHEMBL2036653",
          "CHEMBL2036730",
          "CHEMBL2037511",
          "CHEMBL2037604",
          "CHEMBL2037608",
          "CHEMBL2042239",
          "CHEMBL2043240",
          "CHEMBL2043437",
          "CHEMBL2048293",
          "CHEMBL2057282",
          "CHEMBL2057285",
          "CHEMBL2058833",
          "CHEMBL2059515",
          "CHEMBL2059906",
          "CHEMBL206096",
          "CHEMBL2069316",
          "CHEMBL2069398",
          "CHEMBL2069799",
          "CHEMBL2069800",
          "CHEMBL2069801",
          "CHEMBL2069802",
          "CHEMBL2069803",
          "CHEMBL2069804",
          "CHEMBL2069805",
          "CHEMBL2069806",
          "CHEMBL2069921",
          "CHEMBL207012",
          "CHEMBL2070131",
          "CHEMBL2070133",
          "CHEMBL2070134",
          "CHEMBL2070137",
          "CHEMBL2070138",
          "CHEMBL2070139",
          "CHEMBL2070140",
          "CHEMBL2070141",
          "CHEMBL2070142",
          "CHEMBL2070143",
          "CHEMBL2070146",
          "CHEMBL2070147",
          "CHEMBL2070148",
          "CHEMBL2070149",
          "CHEMBL2070150",
          "CHEMBL2070151",
          "CHEMBL2070152",
          "CHEMBL2070153",
          "CHEMBL2070154",
          "CHEMBL2070155",
          "CHEMBL2070156",
          "CHEMBL2070157",
          "CHEMBL2070158",
          "CHEMBL2070159",
          "CHEMBL2070160",
          "CHEMBL2070161",
          "CHEMBL2070162",
          "CHEMBL2070163",
          "CHEMBL207028",
          "CHEMBL207071",
          "CHEMBL2070937",
          "CHEMBL2070947",
          "CHEMBL2070948",
          "CHEMBL2070949",
          "CHEMBL207881",
          "CHEMBL207987",
          "CHEMBL2086690",
          "CHEMBL208787",
          "CHEMBL2089032",
          "CHEMBL209689",
          "CHEMBL2103774",
          "CHEMBL210514",
          "CHEMBL2105423",
          "CHEMBL2113179",
          "CHEMBL212521",
          "CHEMBL212689",
          "CHEMBL213029",
          "CHEMBL213221",
          "CHEMBL213390",
          "CHEMBL2146750",
          "CHEMBL2147070",
          "CHEMBL214784",
          "CHEMBL214859",
          "CHEMBL214957",
          "CHEMBL214990",
          "CHEMBL2151164",
          "CHEMBL215134",
          "CHEMBL215174",
          "CHEMBL2152252",
          "CHEMBL2152522",
          "CHEMBL2152523",
          "CHEMBL2152524",
          "CHEMBL2152525",
          "CHEMBL2158221",
          "CHEMBL2158222",
          "CHEMBL2158223",
          "CHEMBL2158224",
          "CHEMBL2158225",
          "CHEMBL2158227",
          "CHEMBL2158228",
          "CHEMBL2158230",
          "CHEMBL2158231",
          "CHEMBL2158287",
          "CHEMBL2158288",
          "CHEMBL2158289",
          "CHEMBL2158293",
          "CHEMBL2158297",
          "CHEMBL2158298",
          "CHEMBL2158299",
          "CHEMBL2158301",
          "CHEMBL2158302",
          "CHEMBL2159071",
          "CHEMBL2159084",
          "CHEMBL2159210",
          "CHEMBL2170062",
          "CHEMBL2170294",
          "CHEMBL2170605",
          "CHEMBL2170607",
          "CHEMBL2170608",
          "CHEMBL2170609",
          "CHEMBL2170610",
          "CHEMBL2170615",
          "CHEMBL2170617",
          "CHEMBL2170618",
          "CHEMBL2170629",
          "CHEMBL2170630",
          "CHEMBL2170631",
          "CHEMBL2170632",
          "CHEMBL2170633",
          "CHEMBL2170635",
          "CHEMBL2170636",
          "CHEMBL2170637",
          "CHEMBL2170638",
          "CHEMBL2170639",
          "CHEMBL2170642",
          "CHEMBL2170643",
          "CHEMBL2170747",
          "CHEMBL2170750",
          "CHEMBL2170754",
          "CHEMBL217125",
          "CHEMBL2177582",
          "CHEMBL2177587",
          "CHEMBL2177588",
          "CHEMBL2177818",
          "CHEMBL2177819",
          "CHEMBL2177831",
          "CHEMBL2177836",
          "CHEMBL2178221",
          "CHEMBL2178223",
          "CHEMBL2178247",
          "CHEMBL2178248",
          "CHEMBL2178250",
          "CHEMBL2178251",
          "CHEMBL2178252",
          "CHEMBL2178254",
          "CHEMBL2178422",
          "CHEMBL2178807",
          "CHEMBL2178953",
          "CHEMBL2179319",
          "CHEMBL2180528",
          "CHEMBL2181330",
          "CHEMBL2181618",
          "CHEMBL2181621",
          "CHEMBL2181629",
          "CHEMBL2181634",
          "CHEMBL2181635",
          "CHEMBL2181638",
          "CHEMBL2181641",
          "CHEMBL2181643",
          "CHEMBL2181765",
          "CHEMBL2181775",
          "CHEMBL2181776",
          "CHEMBL2181777",
          "CHEMBL2181786",
          "CHEMBL2181789",
          "CHEMBL2203434",
          "CHEMBL2204469",
          "CHEMBL2205775",
          "CHEMBL2206059",
          "CHEMBL2206277",
          "CHEMBL2206278",
          "CHEMBL2207081",
          "CHEMBL2207099",
          "CHEMBL2207100",
          "CHEMBL2207503",
          "CHEMBL220862",
          "CHEMBL221401",
          "CHEMBL221959",
          "CHEMBL222424",
          "CHEMBL222460",
          "CHEMBL223079",
          "CHEMBL224079",
          "CHEMBL224133",
          "CHEMBL224279",
          "CHEMBL224830",
          "CHEMBL225411",
          "CHEMBL225412",
          "CHEMBL225413",
          "CHEMBL225464",
          "CHEMBL225465",
          "CHEMBL225481",
          "CHEMBL225629",
          "CHEMBL225630",
          "CHEMBL226067",
          "CHEMBL226385",
          "CHEMBL226386",
          "CHEMBL227855",
          "CHEMBL227899",
          "CHEMBL228133",
          "CHEMBL228814",
          "CHEMBL229008",
          "CHEMBL229176",
          "CHEMBL229861",
          "CHEMBL230686",
          "CHEMBL230964",
          "CHEMBL231306",
          "CHEMBL231334",
          "CHEMBL231350",
          "CHEMBL2313764",
          "CHEMBL231383",
          "CHEMBL231430",
          "CHEMBL2315239",
          "CHEMBL2315243",
          "CHEMBL2316582",
          "CHEMBL2322875",
          "CHEMBL2324491",
          "CHEMBL2325697",
          "CHEMBL2325940",
          "CHEMBL2331648",
          "CHEMBL2331747",
          "CHEMBL2332055",
          "CHEMBL2336410",
          "CHEMBL2337981",
          "CHEMBL2338343",
          "CHEMBL234940",
          "CHEMBL238103",
          "CHEMBL238146",
          "CHEMBL239099",
          "CHEMBL239299",
          "CHEMBL240185",
          "CHEMBL240624",
          "CHEMBL242983",
          "CHEMBL244239",
          "CHEMBL247428",
          "CHEMBL247609",
          "CHEMBL248229",
          "CHEMBL248231",
          "CHEMBL248407",
          "CHEMBL248849",
          "CHEMBL252556",
          "CHEMBL253641",
          "CHEMBL255590",
          "CHEMBL255858",
          "CHEMBL256092",
          "CHEMBL256712",
          "CHEMBL257517",
          "CHEMBL257990",
          "CHEMBL258046",
          "CHEMBL258199",
          "CHEMBL259922",
          "CHEMBL260259",
          "CHEMBL262968",
          "CHEMBL263664",
          "CHEMBL264241",
          "CHEMBL266212",
          "CHEMBL266647",
          "CHEMBL267210",
          "CHEMBL267865",
          "CHEMBL270193",
          "CHEMBL270666",
          "CHEMBL270996",
          "CHEMBL271310",
          "CHEMBL271876",
          "CHEMBL272336",
          "CHEMBL273921",
          "CHEMBL276140",
          "CHEMBL292759",
          "CHEMBL29609",
          "CHEMBL296580",
          "CHEMBL320105",
          "CHEMBL325429",
          "CHEMBL331431",
          "CHEMBL331485",
          "CHEMBL332690",
          "CHEMBL332958",
          "CHEMBL333108",
          "CHEMBL333210",
          "CHEMBL333704",
          "CHEMBL337301",
          "CHEMBL345544",
          "CHEMBL346178",
          "CHEMBL347303",
          "CHEMBL348263",
          "CHEMBL348475",
          "CHEMBL356594",
          "CHEMBL358214",
          "CHEMBL358216",
          "CHEMBL358880",
          "CHEMBL359116",
          "CHEMBL359657",
          "CHEMBL360541",
          "CHEMBL360998",
          "CHEMBL360999",
          "CHEMBL361153",
          "CHEMBL361364",
          "CHEMBL361969",
          "CHEMBL362702",
          "CHEMBL364713",
          "CHEMBL365062",
          "CHEMBL369285",
          "CHEMBL371409",
          "CHEMBL372751",
          "CHEMBL372846",
          "CHEMBL374618",
          "CHEMBL375741",
          "CHEMBL375955",
          "CHEMBL376359",
          "CHEMBL376487",
          "CHEMBL377085",
          "CHEMBL377300",
          "CHEMBL377414",
          "CHEMBL377928",
          "CHEMBL381751",
          "CHEMBL385008",
          "CHEMBL386124",
          "CHEMBL386515",
          "CHEMBL387620",
          "CHEMBL387785",
          "CHEMBL388012",
          "CHEMBL388590",
          "CHEMBL389052",
          "CHEMBL389408",
          "CHEMBL389908",
          "CHEMBL390526",
          "CHEMBL390548",
          "CHEMBL390613",
          "CHEMBL392525",
          "CHEMBL394864",
          "CHEMBL398126",
          "CHEMBL398160",
          "CHEMBL398372",
          "CHEMBL399045",
          "CHEMBL399656",
          "CHEMBL399719",
          "CHEMBL400404",
          "CHEMBL401930",
          "CHEMBL403313",
          "CHEMBL404646",
          "CHEMBL408443",
          "CHEMBL408444",
          "CHEMBL408479",
          "CHEMBL408962",
          "CHEMBL410333",
          "CHEMBL410414",
          "CHEMBL413",
          "CHEMBL413529",
          "CHEMBL414238",
          "CHEMBL421841",
          "CHEMBL422858",
          "CHEMBL425519",
          "CHEMBL427548",
          "CHEMBL427844",
          "CHEMBL427860",
          "CHEMBL429023",
          "CHEMBL429734",
          "CHEMBL431770",
          "CHEMBL432386",
          "CHEMBL433737",
          "CHEMBL434317",
          "CHEMBL436137",
          "CHEMBL437002",
          "CHEMBL442078",
          "CHEMBL443060",
          "CHEMBL443705",
          "CHEMBL445",
          "CHEMBL445734",
          "CHEMBL446898",
          "CHEMBL447591",
          "CHEMBL447822",
          "CHEMBL447955",
          "CHEMBL450061",
          "CHEMBL450668",
          "CHEMBL452864",
          "CHEMBL453169",
          "CHEMBL453246",
          "CHEMBL453384",
          "CHEMBL455683",
          "CHEMBL456379",
          "CHEMBL456390",
          "CHEMBL456807",
          "CHEMBL458224",
          "CHEMBL459729",
          "CHEMBL460291",
          "CHEMBL460491",
          "CHEMBL460542",
          "CHEMBL461012",
          "CHEMBL462093",
          "CHEMBL462360",
          "CHEMBL462513",
          "CHEMBL462624",
          "CHEMBL464234",
          "CHEMBL464245",
          "CHEMBL464907",
          "CHEMBL465451",
          "CHEMBL465470",
          "CHEMBL466191",
          "CHEMBL466624",
          "CHEMBL467047",
          "CHEMBL467114",
          "CHEMBL467633",
          "CHEMBL467720",
          "CHEMBL468092",
          "CHEMBL468927",
          "CHEMBL469227",
          "CHEMBL470508",
          "CHEMBL470908",
          "CHEMBL471757",
          "CHEMBL473763",
          "CHEMBL473921",
          "CHEMBL474484",
          "CHEMBL47529",
          "CHEMBL475534",
          "CHEMBL475684",
          "CHEMBL476323",
          "CHEMBL476572",
          "CHEMBL477145",
          "CHEMBL477563",
          "CHEMBL477611",
          "CHEMBL477947",
          "CHEMBL478125",
          "CHEMBL478283",
          "CHEMBL478402",
          "CHEMBL478612",
          "CHEMBL478649",
          "CHEMBL478902",
          "CHEMBL479",
          "CHEMBL479628",
          "CHEMBL480",
          "CHEMBL480219",
          "CHEMBL480398",
          "CHEMBL481322",
          "CHEMBL481745",
          "CHEMBL485549",
          "CHEMBL486757",
          "CHEMBL487965",
          "CHEMBL488400",
          "CHEMBL489095",
          "CHEMBL489724",
          "CHEMBL490672",
          "CHEMBL491922",
          "CHEMBL491923",
          "CHEMBL493937",
          "CHEMBL495727",
          "CHEMBL496",
          "CHEMBL496400",
          "CHEMBL496426",
          "CHEMBL496605",
          "CHEMBL496606",
          "CHEMBL496806",
          "CHEMBL497011",
          "CHEMBL497999",
          "CHEMBL499007",
          "CHEMBL500394",
          "CHEMBL502335",
          "CHEMBL502908",
          "CHEMBL504492",
          "CHEMBL507731",
          "CHEMBL512127",
          "CHEMBL513491",
          "CHEMBL514800",
          "CHEMBL515387",
          "CHEMBL517438",
          "CHEMBL517440",
          "CHEMBL517646",
          "CHEMBL517933",
          "CHEMBL519042",
          "CHEMBL520237",
          "CHEMBL520276",
          "CHEMBL520413",
          "CHEMBL521523",
          "CHEMBL521889",
          "CHEMBL522295",
          "CHEMBL522771",
          "CHEMBL523752",
          "CHEMBL524109",
          "CHEMBL528996",
          "CHEMBL534723",
          "CHEMBL534942",
          "CHEMBL534958",
          "CHEMBL540359",
          "CHEMBL541483",
          "CHEMBL541973",
          "CHEMBL542139",
          "CHEMBL549534",
          "CHEMBL549554",
          "CHEMBL549749",
          "CHEMBL550170",
          "CHEMBL551305",
          "CHEMBL551782",
          "CHEMBL551784",
          "CHEMBL551964",
          "CHEMBL551972",
          "CHEMBL551991",
          "CHEMBL552107",
          "CHEMBL552108",
          "CHEMBL552156",
          "CHEMBL552240",
          "CHEMBL552338",
          "CHEMBL555562",
          "CHEMBL555563",
          "CHEMBL556716",
          "CHEMBL556891",
          "CHEMBL556892",
          "CHEMBL557293",
          "CHEMBL557461",
          "CHEMBL557527",
          "CHEMBL558448",
          "CHEMBL559506",
          "CHEMBL559565",
          "CHEMBL559580",
          "CHEMBL559581",
          "CHEMBL559825",
          "CHEMBL559974",
          "CHEMBL560248",
          "CHEMBL560537",
          "CHEMBL560647",
          "CHEMBL560740",
          "CHEMBL561712",
          "CHEMBL561713",
          "CHEMBL561932",
          "CHEMBL562509",
          "CHEMBL563716",
          "CHEMBL563949",
          "CHEMBL563956",
          "CHEMBL564015",
          "CHEMBL564782",
          "CHEMBL565360",
          "CHEMBL565361",
          "CHEMBL565362",
          "CHEMBL565390",
          "CHEMBL565591",
          "CHEMBL565983",
          "CHEMBL567169",
          "CHEMBL567292",
          "CHEMBL567374",
          "CHEMBL567376",
          "CHEMBL567487",
          "CHEMBL567570",
          "CHEMBL567582",
          "CHEMBL567904",
          "CHEMBL567911",
          "CHEMBL568242",
          "CHEMBL568438",
          "CHEMBL568444",
          "CHEMBL568456",
          "CHEMBL569862",
          "CHEMBL570596",
          "CHEMBL570639",
          "CHEMBL570867",
          "CHEMBL571581",
          "CHEMBL572184",
          "CHEMBL575448",
          "CHEMBL575966",
          "CHEMBL576093",
          "CHEMBL576094",
          "CHEMBL576138",
          "CHEMBL576457",
          "CHEMBL577338",
          "CHEMBL577470",
          "CHEMBL577694",
          "CHEMBL577965",
          "CHEMBL578413",
          "CHEMBL578547",
          "CHEMBL578578",
          "CHEMBL578579",
          "CHEMBL578588",
          "CHEMBL578594",
          "CHEMBL578928",
          "CHEMBL578968",
          "CHEMBL579016",
          "CHEMBL579199",
          "CHEMBL579200",
          "CHEMBL583442",
          "CHEMBL583867",
          "CHEMBL584261",
          "CHEMBL584554",
          "CHEMBL584886",
          "CHEMBL585191",
          "CHEMBL585487",
          "CHEMBL585498",
          "CHEMBL586213",
          "CHEMBL589136",
          "CHEMBL590078",
          "CHEMBL590472",
          "CHEMBL590600",
          "CHEMBL590810",
          "CHEMBL590850",
          "CHEMBL593490",
          "CHEMBL593763",
          "CHEMBL595632",
          "CHEMBL596515",
          "CHEMBL596809",
          "CHEMBL597127",
          "CHEMBL597211",
          "CHEMBL598194",
          "CHEMBL598215",
          "CHEMBL598336",
          "CHEMBL598644",
          "CHEMBL599791",
          "CHEMBL599792",
          "CHEMBL600613",
          "CHEMBL601821",
          "CHEMBL602483",
          "CHEMBL604085",
          "CHEMBL604087",
          "CHEMBL604249",
          "CHEMBL605209",
          "CHEMBL605833",
          "CHEMBL608151",
          "CHEMBL608263",
          "CHEMBL60889",
          "CHEMBL61",
          "CHEMBL610795",
          "CHEMBL63560",
          "CHEMBL638",
          "CHEMBL64",
          "CHEMBL682",
          "CHEMBL710",
          "CHEMBL717",
          "CHEMBL808",
          "CHEMBL809",
          "CHEMBL833",
          "CHEMBL83668",
          "CHEMBL894",
          "CHEMBL91",
          "CHEMBL998"
        ],
        "number_of_missing_values": "0"
      },
      {
        "data_type": "numeric",
        "index": "1",
        "is_ignore": "false",
        "is_row_identifier": "false",
        "is_target": "false",
        "name": "FCFP4_1024b120",
        "number_of_missing_values": "0"
      },
      {
        "data_type": "numeric",
        "index": "2",
        "is_ignore": "false",
        "is_row_identifier": "false",
        "is_target": "false",
        "name": "FCFP4_1024b205",
        "number_of_missing_values": "0"
      },
      {
        "data_type": "numeric",
        "index": "3",
        "is_ignore": "false",
        "is_row_identifier": "false",
        "is_target": "false",
        "name": "FCFP4_1024b961",
        "number_of_missing_values": "0"
      },
      {
        "data_type": "numeric",
        "index": "4",
        "is_ignore": "false",
        "is_row_identifier": "false",
        "is_target": "false",
        "name": "FCFP4_1024b325",
        "number_of_missing_values": "0"
      },
      {
        "data_type": "numeric",
        "index": "5",
        "is_ignore": "false",
        "is_row_identifier": "false",
        "is_target": "false",
        "name": "FCFP4_1024b644",
        "number_of_missing_values": "0"
      },
      {
        "data_type": "numeric",
        "index": "6",
        "is_ignore": "false",
        "is_row_identifier": "false",
        "is_target": "false",
        "name": "FCFP4_1024b925",
        "number_of_missing_values": "0"
      },
      {
        "data_type": "numeric",
        "index": "7",
        "is_ignore": "false",
        "is_row_identifier": "false",
        "is_target": "false",
        "name": "FCFP4_1024b37",
        "number_of_missing_values": "0"
      },
      {
        "data_type": "numeric",
        "index": "8",
        "is_ignore": "false",
        "is_row_identifier": "false",
        "is_target": "false",
        "name": "FCFP4_1024b208",
        "number_of_missing_values": "0"
      },
      {
        "data_type": "numeric",
        "index": "9",
        "is_ignore": "false",
        "is_row_identifier": "false",
        "is_target": "false",
        "name": "FCFP4_1024b630",
        "number_of_missing_values": "0"
      },
      {
        "data_type": "numeric",
        "index": "10",
        "is_ignore": "false",
        "is_row_identifier": "false",
        "is_target": "false",
        "name": "FCFP4_1024b1015",
        "number_of_missing_values": "0"
      },
      {
        "data_type": "numeric",
        "index": "11",
        "is_ignore": "false",
        "is_row_identifier": "false",
        "is_target": "false",
        "name": "FCFP4_1024b189",
        "number_of_missing_values": "0"
      },
      {
        "data_type": "numeric",
        "index": "12",
        "is_ignore": "false",
        "is_row_identifier": "false",
        "is_target": "false",
        "name": "FCFP4_1024b389",
        "number_of_missing_values": "0"
      },
      {
        "data_type": "numeric",
        "index": "13",
        "is_ignore": "false",
        "is_row_identifier": "false",
        "is_target": "false",
        "name": "FCFP4_1024b13",
        "number_of_missing_values": "0"
      },
      {
        "data_type": "numeric",
        "index": "14",
        "is_ignore": "false",
        "is_row_identifier": "false",
        "is_target": "false",
        "name": "FCFP4_1024b552",
        "number_of_missing_values": "0"
      },
      {
        "data_type": "numeric",
        "index": "15",
        "is_ignore": "false",
        "is_row_identifier": "false",
        "is_target": "false",
        "name": "FCFP4_1024b145",
        "number_of_missing_values": "0"
      },
      {
        "data_type": "numeric",
        "index": "16",
        "is_ignore": "false",
        "is_row_identifier": "false",
        "is_target": "false",
        "name": "FCFP4_1024b170",
        "number_of_missing_values": "0"
      },
      {
        "data_type": "numeric",
        "index": "17",
        "is_ignore": "false",
        "is_row_identifier": "false",
        "is_target": "false",
        "name": "FCFP4_1024b1",
        "number_of_missing_values": "0"
      },
      {
        "data_type": "numeric",
        "index": "18",
        "is_ignore": "false",
        "is_row_identifier": "false",
        "is_target": "false",
        "name": "FCFP4_1024b10",
        "number_of_missing_values": "0"
      },
      {
        "data_type": "numeric",
        "index": "19",
        "is_ignore": "false",
        "is_row_identifier": "false",
        "is_target": "false",
        "name": "FCFP4_1024b100",
        "number_of_missing_values": "0"
      },
      {
        "data_type": "numeric",
        "index": "20",
        "is_ignore": "false",
        "is_row_identifier": "false",
        "is_target": "false",
        "name": "FCFP4_1024b1000",
        "number_of_missing_values": "0"
      },
      {
        "data_type": "numeric",
        "index": "21",
        "is_ignore": "false",
        "is_row_identifier": "false",
        "is_target": "false",
        "name": "FCFP4_1024b1001",
        "number_of_missing_values": "0"
      },
      {
        "data_type": "numeric",
        "index": "22",
        "is_ignore": "false",
        "is_row_identifier": "false",
        "is_target": "false",
        "name": "FCFP4_1024b1002",
        "number_of_missing_values": "0"
      },
      {
        "data_type": "numeric",
        "index": "23",
        "is_ignore": "false",
        "is_row_identifier": "false",
        "is_target": "false",
        "name": "FCFP4_1024b1003",
        "number_of_missing_values": "0"
      },
      {
        "data_type": "numeric",
        "index": "24",
        "is_ignore": "false",
        "is_row_identifier": "false",
        "is_target": "false",
        "name": "FCFP4_1024b1004",
        "number_of_missing_values": "0"
      },
      {
        "data_type": "numeric",
        "index": "25",
        "is_ignore": "false",
        "is_row_identifier": "false",
        "is_target": "false",
        "name": "FCFP4_1024b1005",
        "number_of_missing_values": "0"
      },
      {
        "data_type": "numeric",
        "index": "26",
        "is_ignore": "false",
        "is_row_identifier": "false",
        "is_target": "false",
        "name": "FCFP4_1024b1006",
        "number_of_missing_values": "0"
      },
      {
        "data_type": "numeric",
        "index": "27",
        "is_ignore": "false",
        "is_row_identifier": "false",
        "is_target": "false",
        "name": "FCFP4_1024b1007",
        "number_of_missing_values": "0"
      },
      {
        "data_type": "numeric",
        "index": "28",
        "is_ignore": "false",
        "is_row_identifier": "false",
        "is_target": "false",
        "name": "FCFP4_1024b1008",
        "number_of_missing_values": "0"
      },
      {
        "data_type": "numeric",
        "index": "29",
        "is_ignore": "false",
        "is_row_identifier": "false",
        "is_target": "false",
        "name": "FCFP4_1024b1009",
        "number_of_missing_values": "0"
      },
      {
        "data_type": "numeric",
        "index": "30",
        "is_ignore": "false",
        "is_row_identifier": "false",
        "is_target": "false",
        "name": "FCFP4_1024b101",
        "number_of_missing_values": "0"
      },
      {
        "data_type": "numeric",
        "index": "31",
        "is_ignore": "false",
        "is_row_identifier": "false",
        "is_target": "false",
        "name": "FCFP4_1024b1010",
        "number_of_missing_values": "0"
      },
      {
        "data_type": "numeric",
        "index": "32",
        "is_ignore": "false",
        "is_row_identifier": "false",
        "is_target": "false",
        "name": "FCFP4_1024b1011",
        "number_of_missing_values": "0"
      },
      {
        "data_type": "numeric",
        "index": "33",
        "is_ignore": "false",
        "is_row_identifier": "false",
        "is_target": "false",
        "name": "FCFP4_1024b1012",
        "number_of_missing_values": "0"
      },
      {
        "data_type": "numeric",
        "index": "34",
        "is_ignore": "false",
        "is_row_identifier": "false",
        "is_target": "false",
        "name": "FCFP4_1024b1013",
        "number_of_missing_values": "0"
      },
      {
        "data_type": "numeric",
        "index": "35",
        "is_ignore": "false",
        "is_row_identifier": "false",
        "is_target": "false",
        "name": "FCFP4_1024b1014",
        "number_of_missing_values": "0"
      },
      {
        "data_type": "numeric",
        "index": "36",
        "is_ignore": "false",
        "is_row_identifier": "false",
        "is_target": "false",
        "name": "FCFP4_1024b1016",
        "number_of_missing_values": "0"
      },
      {
        "data_type": "numeric",
        "index": "37",
        "is_ignore": "false",
        "is_row_identifier": "false",
        "is_target": "false",
        "name": "FCFP4_1024b1017",
        "number_of_missing_values": "0"
      },
      {
        "data_type": "numeric",
        "index": "38",
        "is_ignore": "false",
        "is_row_identifier": "false",
        "is_target": "false",
        "name": "FCFP4_1024b1018",
        "number_of_missing_values": "0"
      },
      {
        "data_type": "numeric",
        "index": "39",
        "is_ignore": "false",
        "is_row_identifier": "false",
        "is_target": "false",
        "name": "FCFP4_1024b1019",
        "number_of_missing_values": "0"
      },
      {
        "data_type": "numeric",
        "index": "40",
        "is_ignore": "false",
        "is_row_identifier": "false",
        "is_target": "false",
        "name": "FCFP4_1024b102",
        "number_of_missing_values": "0"
      },
      {
        "data_type": "numeric",
        "index": "41",
        "is_ignore": "false",
        "is_row_identifier": "false",
        "is_target": "false",
        "name": "FCFP4_1024b1020",
        "number_of_missing_values": "0"
      },
      {
        "data_type": "numeric",
        "index": "42",
        "is_ignore": "false",
        "is_row_identifier": "false",
        "is_target": "false",
        "name": "FCFP4_1024b1021",
        "number_of_missing_values": "0"
      },
      {
        "data_type": "numeric",
        "index": "43",
        "is_ignore": "false",
        "is_row_identifier": "false",
        "is_target": "false",
        "name": "FCFP4_1024b1022",
        "number_of_missing_values": "0"
      },
      {
        "data_type": "numeric",
        "index": "44",
        "is_ignore": "false",
        "is_row_identifier": "false",
        "is_target": "false",
        "name": "FCFP4_1024b1023",
        "number_of_missing_values": "0"
      },
      {
        "data_type": "numeric",
        "index": "45",
        "is_ignore": "false",
        "is_row_identifier": "false",
        "is_target": "false",
        "name": "FCFP4_1024b1024",
        "number_of_missing_values": "0"
      },
      {
        "data_type": "numeric",
        "index": "46",
        "is_ignore": "false",
        "is_row_identifier": "false",
        "is_target": "false",
        "name": "FCFP4_1024b103",
        "number_of_missing_values": "0"
      },
      {
        "data_type": "numeric",
        "index": "47",
        "is_ignore": "false",
        "is_row_identifier": "false",
        "is_target": "false",
        "name": "FCFP4_1024b104",
        "number_of_missing_values": "0"
      },
      {
        "data_type": "numeric",
        "index": "48",
        "is_ignore": "false",
        "is_row_identifier": "false",
        "is_target": "false",
        "name": "FCFP4_1024b105",
        "number_of_missing_values": "0"
      },
      {
        "data_type": "numeric",
        "index": "49",
        "is_ignore": "false",
        "is_row_identifier": "false",
        "is_target": "false",
        "name": "FCFP4_1024b106",
        "number_of_missing_values": "0"
      },
      {
        "data_type": "numeric",
        "index": "50",
        "is_ignore": "false",
        "is_row_identifier": "false",
        "is_target": "false",
        "name": "FCFP4_1024b107",
        "number_of_missing_values": "0"
      },
      {
        "data_type": "numeric",
        "index": "51",
        "is_ignore": "false",
        "is_row_identifier": "false",
        "is_target": "false",
        "name": "FCFP4_1024b108",
        "number_of_missing_values": "0"
      },
      {
        "data_type": "numeric",
        "index": "52",
        "is_ignore": "false",
        "is_row_identifier": "false",
        "is_target": "true",
        "name": "pXC50",
        "number_of_missing_values": "0"
      }
    ]
  }
}