"molecule_id","FCFP4_1024b450","FCFP4_1024b357","FCFP4_1024b387","FCFP4_1024b63","FCFP4_1024b54","FCFP4_1024b107","FCFP4_1024b4","FCFP4_1024b283","FCFP4_1024b453","FCFP4_1024b319","FCFP4_1024b57","FCFP4_1024b649","FCFP4_1024b139","FCFP4_1024b395","FCFP4_1024b18","FCFP4_1024b651","FCFP4_1024b524","FCFP4_1024b33","FCFP4_1024b714","FCFP4_1024b908","FCFP4_1024b171","FCFP4_1024b8","FCFP4_1024b861","FCFP4_1024b152","FCFP4_1024b37","FCFP4_1024b34","FCFP4_1024b1","FCFP4_1024b10","FCFP4_1024b100","FCFP4_1024b1000","FCFP4_1024b1001","FCFP4_1024b1002","FCFP4_1024b1003","FCFP4_1024b1004","FCFP4_1024b1005","FCFP4_1024b1006","FCFP4_1024b1007","FCFP4_1024b1008","FCFP4_1024b1009","FCFP4_1024b101","FCFP4_1024b1010","FCFP4_1024b1011","FCFP4_1024b1012","FCFP4_1024b1013","FCFP4_1024b1014","FCFP4_1024b1015","FCFP4_1024b1016","FCFP4_1024b1017","FCFP4_1024b1018","FCFP4_1024b1019","FCFP4_1024b102","FCFP4_1024b1020","FCFP4_1024b1021","FCFP4_1024b1022","FCFP4_1024b1023","FCFP4_1024b1024","FCFP4_1024b103","FCFP4_1024b104","FCFP4_1024b105","FCFP4_1024b106","FCFP4_1024b108","FCFP4_1024b109","FCFP4_1024b11","FCFP4_1024b110","FCFP4_1024b111","FCFP4_1024b112","FCFP4_1024b113","FCFP4_1024b114","FCFP4_1024b115","FCFP4_1024b116","FCFP4_1024b117","FCFP4_1024b118","FCFP4_1024b119","FCFP4_1024b12","FCFP4_1024b120","FCFP4_1024b121","FCFP4_1024b122","FCFP4_1024b123","FCFP4_1024b124","FCFP4_1024b125","FCFP4_1024b126","FCFP4_1024b127","FCFP4_1024b128","FCFP4_1024b129","FCFP4_1024b13","FCFP4_1024b130","FCFP4_1024b131","FCFP4_1024b132","FCFP4_1024b133","FCFP4_1024b134","FCFP4_1024b135","FCFP4_1024b136","FCFP4_1024b137","FCFP4_1024b138","FCFP4_1024b14","FCFP4_1024b140","FCFP4_1024b141","FCFP4_1024b142","FCFP4_1024b143","FCFP4_1024b144","FCFP4_1024b145","FCFP4_1024b146","FCFP4_1024b147","FCFP4_1024b148","FCFP4_1024b149","FCFP4_1024b15","FCFP4_1024b150","FCFP4_1024b151","FCFP4_1024b153","FCFP4_1024b154","FCFP4_1024b155","FCFP4_1024b156","FCFP4_1024b157","FCFP4_1024b158","FCFP4_1024b159","FCFP4_1024b16","FCFP4_1024b160","FCFP4_1024b161","FCFP4_1024b162","FCFP4_1024b163","FCFP4_1024b164","FCFP4_1024b165","FCFP4_1024b166","FCFP4_1024b167","FCFP4_1024b168","FCFP4_1024b169","FCFP4_1024b17","FCFP4_1024b170","FCFP4_1024b172","FCFP4_1024b173","FCFP4_1024b174","FCFP4_1024b175","FCFP4_1024b176","FCFP4_1024b177","FCFP4_1024b178","FCFP4_1024b179","FCFP4_1024b180","FCFP4_1024b181","FCFP4_1024b182","FCFP4_1024b183","FCFP4_1024b184","FCFP4_1024b185","FCFP4_1024b186","FCFP4_1024b187","FCFP4_1024b188","FCFP4_1024b189","FCFP4_1024b19","FCFP4_1024b190","FCFP4_1024b191","FCFP4_1024b192","FCFP4_1024b193","FCFP4_1024b194","FCFP4_1024b195","FCFP4_1024b196","FCFP4_1024b197","FCFP4_1024b198","FCFP4_1024b199","FCFP4_1024b2","FCFP4_1024b20","FCFP4_1024b200","FCFP4_1024b201","FCFP4_1024b202","FCFP4_1024b203","FCFP4_1024b204","FCFP4_1024b205","FCFP4_1024b206","FCFP4_1024b207","FCFP4_1024b208","FCFP4_1024b209","FCFP4_1024b21","FCFP4_1024b210","FCFP4_1024b211","FCFP4_1024b212","FCFP4_1024b213","FCFP4_1024b214","FCFP4_1024b215","FCFP4_1024b216","FCFP4_1024b217","FCFP4_1024b218","FCFP4_1024b219","FCFP4_1024b22","FCFP4_1024b220","FCFP4_1024b221","FCFP4_1024b222","FCFP4_1024b223","FCFP4_1024b224","FCFP4_1024b225","FCFP4_1024b226","FCFP4_1024b227","FCFP4_1024b228","FCFP4_1024b229","FCFP4_1024b23","FCFP4_1024b230","FCFP4_1024b231","FCFP4_1024b232","FCFP4_1024b233","FCFP4_1024b234","FCFP4_1024b235","FCFP4_1024b236","FCFP4_1024b237","FCFP4_1024b238","FCFP4_1024b239","FCFP4_1024b24","FCFP4_1024b240","FCFP4_1024b241","pXC50"
{7 1,9 1,24 1,27 1,50 1,127 1,128 1,158 1,186 1,206 5.824}
{0 CHEMBL115581,14 1,21 1,27 1,127 1,128 1,130 1,158 1,165 1,177 1,179 1,206 5.77}
{0 CHEMBL115897,5 1,6 1,7 1,9 1,10 1,11 1,12 1,13 1,14 1,18 1,24 1,27 1,127 1,128 1,158 1,160 1,206 4.499}
{0 CHEMBL116040,5 1,6 1,7 1,9 1,10 1,11 1,12 1,13 1,14 1,18 1,24 1,27 1,127 1,128 1,158 1,160 1,206 4}
{0 CHEMBL1162998,1 1,2 1,3 1,4 1,5 1,6 1,7 1,8 1,9 1,10 1,11 1,12 1,13 1,18 1,27 1,53 1,127 1,128 1,158 1,206 4}
{0 CHEMBL116649,5 1,6 1,7 1,9 1,14 1,18 1,24 1,27 1,127 1,128 1,158 1,160 1,206 4.783}
{0 CHEMBL117447,14 1,27 1,87 1,127 1,128 1,158 1,177 1,206 7.638}
{0 CHEMBL118305,5 1,6 1,7 1,9 1,14 1,24 1,27 1,127 1,128 1,135 1,158 1,160 1,206 4}
{0 CHEMBL118883,5 1,6 1,7 1,9 1,14 1,24 1,27 1,50 1,127 1,128 1,158 1,160 1,206 4}
{0 CHEMBL12019,27 1,114 1,118 1,127 1,128 1,138 1,158 1,206 3.099}
{0 CHEMBL120901,27 1,28 1,47 1,127 1,128 1,135 1,139 1,157 1,158 1,159 1,206 3.921}
{0 CHEMBL1229,7 1,16 1,17 1,19 1,23 1,24 1,27 1,67 1,126 1,158 1,199 1,206 3.751}
{0 CHEMBL126075,25 1,27 1,28 1,46 1,47 1,83 1,127 1,128 1,158 1,206 3.811}
{0 CHEMBL1473252,2 1,7 1,14 1,15 1,27 1,62 1,97 1,127 1,128 1,158 1,182 1,206 4}
{0 CHEMBL1592,7 1,16 1,17 1,19 1,20 1,22 1,23 1,27 1,52 1,127 1,128 1,130 1,158 1,206 3.872}
{0 CHEMBL1629724,5 1,6 1,7 1,8 1,9 1,14 1,15 1,18 1,27 1,74 1,93 1,127 1,128 1,158 1,168 1,206 6.36}
{0 CHEMBL1630808,5 1,6 1,7 1,8 1,9 1,10 1,11 1,12 1,13 1,14 1,15 1,18 1,27 1,93 1,127 1,128 1,158 1,168 1,206 6.554}
{0 CHEMBL1630809,5 1,6 1,7 1,8 1,9 1,14 1,15 1,24 1,27 1,93 1,127 1,128 1,158 1,168 1,206 4}
{0 CHEMBL1630810,5 1,6 1,7 1,8 1,9 1,14 1,15 1,27 1,93 1,127 1,128 1,158 1,168 1,206 5.985}
{0 CHEMBL1630811,5 1,6 1,7 1,8 1,9 1,10 1,11 1,13 1,14 1,15 1,18 1,27 1,93 1,127 1,128 1,158 1,168 1,206 5.905}
{0 CHEMBL1630812,5 1,6 1,7 1,8 1,9 1,14 1,15 1,24 1,27 1,93 1,127 1,128 1,158 1,168 1,206 4}
{0 CHEMBL1630813,5 1,6 1,7 1,8 1,9 1,14 1,15 1,27 1,83 1,93 1,127 1,128 1,158 1,168 1,206 4}
{0 CHEMBL1630814,5 1,6 1,7 1,8 1,9 1,10 1,11 1,12 1,13 1,14 1,15 1,18 1,27 1,93 1,127 1,128 1,158 1,168 1,206 6.121}
{0 CHEMBL1630815,5 1,6 1,7 1,8 1,9 1,14 1,15 1,24 1,27 1,83 1,93 1,127 1,128 1,158 1,168 1,206 4}
{0 CHEMBL1630816,5 1,6 1,7 1,8 1,9 1,10 1,11 1,12 1,13 1,14 1,15 1,18 1,27 1,93 1,127 1,128 1,158 1,168 1,206 6.419}
{0 CHEMBL173992,14 1,15 1,27 1,63 1,127 1,128 1,158 1,206 6.155}
{0 CHEMBL174397,14 1,15 1,27 1,117 1,127 1,128 1,158 1,204 1,206 4.523}
{0 CHEMBL175580,14 1,15 1,27 1,127 1,128 1,135 1,158 1,202 1,204 1,206 6.301}
{0 CHEMBL175854,14 1,15 1,27 1,127 1,128 1,135 1,158 1,202 1,206 9}
{0 CHEMBL1771,10 1,11 1,13 1,15 1,18 1,25 1,27 1,28 1,93 1,127 1,128 1,135 1,158 1,206 4.252}
{0 CHEMBL177216,14 1,15 1,27 1,117 1,127 1,128 1,158 1,206 5.222}
{0 CHEMBL1773,7 1,15 1,17 1,18 1,19 1,20 1,24 1,27 1,45 1,117 1,121 1,142 1,143 1,158 1,204 1,206 2.888}
{0 CHEMBL177356,14 1,15 1,27 1,117 1,127 1,128 1,158 1,206 6.523}
{0 CHEMBL177577,14 1,15 1,27 1,117 1,127 1,128 1,158 1,206 6.222}
{0 CHEMBL177708,14 1,15 1,27 1,117 1,127 1,128 1,158 1,206 6}
{0 CHEMBL178071,14 1,15 1,27 1,117 1,127 1,128 1,158 1,206 6.699}
{0 CHEMBL178115,14 1,15 1,27 1,93 1,127 1,128 1,158 1,198 1,206 6.602}
{0 CHEMBL178398,14 1,15 1,27 1,93 1,117 1,127 1,128 1,158 1,198 1,206 6.854}
{0 CHEMBL178563,14 1,15 1,27 1,93 1,117 1,127 1,128 1,158 1,198 1,206 4.699}
{0 CHEMBL179760,14 1,15 1,27 1,127 1,128 1,135 1,158 1,202 1,206 8.301}
{0 CHEMBL180625,14 1,15 1,27 1,42 1,93 1,127 1,128 1,158 1,198 1,206 7.523}
{0 CHEMBL1812847,5 1,6 1,7 1,8 1,9 1,24 1,27 1,127 1,128 1,158 1,206 4}
{0 CHEMBL1812848,27 1,127 1,128 1,158 1,206 4}
{0 CHEMBL1812849,27 1,127 1,128 1,158 1,206 4}
{0 CHEMBL1812850,27 1,111 1,127 1,128 1,158 1,206 5.511}
{0 CHEMBL1812851,18 1,27 1,127 1,128 1,158 1,199 1,206 6.971}
{0 CHEMBL1812852,18 1,27 1,111 1,127 1,128 1,158 1,199 1,206 5.58}
{0 CHEMBL1812853,27 1,158 1,206 4}
{0 CHEMBL1812854,27 1,158 1,206 5.094}
{0 CHEMBL1812855,15 1,27 1,158 1,206 7.332}
{0 CHEMBL1812856,15 1,27 1,158 1,206 8.523}
{0 CHEMBL1812857,15 1,27 1,158 1,206 8.319}
{0 CHEMBL1812858,15 1,27 1,158 1,206 8.119}
{0 CHEMBL1812859,15 1,27 1,158 1,206 9.076}
{0 CHEMBL1812860,14 1,27 1,127 1,128 1,158 1,168 1,206 5.81}
{0 CHEMBL1812861,14 1,27 1,127 1,128 1,158 1,168 1,206 6.991}
{0 CHEMBL1812862,14 1,15 1,27 1,127 1,128 1,158 1,168 1,206 7.583}
{0 CHEMBL1812863,14 1,15 1,27 1,127 1,128 1,158 1,168 1,206 8.177}
{0 CHEMBL1812864,14 1,15 1,27 1,127 1,128 1,158 1,168 1,206 8.66}
{0 CHEMBL182199,14 1,15 1,27 1,127 1,128 1,135 1,158 1,202 1,206 8.301}
{0 CHEMBL182206,14 1,15 1,27 1,93 1,117 1,127 1,128 1,158 1,198 1,206 6.699}
{0 CHEMBL187266,14 1,15 1,27 1,62 1,117 1,127 1,128 1,158 1,182 1,206 5.162}
{0 CHEMBL187460,13 1,14 1,27 1,54 1,127 1,128 1,158 1,182 1,184 1,206 6.264}
{0 CHEMBL189162,14 1,27 1,89 1,127 1,128 1,158 1,168 1,206 6.592}
{0 CHEMBL189727,15 1,27 1,158 1,206 4}
{0 CHEMBL189886,14 1,27 1,127 1,128 1,158 1,168 1,206 7.367}
{0 CHEMBL189988,27 1,96 1,127 1,128 1,158 1,206 4}
{0 CHEMBL190496,27 1,111 1,127 1,128 1,158 1,206 4}
{0 CHEMBL190613,15 1,27 1,158 1,206 4}
{0 CHEMBL190660,7 1,14 1,15 1,27 1,93 1,127 1,128 1,158 1,179 1,206 5.562}
{0 CHEMBL190672,10 1,11 1,14 1,15 1,18 1,27 1,93 1,127 1,128 1,158 1,206 7.522}
{0 CHEMBL190677,7 1,14 1,27 1,127 1,128 1,158 1,168 1,179 1,206 5.141}
{0 CHEMBL191513,14 1,27 1,83 1,127 1,128 1,158 1,168 1,206 5.469}
{0 CHEMBL191625,27 1,158 1,206 4}
{0 CHEMBL191676,14 1,25 1,27 1,127 1,128 1,158 1,168 1,206 4}
{0 CHEMBL191688,15 1,27 1,58 1,158 1,206 4}
{0 CHEMBL191739,10 1,11 1,13 1,14 1,18 1,27 1,127 1,128 1,135 1,158 1,168 1,206 4}
{0 CHEMBL191796,14 1,27 1,127 1,128 1,135 1,158 1,168 1,206 4.741}
{0 CHEMBL191800,27 1,158 1,200 1,206 4}
{0 CHEMBL191822,10 1,11 1,13 1,14 1,18 1,27 1,83 1,98 1,127 1,128 1,158 1,168 1,206 5.481}
{0 CHEMBL191847,14 1,27 1,127 1,128 1,135 1,158 1,168 1,206 6.53}
{0 CHEMBL192039,14 1,22 1,27 1,111 1,127 1,128 1,144 1,158 1,206 4}
{0 CHEMBL192139,10 1,11 1,12 1,13 1,14 1,18 1,27 1,127 1,128 1,158 1,168 1,206 6.74}
{0 CHEMBL192180,10 1,11 1,12 1,13 1,14 1,18 1,27 1,127 1,128 1,158 1,168 1,206 7.324}
{0 CHEMBL192241,14 1,18 1,27 1,64 1,127 1,128 1,158 1,168 1,206 7.11}
{0 CHEMBL192252,10 1,11 1,12 1,13 1,14 1,18 1,27 1,127 1,128 1,158 1,168 1,206 6.798}
{0 CHEMBL192258,14 1,27 1,127 1,128 1,158 1,168 1,206 5.278}
{0 CHEMBL192410,10 1,11 1,12 1,13 1,14 1,18 1,27 1,127 1,128 1,158 1,168 1,206 6.638}
{0 CHEMBL192474,14 1,27 1,83 1,127 1,128 1,158 1,168 1,206 6.759}
{0 CHEMBL192589,14 1,27 1,127 1,128 1,135 1,158 1,168 1,206 6.669}
{0 CHEMBL192592,10 1,14 1,15 1,18 1,27 1,127 1,128 1,158 1,206 6.679}
{0 CHEMBL192595,7 1,14 1,25 1,27 1,127 1,128 1,158 1,168 1,179 1,206 4}
{0 CHEMBL192625,14 1,27 1,127 1,128 1,158 1,168 1,206 6.272}
{0 CHEMBL192627,18 1,27 1,158 1,206 7.076}
{0 CHEMBL192648,22 1,27 1,41 1,127 1,128 1,158 1,206 4}
{0 CHEMBL192657,14 1,22 1,27 1,127 1,128 1,135 1,158 1,168 1,206 4}
{0 CHEMBL192712,7 1,17 1,19 1,24 1,27 1,45 1,131 1,158 1,169 1,206 4}
{0 CHEMBL192809,27 1,158 1,206 4}
{0 CHEMBL193140,14 1,27 1,50 1,127 1,128 1,158 1,168 1,206 7.004}
{0 CHEMBL193180,10 1,11 1,14 1,18 1,27 1,127 1,128 1,158 1,168 1,206 6.429}
{0 CHEMBL193228,10 1,11 1,12 1,13 1,14 1,18 1,27 1,127 1,128 1,158 1,168 1,206 4}
{0 CHEMBL193229,10 1,11 1,12 1,14 1,18 1,27 1,127 1,128 1,158 1,168 1,206 7.073}
{0 CHEMBL195713,10 1,11 1,14 1,18 1,27 1,127 1,158 1,206 5.771}
{0 CHEMBL2069132,27 1,158 1,206 4}
{0 CHEMBL219633,14 1,15 1,27 1,28 1,93 1,117 1,127 1,128 1,158 1,206 6.398}
{0 CHEMBL219658,14 1,15 1,27 1,117 1,127 1,128 1,158 1,206 5.699}
{0 CHEMBL219675,7 1,14 1,15 1,27 1,127 1,128 1,158 1,206 5.155}
{0 CHEMBL219818,14 1,15 1,22 1,27 1,127 1,128 1,158 1,205 1,206 4}
{0 CHEMBL219880,14 1,15 1,27 1,127 1,128 1,158 1,206 5.222}
{0 CHEMBL219942,14 1,15 1,22 1,27 1,127 1,128 1,158 1,205 1,206 4}
{0 CHEMBL219953,14 1,15 1,22 1,27 1,41 1,117 1,127 1,128 1,158 1,206 5.523}
{0 CHEMBL220125,14 1,15 1,27 1,89 1,127 1,128 1,158 1,206 7.699}
{0 CHEMBL220379,14 1,15 1,27 1,117 1,127 1,128 1,158 1,206 6.046}
{0 CHEMBL220449,14 1,15 1,27 1,109 1,127 1,128 1,158 1,206 7.155}
{0 CHEMBL220556,14 1,15 1,18 1,27 1,74 1,117 1,127 1,128 1,158 1,206 5.699}
{0 CHEMBL220629,14 1,15 1,27 1,83 1,117 1,127 1,128 1,158 1,206 6.301}
{0 CHEMBL220679,6 1,10 1,11 1,12 1,14 1,15 1,18 1,27 1,117 1,127 1,128 1,158 1,206 6.222}
{0 CHEMBL220686,5 1,7 1,14 1,15 1,27 1,52 1,117 1,127 1,128 1,151 1,158 1,206 4.469}
{0 CHEMBL220687,7 1,14 1,15 1,24 1,27 1,127 1,128 1,130 1,158 1,169 1,206 4.523}
{0 CHEMBL220729,14 1,15 1,22 1,27 1,127 1,128 1,158 1,206 4}
{0 CHEMBL220731,7 1,14 1,15 1,24 1,27 1,127 1,128 1,158 1,169 1,187 1,206 4.523}
{0 CHEMBL220770,14 1,15 1,27 1,28 1,127 1,128 1,158 1,206 7.699}
{0 CHEMBL220784,14 1,15 1,27 1,127 1,128 1,158 1,206 6.523}
{0 CHEMBL221362,5 1,6 1,7 1,8 1,14 1,27 1,46 1,83 1,127 1,128 1,158 1,177 1,179 1,206 4.71}
{0 CHEMBL221512,14 1,15 1,27 1,127 1,128 1,158 1,177 1,179 1,184 1,206 7.796}
{0 CHEMBL221669,5 1,6 1,7 1,10 1,11 1,13 1,14 1,18 1,24 1,27 1,127 1,128 1,158 1,160 1,206 4.257}
{0 CHEMBL221830,5 1,6 1,7 1,10 1,11 1,14 1,18 1,24 1,27 1,50 1,127 1,128 1,158 1,160 1,206 4.783}
{0 CHEMBL221873,5 1,6 1,7 1,8 1,9 1,14 1,22 1,24 1,27 1,127 1,128 1,144 1,158 1,177 1,179 1,206 4}
{0 CHEMBL222149,5 1,6 1,7 1,8 1,9 1,14 1,27 1,29 1,127 1,128 1,158 1,177 1,179 1,206 5.848}
{0 CHEMBL222190,5 1,6 1,7 1,10 1,11 1,13 1,14 1,18 1,24 1,27 1,127 1,128 1,133 1,158 1,160 1,206 4.943}
{0 CHEMBL222292,4 1,5 1,6 1,7 1,10 1,11 1,13 1,14 1,18 1,24 1,27 1,127 1,128 1,133 1,158 1,160 1,206 5.027}
{0 CHEMBL222644,14 1,15 1,27 1,127 1,128 1,158 1,177 1,179 1,184 1,206 8}
{0 CHEMBL222660,5 1,6 1,7 1,9 1,14 1,24 1,27 1,83 1,127 1,128 1,158 1,160 1,206 4}
{0 CHEMBL222711,5 1,6 1,7 1,8 1,9 1,14 1,27 1,127 1,128 1,158 1,177 1,179 1,206 4}
{0 CHEMBL222712,5 1,6 1,7 1,8 1,9 1,10 1,11 1,12 1,13 1,14 1,18 1,27 1,127 1,128 1,158 1,177 1,179 1,206 6.215}
{0 CHEMBL222752,14 1,21 1,27 1,127 1,128 1,130 1,158 1,165 1,177 1,179 1,206 8.097}
{0 CHEMBL222795,14 1,25 1,27 1,28 1,88 1,127 1,128 1,158 1,177 1,179 1,206 4}
{0 CHEMBL222849,14 1,25 1,27 1,28 1,88 1,127 1,128 1,158 1,177 1,179 1,206 4}
{0 CHEMBL222851,5 1,6 1,7 1,8 1,9 1,14 1,27 1,127 1,128 1,158 1,177 1,179 1,206 5.577}
{0 CHEMBL222891,14 1,18 1,27 1,78 1,127 1,128 1,158 1,177 1,179 1,206 4}
{0 CHEMBL222988,5 1,6 1,7 1,10 1,11 1,14 1,18 1,24 1,27 1,127 1,128 1,158 1,160 1,206 4.678}
{0 CHEMBL222989,11 1,14 1,22 1,27 1,127 1,128 1,158 1,177 1,179 1,206 4}
{0 CHEMBL222999,14 1,18 1,27 1,127 1,128 1,158 1,177 1,206 4.642}
{0 CHEMBL223000,14 1,18 1,27 1,127 1,128 1,158 1,177 1,179 1,206 6.538}
{0 CHEMBL223001,14 1,27 1,78 1,127 1,128 1,158 1,177 1,179 1,206 4.444}
{0 CHEMBL223039,5 1,6 1,7 1,10 1,11 1,13 1,14 1,18 1,24 1,27 1,127 1,128 1,133 1,158 1,206 6.229}
{0 CHEMBL223254,5 1,6 1,7 1,14 1,24 1,27 1,127 1,128 1,158 1,206 4}
{0 CHEMBL223406,7 1,14 1,15 1,27 1,32 1,63 1,127 1,128 1,158 1,206 4}
{0 CHEMBL223785,5 1,6 1,7 1,14 1,24 1,27 1,51 1,83 1,127 1,128 1,158 1,160 1,206 4}
{0 CHEMBL224822,5 1,6 1,7 1,10 1,11 1,12 1,13 1,14 1,18 1,24 1,27 1,127 1,128 1,158 1,160 1,206 4.268}
{0 CHEMBL224884,5 1,6 1,7 1,14 1,24 1,27 1,127 1,128 1,158 1,160 1,206 4}
{0 CHEMBL224988,5 1,6 1,7 1,10 1,11 1,13 1,14 1,18 1,24 1,27 1,127 1,128 1,133 1,158 1,160 1,206 4}
{0 CHEMBL225169,10 1,11 1,12 1,13 1,14 1,18 1,27 1,127 1,128 1,158 1,177 1,179 1,206 7.18}
{0 CHEMBL225175,7 1,14 1,27 1,127 1,128 1,158 1,177 1,179 1,206 4}
{0 CHEMBL226938,14 1,15 1,21 1,27 1,117 1,127 1,128 1,130 1,158 1,206 5.699}
{0 CHEMBL226990,14 1,15 1,27 1,117 1,127 1,128 1,158 1,206 6.699}
{0 CHEMBL227046,14 1,15 1,27 1,117 1,127 1,128 1,158 1,206 5.921}
{0 CHEMBL227075,13 1,14 1,27 1,127 1,128 1,158 1,184 1,206 6.4}
{0 CHEMBL235287,15 1,27 1,158 1,206 7.143}
{0 CHEMBL235288,14 1,27 1,111 1,127 1,128 1,158 1,206 5.281}
{0 CHEMBL235289,14 1,27 1,56 1,127 1,128 1,135 1,158 1,206 6.244}
{0 CHEMBL235290,14 1,27 1,127 1,128 1,158 1,184 1,206 5.269}
{0 CHEMBL235490,14 1,27 1,83 1,127 1,128 1,158 1,206 4}
{0 CHEMBL235503,14 1,15 1,27 1,56 1,127 1,128 1,158 1,206 8.824}
{0 CHEMBL235504,14 1,15 1,27 1,117 1,127 1,128 1,158 1,206 5.268}
{0 CHEMBL235931,14 1,27 1,127 1,128 1,158 1,206 5.526}
{0 CHEMBL236337,14 1,27 1,127 1,128 1,158 1,168 1,206 4}
{0 CHEMBL236340,14 1,27 1,127 1,128 1,135 1,158 1,168 1,206 5.009}
{0 CHEMBL242067,10 1,11 1,12 1,13 1,14 1,18 1,27 1,127 1,128 1,158 1,168 1,206 7}
{0 CHEMBL242287,10 1,11 1,12 1,13 1,14 1,18 1,27 1,98 1,127 1,128 1,158 1,206 6.432}
{0 CHEMBL242288,10 1,11 1,13 1,14 1,18 1,27 1,127 1,128 1,158 1,206 5.248}
{0 CHEMBL242296,14 1,18 1,27 1,50 1,74 1,127 1,128 1,158 1,206 4}
{0 CHEMBL242506,14 1,18 1,27 1,50 1,74 1,127 1,128 1,158 1,168 1,206 4}
{0 CHEMBL242721,10 1,11 1,12 1,13 1,14 1,18 1,27 1,98 1,127 1,128 1,158 1,206 6.585}
{0 CHEMBL242722,10 1,11 1,12 1,13 1,14 1,18 1,27 1,98 1,127 1,128 1,158 1,206 6.495}
{0 CHEMBL242768,7 1,10 1,11 1,13 1,14 1,18 1,27 1,98 1,127 1,128 1,158 1,179 1,206 6.004}
{0 CHEMBL242930,10 1,11 1,12 1,14 1,18 1,27 1,98 1,127 1,128 1,158 1,206 6.854}
{0 CHEMBL242931,10 1,11 1,13 1,14 1,18 1,27 1,98 1,127 1,128 1,158 1,206 7.04}
{0 CHEMBL242932,14 1,18 1,27 1,74 1,127 1,128 1,158 1,168 1,206 6.77}
{0 CHEMBL244213,7 1,10 1,11 1,12 1,13 1,14 1,18 1,27 1,127 1,128 1,158 1,168 1,179 1,206 4}
{0 CHEMBL244425,7 1,10 1,11 1,12 1,13 1,14 1,18 1,27 1,98 1,127 1,128 1,158 1,179 1,206 6.319}
{0 CHEMBL244426,7 1,10 1,11 1,13 1,14 1,18 1,27 1,127 1,128 1,158 1,179 1,206 6.721}
{0 CHEMBL244427,7 1,10 1,11 1,13 1,14 1,18 1,27 1,98 1,127 1,128 1,158 1,179 1,206 6.137}
{0 CHEMBL244428,7 1,10 1,11 1,12 1,13 1,14 1,18 1,27 1,98 1,127 1,128 1,158 1,179 1,206 6.638}
{0 CHEMBL244630,7 1,10 1,11 1,12 1,14 1,18 1,27 1,98 1,127 1,128 1,158 1,179 1,206 6.177}
{0 CHEMBL244631,7 1,10 1,11 1,13 1,14 1,18 1,27 1,98 1,127 1,128 1,158 1,179 1,206 6.585}
{0 CHEMBL244632,7 1,14 1,18 1,27 1,50 1,74 1,127 1,128 1,158 1,168 1,179 1,206 4}
{0 CHEMBL244633,10 1,11 1,13 1,14 1,18 1,27 1,98 1,127 1,128 1,158 1,206 6.733}
{0 CHEMBL254426,1 1,2 1,3 1,4 1,5 1,6 1,7 1,8 1,9 1,10 1,11 1,12 1,13 1,18 1,27 1,127 1,128 1,158 1,206 4.863}
{0 CHEMBL258820,14 1,15 1,21 1,27 1,28 1,127 1,128 1,130 1,158 1,206 7}
{0 CHEMBL260535,14 1,15 1,21 1,22 1,27 1,127 1,128 1,130 1,158 1,205 1,206 4.585}
{0 CHEMBL260747,14 1,15 1,22 1,27 1,127 1,128 1,158 1,205 1,206 4}
{0 CHEMBL261172,14 1,15 1,27 1,89 1,127 1,128 1,158 1,206 8.347}
{0 CHEMBL270284,14 1,15 1,27 1,127 1,128 1,131 1,158 1,159 1,191 1,198 1,206 4}
{0 CHEMBL270373,15 1,18 1,21 1,26 1,27 1,158 1,206 7.523}
{0 CHEMBL270374,15 1,18 1,21 1,27 1,158 1,206 6.89}
{0 CHEMBL270375,15 1,18 1,21 1,27 1,158 1,206 7.15}
{0 CHEMBL271380,14 1,15 1,22 1,27 1,127 1,128 1,158 1,206 4.77}
{0 CHEMBL271382,14 1,15 1,21 1,27 1,127 1,128 1,130 1,131 1,158 1,159 1,191 1,198 1,206 4.046}
{0 CHEMBL271389,14 1,15 1,21 1,22 1,27 1,127 1,128 1,130 1,158 1,206 4.432}
{0 CHEMBL271789,14 1,15 1,22 1,27 1,127 1,128 1,158 1,205 1,206 4}
{0 CHEMBL272038,14 1,15 1,27 1,28 1,127 1,128 1,158 1,206 7.796}
{0 CHEMBL272111,14 1,15 1,27 1,28 1,127 1,128 1,158 1,206 7.585}
{0 CHEMBL272228,14 1,15 1,22 1,27 1,127 1,128 1,158 1,206 5.62}
{0 CHEMBL272830,14 1,15 1,21 1,27 1,89 1,127 1,128 1,130 1,158 1,206 6.569}
{0 CHEMBL273139,15 1,18 1,21 1,26 1,27 1,158 1,206 7.745}
{0 CHEMBL284028,10 1,11 1,15 1,18 1,22 1,37 1,127 1,128 1,206 4}
{0 CHEMBL285678,14 1,15 1,27 1,127 1,128 1,158 1,206 5}
{0 CHEMBL290634,7 1,15 1,19 1,27 1,77 1,127 1,128 1,133 1,135 1,158 1,206 4.048}
{0 CHEMBL292454,18 1,21 1,27 1,111 1,127 1,128 1,158 1,206 8}
{0 CHEMBL293277,14 1,18 1,27 1,127 1,128 1,158 1,168 1,206 8.398}
{0 CHEMBL317094,7 1,16 1,17 1,19 1,20 1,22 1,23 1,27 1,127 1,128 1,142 1,158 1,206 3.541}
{0 CHEMBL325480,5 1,6 1,7 1,9 1,10 1,11 1,12 1,13 1,14 1,18 1,24 1,27 1,127 1,128 1,158 1,160 1,206 4.57}
{0 CHEMBL326294,5 1,6 1,7 1,9 1,14 1,24 1,27 1,127 1,128 1,158 1,160 1,206 4}
{0 CHEMBL327012,5 1,6 1,7 1,9 1,10 1,11 1,12 1,13 1,14 1,18 1,24 1,27 1,127 1,128 1,158 1,160 1,206 5.914}
{0 CHEMBL329187,15 1,18 1,21 1,26 1,27 1,158 1,206 5.301}
{0 CHEMBL333636,5 1,6 1,7 1,14 1,24 1,27 1,50 1,127 1,128 1,158 1,160 1,206 4}
{0 CHEMBL35925,14 1,15 1,27 1,127 1,128 1,135 1,158 1,202 1,206 6}
{0 CHEMBL361170,14 1,15 1,27 1,93 1,127 1,128 1,158 1,198 1,206 8}
{0 CHEMBL361529,14 1,15 1,27 1,93 1,117 1,127 1,128 1,158 1,198 1,206 6.301}
{0 CHEMBL362705,14 1,15 1,27 1,93 1,127 1,128 1,158 1,198 1,206 4.699}
{0 CHEMBL362996,14 1,27 1,127 1,128 1,158 1,168 1,206 8.099}
{0 CHEMBL363186,27 1,58 1,158 1,206 4}
{0 CHEMBL363535,14 1,15 1,27 1,117 1,127 1,128 1,158 1,206 4.581}
{0 CHEMBL363855,14 1,27 1,127 1,128 1,158 1,168 1,204 1,206 4}
{0 CHEMBL363919,15 1,27 1,158 1,206 4}
{0 CHEMBL364588,15 1,27 1,158 1,206 4.772}
{0 CHEMBL364729,18 1,27 1,158 1,206 5.264}
{0 CHEMBL364734,14 1,27 1,127 1,128 1,158 1,168 1,197 1,206 4.815}
{0 CHEMBL364893,7 1,14 1,15 1,27 1,93 1,127 1,128 1,158 1,179 1,206 4}
{0 CHEMBL365129,27 1,127 1,128 1,158 1,206 4}
{0 CHEMBL365161,27 1,48 1,158 1,169 1,181 1,206 7.053}
{0 CHEMBL365392,10 1,11 1,13 1,14 1,18 1,27 1,98 1,127 1,128 1,158 1,206 5.782}
{0 CHEMBL365445,14 1,15 1,27 1,93 1,127 1,128 1,158 1,206 6.67}
{0 CHEMBL365517,10 1,14 1,27 1,127 1,128 1,135 1,158 1,168 1,206 4}
{0 CHEMBL365809,27 1,158 1,206 4}
{0 CHEMBL365982,7 1,27 1,127 1,128 1,179 1,206 4}
{0 CHEMBL366205,10 1,11 1,12 1,13 1,14 1,18 1,22 1,27 1,127 1,128 1,158 1,206 4}
{0 CHEMBL366907,14 1,15 1,27 1,127 1,128 1,158 1,206 7.699}
{0 CHEMBL366959,14 1,15 1,27 1,117 1,127 1,128 1,158 1,206 5.699}
{0 CHEMBL367966,14 1,15 1,27 1,127 1,128 1,135 1,158 1,202 1,206 8.523}
{0 CHEMBL36994,20 1,27 1,49 1,83 1,127 1,128 1,158 1,206 4.046}
{0 CHEMBL370059,14 1,22 1,27 1,41 1,127 1,128 1,158 1,168 1,206 6.281}
{0 CHEMBL370299,7 1,14 1,27 1,83 1,127 1,128 1,158 1,168 1,179 1,206 4}
{0 CHEMBL371181,14 1,15 1,27 1,93 1,127 1,128 1,158 1,206 5.93}
{0 CHEMBL371371,27 1,158 1,206 4}
{0 CHEMBL371523,14 1,27 1,60 1,127 1,128 1,158 1,168 1,204 1,206 4.585}
{0 CHEMBL371858,14 1,27 1,127 1,128 1,158 1,168 1,206 6.902}
{0 CHEMBL372716,14 1,15 1,27 1,127 1,128 1,158 1,206 6.439}
{0 CHEMBL372856,14 1,27 1,83 1,92 1,127 1,128 1,135 1,158 1,168 1,206 4}
{0 CHEMBL373345,14 1,15 1,27 1,93 1,127 1,128 1,158 1,206 6.9}
{0 CHEMBL373555,10 1,14 1,15 1,18 1,27 1,127 1,128 1,158 1,206 7}
{0 CHEMBL373606,14 1,15 1,18 1,27 1,74 1,127 1,128 1,158 1,184 1,206 6.699}
{0 CHEMBL373715,5 1,6 1,7 1,10 1,11 1,13 1,14 1,18 1,24 1,27 1,127 1,128 1,158 1,206 5.257}
{0 CHEMBL373781,14 1,27 1,127 1,128 1,158 1,177 1,179 1,206 5.807}
{0 CHEMBL374235,14 1,15 1,27 1,117 1,127 1,128 1,135 1,158 1,206 6.699}
{0 CHEMBL374331,5 1,6 1,7 1,14 1,27 1,50 1,127 1,128 1,158 1,177 1,179 1,206 5.79}
{0 CHEMBL374629,5 1,6 1,7 1,14 1,24 1,27 1,127 1,128 1,158 1,160 1,206 4}
{0 CHEMBL374740,5 1,6 1,7 1,10 1,11 1,12 1,14 1,18 1,24 1,27 1,127 1,128 1,133 1,158 1,160 1,206 5.453}
{0 CHEMBL374758,5 1,6 1,7 1,9 1,10 1,11 1,13 1,14 1,18 1,27 1,127 1,128 1,158 1,177 1,179 1,206 4.444}
{0 CHEMBL374895,2 1,4 1,7 1,14 1,15 1,27 1,32 1,63 1,127 1,128 1,158 1,206 6.699}
{0 CHEMBL374905,14 1,15 1,25 1,27 1,28 1,88 1,127 1,128 1,158 1,177 1,179 1,206 4}
{0 CHEMBL374970,14 1,27 1,49 1,78 1,127 1,128 1,158 1,177 1,179 1,206 5.114}
{0 CHEMBL375078,5 1,6 1,7 1,14 1,22 1,24 1,27 1,41 1,127 1,128 1,158 1,160 1,206 4}
{0 CHEMBL375126,10 1,11 1,13 1,14 1,18 1,21 1,27 1,127 1,128 1,130 1,158 1,165 1,177 1,179 1,206 7.509}
{0 CHEMBL375304,5 1,6 1,7 1,8 1,9 1,14 1,24 1,27 1,127 1,128 1,158 1,177 1,179 1,206 5.362}
{0 CHEMBL376201,14 1,15 1,27 1,63 1,109 1,127 1,128 1,158 1,198 1,206 5.523}
{0 CHEMBL376228,5 1,6 1,7 1,9 1,10 1,11 1,13 1,14 1,18 1,24 1,27 1,127 1,128 1,158 1,206 5.084}
{0 CHEMBL376290,5 1,6 1,7 1,10 1,11 1,12 1,14 1,18 1,24 1,27 1,127 1,128 1,158 1,160 1,206 4.467}
{0 CHEMBL376291,10 1,11 1,12 1,13 1,14 1,18 1,21 1,27 1,127 1,128 1,130 1,158 1,165 1,177 1,179 1,206 7.602}
{0 CHEMBL376417,14 1,15 1,20 1,27 1,127 1,128 1,158 1,206 5.097}
{0 CHEMBL376435,5 1,6 1,7 1,14 1,18 1,24 1,27 1,74 1,127 1,128 1,158 1,160 1,206 4.883}
{0 CHEMBL376518,14 1,18 1,27 1,127 1,128 1,158 1,177 1,179 1,206 6.886}
{0 CHEMBL385132,5 1,6 1,7 1,8 1,9 1,10 1,11 1,12 1,13 1,14 1,18 1,27 1,127 1,128 1,158 1,177 1,179 1,206 6.237}
{0 CHEMBL385799,5 1,6 1,7 1,9 1,10 1,11 1,13 1,14 1,18 1,24 1,27 1,127 1,128 1,158 1,206 5.52}
{0 CHEMBL385800,5 1,6 1,7 1,10 1,11 1,12 1,14 1,18 1,24 1,27 1,127 1,128 1,158 1,206 6.051}
{0 CHEMBL386000,14 1,27 1,78 1,127 1,128 1,158 1,177 1,179 1,206 4.757}
{0 CHEMBL388883,14 1,18 1,27 1,50 1,74 1,127 1,128 1,158 1,206 4}
{0 CHEMBL39412,14 1,15 1,27 1,89 1,127 1,158 1,206 5.046}
{0 CHEMBL394557,7 1,10 1,11 1,13 1,14 1,18 1,27 1,127 1,128 1,158 1,168 1,179 1,206 5.886}
{0 CHEMBL394806,7 1,10 1,11 1,14 1,18 1,27 1,127 1,128 1,158 1,168 1,179 1,206 6}
{0 CHEMBL394807,7 1,14 1,18 1,27 1,74 1,127 1,128 1,158 1,168 1,179 1,206 6.06}
{0 CHEMBL395018,10 1,11 1,13 1,14 1,18 1,27 1,98 1,127 1,128 1,158 1,206 7.46}
{0 CHEMBL395019,14 1,18 1,27 1,50 1,74 1,127 1,128 1,158 1,168 1,206 4}
{0 CHEMBL395652,14 1,27 1,50 1,54 1,127 1,128 1,158 1,206 4}
{0 CHEMBL395653,14 1,27 1,56 1,127 1,128 1,158 1,206 7.509}
{0 CHEMBL395654,14 1,27 1,127 1,128 1,158 1,177 1,179 1,184 1,206 5.812}
{0 CHEMBL396977,7 1,10 1,11 1,12 1,13 1,14 1,18 1,27 1,127 1,128 1,158 1,168 1,179 1,206 5.504}
{0 CHEMBL397739,10 1,11 1,13 1,14 1,18 1,27 1,127 1,128 1,158 1,168 1,206 6.523}
{0 CHEMBL398109,14 1,15 1,27 1,42 1,93 1,127 1,128 1,158 1,206 6.824}
{0 CHEMBL402615,18 1,21 1,27 1,158 1,206 6.1}
{0 CHEMBL406659,14 1,15 1,27 1,127 1,128 1,131 1,158 1,159 1,191 1,198 1,206 5.155}
{0 CHEMBL40988,27 1,127 1,128 1,135 1,158 1,206 3.443}
{0 CHEMBL413727,15 1,18 1,21 1,26 1,27 1,127 1,128 1,158 1,206 9.301}
{0 CHEMBL422064,15 1,18 1,21 1,26 1,27 1,158 1,206 5.319}
{0 CHEMBL424976,14 1,15 1,27 1,93 1,117 1,127 1,128 1,158 1,198 1,206 7.523}
{0 CHEMBL425192,14 1,22 1,27 1,127 1,128 1,144 1,158 1,168 1,206 4}
{0 CHEMBL426230,14 1,15 1,27 1,117 1,127 1,128 1,158 1,206 4.151}
{0 CHEMBL426410,14 1,15 1,27 1,63 1,127 1,128 1,158 1,206 4.301}
{0 CHEMBL426562,5 1,6 1,7 1,8 1,9 1,14 1,27 1,127 1,128 1,158 1,177 1,179 1,206 5.726}
{0 CHEMBL426967,14 1,15 1,27 1,93 1,117 1,127 1,128 1,158 1,198 1,206 7.097}
{0 CHEMBL433282,14 1,27 1,127 1,128 1,135 1,158 1,206 7.799}
{0 CHEMBL435109,14 1,27 1,83 1,127 1,128 1,158 1,168 1,206 5.811}
{0 CHEMBL437373,7 1,10 1,11 1,12 1,14 1,18 1,27 1,127 1,128 1,158 1,168 1,179 1,206 6.77}
{0 CHEMBL440542,15 1,18 1,21 1,27 1,158 1,206 6.48}
{0 CHEMBL441556,14 1,15 1,22 1,27 1,32 1,41 1,63 1,127 1,128 1,158 1,206 4}
{0 CHEMBL441735,14 1,15 1,27 1,89 1,127 1,128 1,158 1,206 7.523}
{0 CHEMBL442046,5 1,6 1,7 1,9 1,14 1,24 1,27 1,127 1,128 1,158 1,206 4}
{0 CHEMBL448073,1 1,2 1,3 1,4 1,5 1,6 1,7 1,8 1,9 1,10 1,11 1,18 1,27 1,127 1,128 1,158 1,206 4}
{0 CHEMBL448922,14 1,15 1,27 1,127 1,128 1,158 1,168 1,206 9.155}
{0 CHEMBL449475,7 1,15 1,18 1,27 1,51 1,158 1,206 5.48}
{0 CHEMBL449775,7 1,15 1,18 1,27 1,51 1,158 1,206 5.01}
{0 CHEMBL450158,3 1,14 1,15 1,27 1,127 1,128 1,158 1,206 4.959}
{0 CHEMBL451609,1 1,2 1,3 1,4 1,5 1,6 1,7 1,8 1,9 1,10 1,11 1,12 1,13 1,18 1,27 1,127 1,128 1,158 1,206 4}
{0 CHEMBL454233,5 1,6 1,7 1,8 1,9 1,17 1,27 1,127 1,128 1,158 1,206 4}
{0 CHEMBL455556,14 1,15 1,27 1,127 1,128 1,158 1,206 5.301}
{0 CHEMBL456450,14 1,15 1,27 1,118 1,127 1,128 1,158 1,159 1,206 7.097}
{0 CHEMBL45830,14 1,27 1,54 1,127 1,128 1,158 1,182 1,183 1,191 1,206 5.597}
{0 CHEMBL459324,17 1,25 1,27 1,28 1,121 1,127 1,128 1,139 1,158 1,159 1,184 1,206 2.201}
{0 CHEMBL460317,14 1,15 1,22 1,27 1,127 1,128 1,158 1,206 5.602}
{0 CHEMBL460806,7 1,15 1,18 1,27 1,51 1,158 1,206 4.83}
{0 CHEMBL460807,7 1,15 1,18 1,27 1,51 1,158 1,206 5.82}
{0 CHEMBL460808,7 1,15 1,18 1,27 1,51 1,158 1,206 4.1}
{0 CHEMBL460809,18 1,21 1,27 1,127 1,128 1,158 1,206 6.92}
{0 CHEMBL461163,14 1,15 1,22 1,27 1,93 1,127 1,128 1,158 1,198 1,205 1,206 4.398}
{0 CHEMBL461541,14 1,15 1,27 1,117 1,127 1,128 1,158 1,206 5}
{0 CHEMBL461544,14 1,15 1,18 1,27 1,74 1,127 1,128 1,158 1,184 1,206 7.222}
{0 CHEMBL462423,14 1,15 1,27 1,28 1,127 1,128 1,158 1,206 7.523}
{0 CHEMBL463556,7 1,15 1,18 1,27 1,51 1,158 1,206 5.72}
{0 CHEMBL464002,7 1,15 1,18 1,27 1,51 1,158 1,206 5.28}
{0 CHEMBL466961,14 1,15 1,22 1,27 1,93 1,127 1,128 1,158 1,198 1,205 1,206 4.398}
{0 CHEMBL467182,14 1,15 1,27 1,28 1,127 1,128 1,158 1,206 4.921}
{0 CHEMBL467368,14 1,15 1,19 1,27 1,127 1,128 1,158 1,163 1,167 1,206 6.921}
{0 CHEMBL467450,7 1,15 1,18 1,27 1,51 1,158 1,206 6.13}
{0 CHEMBL467451,7 1,15 1,18 1,27 1,51 1,158 1,206 6.1}
{0 CHEMBL467796,14 1,15 1,27 1,127 1,128 1,158 1,168 1,206 7.602}
{0 CHEMBL467817,14 1,15 1,27 1,93 1,127 1,128 1,158 1,198 1,206 7.398}
{0 CHEMBL468188,3 1,14 1,15 1,27 1,127 1,128 1,158 1,206 5.699}
{0 CHEMBL468189,3 1,14 1,15 1,27 1,127 1,128 1,158 1,206 6.699}
{0 CHEMBL468220,14 1,15 1,22 1,27 1,93 1,127 1,128 1,158 1,198 1,205 1,206 4}
{0 CHEMBL468221,14 1,15 1,27 1,89 1,127 1,128 1,158 1,206 5.699}
{0 CHEMBL468222,14 1,15 1,27 1,117 1,127 1,128 1,158 1,206 5.097}
{0 CHEMBL469050,14 1,15 1,27 1,127 1,128 1,158 1,168 1,206 8}
{0 CHEMBL469051,14 1,15 1,27 1,93 1,117 1,127 1,128 1,158 1,198 1,206 6.398}
{0 CHEMBL469198,14 1,15 1,27 1,93 1,117 1,127 1,128 1,158 1,198 1,206 7.523}
{0 CHEMBL476511,14 1,15 1,27 1,93 1,127 1,128 1,158 1,198 1,206 6.097}
{0 CHEMBL476512,14 1,15 1,27 1,117 1,127 1,128 1,158 1,206 4}
{0 CHEMBL477167,14 1,15 1,22 1,27 1,127 1,128 1,158 1,205 1,206 4.523}
{0 CHEMBL477371,14 1,15 1,27 1,127 1,128 1,158 1,168 1,206 7}
{0 CHEMBL477372,14 1,15 1,27 1,93 1,117 1,127 1,128 1,158 1,198 1,206 5.824}
{0 CHEMBL478014,5 1,6 1,7 1,15 1,22 1,24 1,27 1,50 1,51 1,127 1,128 1,141 1,158 1,184 1,206 5}
{0 CHEMBL478015,5 1,6 1,7 1,15 1,24 1,27 1,51 1,118 1,127 1,141 1,158 1,180 1,184 1,206 6.481}
{0 CHEMBL478187,14 1,15 1,27 1,127 1,128 1,158 1,206 4}
{0 CHEMBL478424,14 1,15 1,27 1,127 1,128 1,158 1,206 4.398}
{0 CHEMBL478858,5 1,6 1,7 1,15 1,22 1,24 1,27 1,51 1,118 1,127 1,141 1,158 1,184 1,206 5.745}
{0 CHEMBL479062,5 1,6 1,7 1,15 1,22 1,24 1,27 1,50 1,51 1,70 1,127 1,128 1,158 1,184 1,206 5.444}
{0 CHEMBL481,7 1,13 1,15 1,16 1,20 1,25 1,27 1,28 1,38 1,127 1,128 1,130 1,142 1,154 1,158 1,159 1,160 1,175 1,180 1,187 1,206 2.839}
{0 CHEMBL482441,1 1,2 1,3 1,4 1,5 1,6 1,7 1,8 1,9 1,10 1,11 1,13 1,18 1,27 1,127 1,128 1,158 1,206 4}
{0 CHEMBL482442,1 1,2 1,3 1,5 1,6 1,7 1,8 1,9 1,10 1,11 1,18 1,27 1,53 1,127 1,128 1,158 1,206 4}
{0 CHEMBL482639,1 1,2 1,3 1,4 1,5 1,6 1,7 1,8 1,9 1,10 1,11 1,12 1,13 1,18 1,27 1,127 1,128 1,158 1,206 4}
{0 CHEMBL482640,1 1,2 1,3 1,4 1,5 1,6 1,7 1,8 1,9 1,10 1,11 1,12 1,13 1,18 1,27 1,127 1,128 1,158 1,206 4}
{0 CHEMBL482650,1 1,2 1,3 1,4 1,5 1,6 1,7 1,8 1,9 1,10 1,11 1,12 1,13 1,18 1,27 1,127 1,128 1,158 1,206 4}
{0 CHEMBL482847,1 1,2 1,3 1,4 1,5 1,6 1,7 1,8 1,9 1,10 1,11 1,12 1,13 1,18 1,27 1,127 1,128 1,158 1,206 4}
{0 CHEMBL482848,1 1,2 1,3 1,4 1,5 1,6 1,7 1,8 1,9 1,10 1,11 1,12 1,13 1,18 1,27 1,127 1,128 1,158 1,206 4}
{0 CHEMBL482853,1 1,2 1,3 1,4 1,5 1,6 1,7 1,8 1,9 1,10 1,11 1,12 1,13 1,18 1,27 1,127 1,128 1,158 1,206 4}
{0 CHEMBL482854,1 1,2 1,3 1,4 1,5 1,6 1,7 1,8 1,9 1,10 1,11 1,12 1,13 1,18 1,27 1,53 1,127 1,128 1,158 1,206 4}
{0 CHEMBL483071,1 1,2 1,3 1,4 1,5 1,6 1,7 1,8 1,9 1,10 1,11 1,13 1,18 1,27 1,127 1,128 1,158 1,206 4}
{0 CHEMBL483072,1 1,2 1,3 1,5 1,6 1,7 1,8 1,9 1,10 1,11 1,18 1,27 1,53 1,127 1,128 1,158 1,206 4}
{0 CHEMBL483467,1 1,2 1,3 1,4 1,5 1,6 1,7 1,10 1,11 1,12 1,13 1,18 1,27 1,127 1,128 1,158 1,206 4}
{0 CHEMBL483468,1 1,2 1,3 1,4 1,5 1,6 1,7 1,10 1,11 1,12 1,13 1,18 1,27 1,127 1,128 1,158 1,206 4}
{0 CHEMBL483470,1 1,2 1,3 1,4 1,5 1,6 1,7 1,10 1,11 1,18 1,27 1,127 1,128 1,158 1,206 4}
{0 CHEMBL483471,1 1,2 1,3 1,4 1,5 1,6 1,7 1,10 1,11 1,12 1,13 1,18 1,27 1,127 1,128 1,158 1,206 4}
{0 CHEMBL483675,1 1,2 1,3 1,5 1,6 1,7 1,8 1,9 1,10 1,11 1,13 1,18 1,27 1,53 1,127 1,128 1,158 1,206 4}
{0 CHEMBL483676,1 1,2 1,3 1,4 1,5 1,6 1,7 1,8 1,9 1,10 1,11 1,12 1,13 1,18 1,27 1,127 1,128 1,158 1,206 4}
{0 CHEMBL483683,1 1,2 1,3 1,5 1,6 1,7 1,8 1,9 1,10 1,11 1,13 1,18 1,27 1,53 1,127 1,128 1,158 1,206 4}
{0 CHEMBL484275,27 1,124 1,127 1,128 1,158 1,206 4}
{0 CHEMBL484276,1 1,2 1,3 1,4 1,5 1,6 1,7 1,9 1,10 1,11 1,12 1,13 1,18 1,27 1,127 1,128 1,158 1,206 4}
{0 CHEMBL484698,1 1,2 1,3 1,5 1,6 1,7 1,8 1,9 1,10 1,11 1,13 1,18 1,27 1,127 1,128 1,158 1,206 4}
{0 CHEMBL485106,1 1,2 1,3 1,4 1,5 1,6 1,7 1,8 1,9 1,10 1,11 1,12 1,18 1,27 1,127 1,128 1,158 1,206 4}
{0 CHEMBL485107,1 1,2 1,3 1,4 1,5 1,6 1,7 1,8 1,9 1,10 1,11 1,18 1,27 1,127 1,128 1,158 1,206 4}
{0 CHEMBL485244,1 1,2 1,3 1,4 1,5 1,6 1,7 1,8 1,9 1,10 1,11 1,12 1,13 1,18 1,27 1,127 1,128 1,158 1,206 4}
{0 CHEMBL485245,1 1,2 1,3 1,4 1,5 1,6 1,7 1,8 1,9 1,10 1,11 1,13 1,18 1,27 1,127 1,128 1,158 1,206 4}
{0 CHEMBL486072,1 1,2 1,3 1,4 1,5 1,6 1,7 1,8 1,9 1,10 1,11 1,12 1,13 1,14 1,18 1,27 1,127 1,128 1,158 1,206 4}
{0 CHEMBL486277,1 1,2 1,3 1,4 1,5 1,6 1,7 1,8 1,9 1,10 1,11 1,12 1,13 1,14 1,18 1,27 1,127 1,128 1,158 1,206 4}
{0 CHEMBL487102,1 1,2 1,3 1,4 1,5 1,6 1,7 1,10 1,11 1,12 1,13 1,18 1,27 1,127 1,128 1,158 1,206 4}
{0 CHEMBL487299,1 1,2 1,3 1,4 1,5 1,6 1,7 1,8 1,9 1,14 1,27 1,127 1,128 1,158 1,206 4}
{0 CHEMBL487300,1 1,2 1,3 1,4 1,5 1,6 1,7 1,8 1,9 1,10 1,11 1,12 1,13 1,14 1,18 1,27 1,127 1,128 1,158 1,206 4}
{0 CHEMBL487303,1 1,2 1,3 1,4 1,5 1,6 1,7 1,10 1,11 1,18 1,27 1,127 1,128 1,158 1,206 4}
{0 CHEMBL487304,1 1,2 1,3 1,4 1,5 1,6 1,7 1,10 1,11 1,12 1,13 1,18 1,27 1,127 1,128 1,158 1,206 4}
{0 CHEMBL488111,1 1,2 1,3 1,4 1,5 1,6 1,7 1,8 1,9 1,10 1,11 1,12 1,13 1,18 1,22 1,27 1,41 1,50 1,127 1,128 1,158 1,206 4}
{0 CHEMBL488335,1 1,2 1,3 1,4 1,5 1,6 1,7 1,27 1,50 1,127 1,128 1,158 1,206 4}
{0 CHEMBL489005,1 1,2 1,3 1,4 1,5 1,6 1,7 1,10 1,11 1,12 1,13 1,18 1,27 1,127 1,128 1,158 1,206 4}
{0 CHEMBL489006,1 1,2 1,3 1,4 1,5 1,6 1,7 1,10 1,11 1,12 1,13 1,18 1,27 1,127 1,128 1,158 1,206 4}
{0 CHEMBL489652,1 1,2 1,3 1,4 1,5 1,6 1,7 1,10 1,11 1,12 1,13 1,18 1,27 1,127 1,128 1,158 1,206 4}
{0 CHEMBL491256,1 1,2 1,3 1,4 1,5 1,6 1,7 1,8 1,9 1,27 1,89 1,127 1,128 1,158 1,206 4}
{0 CHEMBL491262,1 1,2 1,3 1,4 1,5 1,6 1,7 1,8 1,9 1,10 1,11 1,14 1,18 1,27 1,127 1,128 1,158 1,206 4}
{0 CHEMBL492066,1 1,2 1,3 1,4 1,5 1,6 1,7 1,10 1,11 1,13 1,18 1,27 1,127 1,128 1,158 1,206 4}
{0 CHEMBL492067,1 1,2 1,3 1,4 1,5 1,6 1,7 1,10 1,11 1,12 1,18 1,27 1,127 1,128 1,158 1,206 4}
{0 CHEMBL499975,1 1,2 1,3 1,4 1,5 1,6 1,7 1,8 1,9 1,10 1,11 1,12 1,13 1,18 1,27 1,127 1,128 1,158 1,206 4}
{0 CHEMBL504330,14 1,15 1,22 1,27 1,93 1,127 1,128 1,158 1,198 1,205 1,206 4}
{0 CHEMBL509333,1 1,2 1,3 1,4 1,5 1,6 1,7 1,8 1,9 1,27 1,127 1,128 1,158 1,206 4}
{0 CHEMBL510996,7 1,18 1,27 1,51 1,127 1,128 1,158 1,206 4.86}
{0 CHEMBL512107,14 1,15 1,27 1,93 1,127 1,128 1,158 1,198 1,206 5.523}
{0 CHEMBL512965,14 1,15 1,27 1,93 1,127 1,128 1,158 1,198 1,206 6.824}
{0 CHEMBL513787,14 1,15 1,27 1,42 1,63 1,127 1,128 1,158 1,206 6.155}
{0 CHEMBL513892,5 1,6 1,7 1,15 1,24 1,27 1,50 1,51 1,127 1,128 1,141 1,158 1,184 1,206 6.194}
{0 CHEMBL514043,5 1,6 1,7 1,15 1,24 1,27 1,51 1,118 1,127 1,141 1,152 1,158 1,159 1,184 1,206 5}
{0 CHEMBL515490,14 1,15 1,22 1,27 1,127 1,128 1,158 1,205 1,206 4}
{0 CHEMBL515606,7 1,16 1,17 1,19 1,22 1,23 1,27 1,33 1,89 1,120 1,127 1,128 1,158 1,206 2.889}
{0 CHEMBL517827,5 1,6 1,7 1,15 1,22 1,24 1,27 1,50 1,51 1,127 1,128 1,141 1,158 1,184 1,206 5}
{0 CHEMBL519072,1 1,2 1,3 1,4 1,5 1,6 1,7 1,10 1,11 1,12 1,13 1,18 1,27 1,127 1,128 1,158 1,206 4}
{0 CHEMBL51931,14 1,27 1,127 1,128 1,158 1,206 8.602}
{0 CHEMBL519326,1 1,2 1,3 1,4 1,5 1,6 1,7 1,8 1,9 1,10 1,11 1,12 1,13 1,18 1,27 1,50 1,127 1,128 1,158 1,206 4}
{0 CHEMBL519501,1 1,2 1,3 1,5 1,6 1,7 1,8 1,9 1,10 1,11 1,12 1,13 1,18 1,27 1,53 1,127 1,128 1,158 1,206 4}
{0 CHEMBL520371,1 1,2 1,3 1,4 1,5 1,6 1,7 1,8 1,9 1,10 1,11 1,12 1,13 1,18 1,27 1,61 1,101 1,127 1,128 1,158 1,206 4}
{0 CHEMBL521072,1 1,2 1,3 1,4 1,5 1,6 1,7 1,8 1,9 1,10 1,11 1,12 1,13 1,18 1,22 1,27 1,41 1,127 1,128 1,158 1,206 4}
{0 CHEMBL521292,1 1,2 1,3 1,4 1,5 1,6 1,7 1,8 1,9 1,10 1,11 1,12 1,13 1,18 1,27 1,83 1,127 1,128 1,158 1,206 4}
{0 CHEMBL521447,1 1,2 1,3 1,4 1,5 1,6 1,7 1,8 1,9 1,10 1,11 1,12 1,18 1,27 1,127 1,128 1,158 1,206 4}
{0 CHEMBL521464,1 1,2 1,3 1,4 1,5 1,6 1,7 1,10 1,11 1,12 1,13 1,18 1,27 1,127 1,128 1,158 1,206 4}
{0 CHEMBL521499,1 1,2 1,3 1,4 1,5 1,6 1,7 1,8 1,9 1,10 1,11 1,13 1,18 1,27 1,127 1,128 1,158 1,206 4}
{0 CHEMBL52347,14 1,27 1,61 1,127 1,128 1,158 1,183 1,206 6.032}
{0 CHEMBL589355,18 1,21 1,27 1,110 1,127 1,128 1,130 1,158 1,206 5.01}
{0 CHEMBL589356,18 1,21 1,27 1,110 1,127 1,128 1,130 1,158 1,206 4.622}
{0 CHEMBL589417,18 1,27 1,28 1,83 1,89 1,110 1,127 1,128 1,158 1,206 5.77}
{0 CHEMBL589583,7 1,11 1,16 1,17 1,19 1,20 1,22 1,23 1,27 1,52 1,127 1,128 1,158 1,206 2.822}
{0 CHEMBL589821,7 1,16 1,17 1,18 1,19 1,20 1,24 1,27 1,97 1,117 1,154 1,158 1,204 1,206 2.448}
{0 CHEMBL590799,5 1,6 1,7 1,8 1,9 1,16 1,20 1,27 1,31 1,36 1,127 1,128 1,158 1,206 3.151}
{0 CHEMBL590800,7 1,11 1,15 1,16 1,19 1,20 1,22 1,23 1,27 1,59 1,93 1,127 1,128 1,158 1,206 3.103}
{0 CHEMBL591439,27 1,49 1,127 1,128 1,135 1,158 1,206 3.888}
{0 CHEMBL591584,18 1,27 1,28 1,83 1,89 1,110 1,127 1,128 1,158 1,206 6.153}
{0 CHEMBL591585,18 1,27 1,28 1,83 1,89 1,110 1,127 1,128 1,158 1,206 5.852}
{0 CHEMBL591586,18 1,27 1,28 1,83 1,89 1,110 1,127 1,128 1,158 1,206 5.822}
{0 CHEMBL591818,27 1,28 1,83 1,89 1,127 1,128 1,158 1,206 5.822}
{0 CHEMBL591819,18 1,27 1,28 1,83 1,89 1,110 1,127 1,128 1,158 1,206 5.721}
{0 CHEMBL592009,17 1,22 1,25 1,27 1,28 1,121 1,127 1,128 1,139 1,158 1,159 1,184 1,206 2.081}
{0 CHEMBL592011,18 1,27 1,28 1,83 1,89 1,110 1,127 1,128 1,158 1,206 6.522}
{0 CHEMBL592229,18 1,27 1,28 1,83 1,89 1,110 1,127 1,128 1,158 1,206 5.62}
{0 CHEMBL600685,18 1,21 1,27 1,110 1,127 1,128 1,130 1,158 1,206 5.01}
{0 CHEMBL601039,7 1,16 1,17 1,18 1,19 1,20 1,22 1,24 1,27 1,97 1,117 1,154 1,158 1,204 1,206 2.522}
{0 CHEMBL601045,7 1,16 1,17 1,18 1,19 1,20 1,24 1,27 1,97 1,117 1,154 1,158 1,204 1,206 3.012}
{0 CHEMBL601287,7 1,16 1,17 1,18 1,19 1,20 1,24 1,27 1,97 1,117 1,127 1,128 1,154 1,158 1,204 1,206 3.339}
{0 CHEMBL601463,18 1,21 1,27 1,110 1,127 1,128 1,130 1,158 1,206 4.622}
{0 CHEMBL602959,15 1,16 1,27 1,93 1,110 1,119 1,127 1,128 1,130 1,158 1,206 5.172}
{0 CHEMBL60569,14 1,27 1,127 1,128 1,158 1,177 1,179 1,206 5.269}
{0 CHEMBL607,16 1,23 1,25 1,27 1,28 1,127 1,128 1,139 1,144 1,158 1,206 2.721}
{0 CHEMBL79466,7 1,14 1,24 1,27 1,127 1,128 1,158 1,177 1,179 1,206 4}
{0 CHEMBL827,7 1,15 1,19 1,27 1,77 1,127 1,128 1,133 1,135 1,158 1,206 4.36}
{0 CHEMBL8320,27 1,158 1,177 1,206 4}
{0 CHEMBL838,7 1,11 1,16 1,19 1,22 1,23 1,27 1,127 1,128 1,158 1,206 3.132}
{0 CHEMBL86668,15 1,18 1,21 1,26 1,27 1,158 1,206 7.355}
{0 CHEMBL89506,15 1,18 1,21 1,27 1,158 1,206 7.753}
{0 CHEMBL89946,15 1,18 1,21 1,26 1,27 1,158 1,206 5.337}
{0 CHEMBL90039,27 1,127 1,128 1,158 1,206 4}
{0 CHEMBL90258,15 1,18 1,21 1,26 1,27 1,158 1,206 8}
{0 CHEMBL90308,15 1,18 1,21 1,26 1,27 1,158 1,206 7.189}
{0 CHEMBL91416,15 1,18 1,21 1,26 1,27 1,127 1,128 1,158 1,206 9}
{0 CHEMBL91417,15 1,18 1,21 1,26 1,27 1,127 1,128 1,158 1,206 8.301}
{0 CHEMBL93675,15 1,18 1,21 1,26 1,27 1,158 1,206 8.699}
