{
  "data_set_description": {
    "collection_date": "November 2013",
    "creator": "Dr Jeremy Besnard, Dr Ivan Olier, Dr Noureddin Sadawi, Dr Larisa Soldatova, Dr Crina Grosan, Prof Ross King, Dr Richard Bickerton, Prof Andrew Hopkins and Dr Willem van Hoorn",
    "default_target_attribute": "pXC50",
    "description": "This dataset contains QSAR data (from ChEMBL version 17) showing activity values (unit is pseudo-pCI50) of several compounds on drug target ChEMBL_ID: CHEMBL1075307 (TID: 102860), and it has 84 rows and 43 features (not including molecule IDs and class feature: molecule_id and pXC50). The features represent Basic Molecular Descriptors which were generated from SMILES strings.  Missing value imputation was applied to this dataset (By choosing the Median).",
    "description_version": "1",
    "file_id": "3519947",
    "format": "ARFF",
    "id": "34041",
    "licence": "Public",
    "md5_checksum": "6f5e9da236dc4af77304472768113dcd",
    "minio_url": "https://data.openml.org/datasets/0003/34041/dataset_34041.pq",
    "name": "QSAR-DATASET-FOR-DRUG-TARGET-CHEMBL1075307",
    "original_data_url": "https://www.ebi.ac.uk/chembl/target/inspect/CHEMBL1075307",
    "parquet_url": "https://data.openml.org/datasets/0003/34041/dataset_34041.pq",
    "processing_date": "2018-10-04 03:39:19",
    "row_id_attribute": "molecule_id",
    "status": "deactivated",
    "tag": [
      "MetaQSAR",
      "study_13"
    ],
    "upload_date": "2016-07-15T14:20:36",
    "url": "https://api.openml.org/data/v1/download/3519947/QSAR-DATASET-FOR-DRUG-TARGET-CHEMBL1075307.arff",
    "version": "10",
    "visibility": "public"
  }
}