"molecule_id","AMW","C.","H.","Me","Mi","Mp","Mv","MW","N.","nAB","nAT","nB","nBM","nBO","nBR","nBT","nC","nCL","nCsp","nCsp2","nCsp3","nDB","nF","nH","nHet","nHM","nI","nN","nO","nP","nS","nSK","nTB","nX","O.","RBF","RBN","SCBO","Se","Si","Sp","Sv","X.","pXC50"
{1 7.596,2 51.7,3 41.4,4 0.987,5 1.106,6 0.718,7 0.679,8 220.29,9 6.9,10 16,11 29,13 17,14 19,16 31,17 15,20 15,22 1,24 12,25 2,28 2,32 17,36 0.065,37 2,38 28,39 28.622,40 32.073,41 20.818,42 19.677,44 4.699}
{0 CHEMBL168956,1 8.217,2 51.7,3 37.9,4 1.005,5 1.118,6 0.716,7 0.692,8 238.28,9 6.9,10 16,11 29,13 17,14 20,16 31,17 15,20 15,22 1,23 1,24 11,25 3,28 2,32 18,34 1,36 0.065,37 2,38 29,39 29.134,40 32.412,41 20.756,42 20.06,43 3.4,44 5.301}
{0 CHEMBL171548,1 7.596,2 51.7,3 41.4,4 0.987,5 1.106,6 0.718,7 0.679,8 220.29,9 6.9,10 16,11 29,13 17,14 19,16 31,17 15,20 15,22 1,24 12,25 2,28 2,32 17,36 0.065,37 2,38 28,39 28.622,40 32.073,41 20.818,42 19.677,44 4.699}
{0 CHEMBL176991,1 8.429,2 45.8,3 41.7,4 0.992,5 1.107,6 0.738,7 0.681,8 202.3,9 8.3,10 10,11 24,13 11,14 15,16 25,17 11,19 1,20 8,21 2,24 10,25 3,26 1,28 2,31 1,32 14,33 1,36 0.12,37 3,38 22,39 23.814,40 26.577,41 17.705,42 16.337,44 4.357}
{0 CHEMBL1812498,1 7.903,2 50,3 39.3,4 0.994,5 1.113,6 0.717,7 0.685,8 221.28,9 10.7,10 16,11 28,13 17,14 19,16 30,17 14,20 14,22 1,24 11,25 3,28 3,32 17,36 0.067,37 2,38 28,39 27.84,40 31.156,41 20.063,42 19.171,44 4.745}
{0 CHEMBL1812506,1 8.217,2 51.7,3 37.9,4 1.005,5 1.118,6 0.716,7 0.692,8 238.28,9 6.9,10 16,11 29,13 17,14 20,16 31,17 15,20 15,22 1,23 1,24 11,25 3,28 2,32 18,34 1,36 0.065,37 2,38 29,39 29.134,40 32.412,41 20.756,42 20.06,43 3.4,44 5}
{0 CHEMBL1812507,1 8.784,2 51.7,3 37.9,4 0.998,5 1.104,6 0.747,7 0.707,8 254.73,9 6.9,10 16,11 29,13 17,14 20,16 31,17 15,18 1,20 15,22 1,24 11,25 3,26 1,28 2,32 18,34 1,36 0.065,37 2,38 29,39 28.945,40 32.017,41 21.676,42 20.504,43 3.4,44 4.398}
{0 CHEMBL1812512,1 8.784,2 51.7,3 37.9,4 0.998,5 1.104,6 0.747,7 0.707,8 254.73,9 6.9,10 16,11 29,13 17,14 20,16 31,17 15,18 1,20 15,22 1,24 11,25 3,26 1,28 2,32 18,34 1,36 0.065,37 2,38 29,39 28.945,40 32.017,41 21.676,42 20.504,43 3.4,44 4.699}
{0 CHEMBL1812513,1 10.317,2 51.7,3 37.9,4 0.995,5 1.1,6 0.765,7 0.714,8 299.18,9 6.9,10 16,11 29,13 17,14 20,15 1,16 31,17 15,20 15,22 1,24 11,25 3,26 1,28 2,32 18,34 1,36 0.065,37 2,38 29,39 28.851,40 31.914,41 22.171,42 20.702,43 3.4,44 4.398}
{0 CHEMBL1812515,1 7.585,2 48.5,3 42.4,4 0.995,5 1.112,6 0.698,7 0.664,8 250.32,9 6.1,10 16,11 33,13 17,14 21,16 35,17 16,20 15,21 1,22 1,24 14,25 3,28 2,29 1,32 19,35 3,36 0.086,37 3,38 30,39 32.833,40 36.697,41 23.034,42 21.918,44 4.398}
{0 CHEMBL1812520,1 8.784,2 51.7,3 37.9,4 0.998,5 1.104,6 0.747,7 0.707,8 254.73,9 6.9,10 16,11 29,13 17,14 20,16 31,17 15,18 1,20 15,22 1,24 11,25 3,26 1,28 2,32 18,34 1,36 0.065,37 2,38 29,39 28.945,40 32.017,41 21.676,42 20.504,43 3.4,44 4.699}
{0 CHEMBL1812526,1 8.217,2 51.7,3 37.9,4 1.005,5 1.118,6 0.716,7 0.692,8 238.28,9 6.9,10 16,11 29,13 17,14 20,16 31,17 15,20 15,22 1,23 1,24 11,25 3,28 2,32 18,34 1,36 0.065,37 2,38 29,39 29.134,40 32.412,41 20.756,42 20.06,43 3.4,44 4.301}
{0 CHEMBL1812528,1 10.317,2 51.7,3 37.9,4 0.995,5 1.1,6 0.765,7 0.714,8 299.18,9 6.9,10 16,11 29,13 17,14 20,15 1,16 31,17 15,20 15,22 1,24 11,25 3,26 1,28 2,32 18,34 1,36 0.065,37 2,38 29,39 28.851,40 31.914,41 22.171,42 20.702,43 3.4,44 4.699}
{0 CHEMBL1812531,1 8.217,2 51.7,3 37.9,4 1.005,5 1.118,6 0.716,7 0.692,8 238.28,9 6.9,10 16,11 29,13 17,14 20,16 31,17 15,20 15,22 1,23 1,24 11,25 3,28 2,32 18,34 1,36 0.065,37 2,38 29,39 29.134,40 32.412,41 20.756,42 20.06,43 3.4,44 5.523}
{0 CHEMBL1812532,1 6.836,2 47.8,3 47.8,4 0.979,5 1.112,6 0.688,7 0.637,8 157.23,9 4.3,10 10,11 23,13 11,14 13,16 24,17 11,20 10,21 1,22 1,24 11,25 1,28 1,32 12,36 0.042,37 1,38 19,39 22.52,40 25.574,41 15.813,42 14.655,44 4.097}
{0 CHEMBL1812533,1 7.91,2 53.3,3 40,4 0.997,5 1.111,6 0.717,7 0.686,8 237.29,9 3.3,10 16,11 30,13 17,14 20,16 32,17 16,20 16,22 1,23 1,24 12,25 2,28 1,32 18,34 1,36 0.063,37 2,38 29,39 29.916,40 33.329,41 21.512,42 20.566,43 3.3,44 4.398}
{0 CHEMBL1812535,1 8.509,2 53.3,3 36.7,4 1.014,5 1.122,6 0.715,7 0.698,8 255.28,9 3.3,10 16,11 30,13 17,14 21,16 32,17 16,20 16,22 1,23 2,24 11,25 3,28 1,32 19,34 2,36 0.063,37 2,38 30,39 30.429,40 33.669,41 21.449,42 20.949,43 6.7,44 5}
{0 CHEMBL1812538,1 7.862,2 50,3 41.2,4 1.004,5 1.116,6 0.698,7 0.671,8 267.32,9 2.9,10 16,11 34,13 17,14 22,16 36,17 17,20 16,21 1,22 1,23 1,24 14,25 3,28 1,29 1,32 20,34 1,35 2.9,36 0.083,37 3,38 31,39 34.127,40 37.954,41 23.728,42 22.807,43 2.9,44 5}
{0 CHEMBL1812539,1 8.461,2 54.8,3 35.5,4 1.004,5 1.11,6 0.734,7 0.712,8 262.3,9 6.5,10 16,11 31,13 18,14 22,16 33,17 17,19 1,20 16,22 1,23 1,24 11,25 3,28 2,32 20,33 1,34 1,36 0.061,37 2,38 33,39 31.134,40 34.412,41 22.756,42 22.06,43 3.2,44 6}
{0 CHEMBL1812540,1 8.822,2 50,3 34.4,4 1.025,5 1.12,6 0.708,7 0.703,8 282.29,9 6.3,10 16,11 32,13 19,14 23,16 34,17 16,20 16,22 3,23 1,24 11,25 5,28 2,29 2,32 21,34 1,35 6.3,36 0.088,37 3,38 34,39 32.789,40 35.831,41 22.665,42 22.49,43 3.1,44 5.523}
{0 CHEMBL1812541,1 8.01,2 52.4,3 38.1,4 0.993,5 1.107,6 0.728,7 0.696,8 168.21,9 9.5,10 10,11 21,13 12,14 14,16 22,17 11,19 1,20 10,22 1,24 8,25 2,28 2,32 13,33 1,36 0.045,37 1,38 22,39 20.854,40 23.242,41 15.296,42 14.623,44 4.886}
{0 CHEMBL1812542,1 8.01,2 52.4,3 38.1,4 0.993,5 1.107,6 0.728,7 0.696,8 168.21,9 9.5,10 10,11 21,13 12,14 14,16 22,17 11,19 1,20 10,22 1,24 8,25 2,28 2,32 13,33 1,36 0.045,37 1,38 22,39 20.854,40 23.242,41 15.296,42 14.623,44 4.097}
{0 CHEMBL1812543,1 8.867,2 52.4,3 33.3,4 1.017,5 1.123,6 0.725,7 0.715,8 186.2,9 9.5,10 10,11 21,13 12,14 15,16 22,17 11,19 1,20 10,22 1,23 1,24 7,25 3,28 2,32 14,33 1,34 1,36 0.045,37 1,38 23,39 21.367,40 23.582,41 15.233,42 15.007,43 4.8,44 5.523}
{0 CHEMBL1812544,1 8.45,2 44,3 36,4 1.011,5 1.133,6 0.702,7 0.686,8 211.25,9 20,10 15,11 25,13 16,14 18,16 27,17 11,20 11,22 1,24 9,25 5,28 5,32 16,36 0.074,37 2,38 26.5,39 25.276,40 28.322,41 17.551,42 17.161,44 5}
{0 CHEMBL1812545,1 9.17,2 44,3 32,4 1.032,5 1.146,6 0.7,7 0.702,8 229.24,9 20,10 15,11 25,13 16,14 19,16 27,17 11,20 11,22 1,23 1,24 8,25 6,28 5,32 17,34 1,36 0.074,37 2,38 27.5,39 25.789,40 28.662,41 17.489,42 17.544,43 4,44 4.77}
{0 CHEMBL1812546,1 8.432,2 46.2,3 38.5,4 1.026,5 1.128,6 0.679,7 0.672,8 219.23,9 3.8,10 10,11 26,13 12,14 17,16 27,17 12,20 11,21 1,22 2,23 1,24 10,25 4,28 1,29 2,32 16,34 1,35 7.7,36 0.111,37 3,38 24,39 26.687,40 29.333,41 17.659,42 17.468,43 3.8,44 5.699}
{0 CHEMBL1812547,1 8.922,2 47.8,3 34.8,4 1.035,5 1.127,6 0.691,7 0.693,8 205.2,9 4.3,10 10,11 23,13 12,14 16,16 24,17 11,20 11,22 2,23 1,24 8,25 4,28 1,29 2,32 15,34 1,35 8.7,36 0.083,37 2,38 23,39 23.804,40 25.918,41 15.898,42 15.942,43 4.3,44 5.523}
{0 CHEMBL1812548,1 7.968,2 45.8,3 41.7,4 1.015,5 1.13,6 0.675,7 0.656,8 191.22,9 4.2,10 10,11 24,13 11,14 15,16 25,17 11,20 10,21 1,22 1,23 1,24 10,25 3,28 1,29 1,32 14,34 1,35 4.2,36 0.08,37 2,38 21,39 24.36,40 27.123,41 16.205,42 15.754,43 4.2,44 4.097}
{0 CHEMBL1812549,1 8.461,2 54.8,3 35.5,4 1.004,5 1.11,6 0.734,7 0.712,8 262.3,9 6.5,10 16,11 31,13 18,14 22,16 33,17 17,19 1,20 16,22 1,23 1,24 11,25 3,28 2,32 20,33 1,34 1,36 0.061,37 2,38 33,39 31.134,40 34.412,41 22.756,42 22.06,43 3.2,44 4.097}
{0 CHEMBL1812550,1 8.609,2 46.7,3 36.7,4 1.026,5 1.128,6 0.689,7 0.683,8 258.27,9 6.7,10 10,11 30,13 13,14 20,16 31,17 14,19 1,20 11,21 2,22 2,23 1,24 11,25 5,28 2,29 2,32 19,33 1,34 1,35 6.7,36 0.129,37 4,38 29,39 30.789,40 33.831,41 20.665,42 20.49,43 3.3,44 4.097}
{0 CHEMBL1812551,1 9.592,2 50,3 29.2,4 1.043,5 1.125,6 0.714,7 0.727,8 230.21,9 8.3,10 10,11 24,13 13,14 18,16 25,17 12,19 1,20 11,22 2,23 1,24 7,25 5,28 2,29 2,32 17,33 1,34 1,35 8.3,36 0.08,37 2,38 27,39 25.022,40 27.001,41 17.142,42 17.436,43 4.2,44 4.097}
{0 CHEMBL1812552,1 9.585,2 46.2,3 30.8,4 1.056,5 1.128,6 0.685,7 0.707,8 249.21,9 3.8,10 10,11 26,13 13,14 19,16 27,17 12,20 12,22 3,23 1,24 8,25 6,28 1,29 4,32 18,34 1,35 15.4,36 0.111,37 3,38 27,39 27.458,40 29.336,41 17.807,42 18.371,43 3.8,44 4.097}
{0 CHEMBL1812553,1 7.171,2 48.4,3 45.2,4 0.984,5 1.113,6 0.696,7 0.652,8 222.31,9 6.5,10 16,11 31,13 16,14 19,16 33,17 15,20 13,21 2,24 14,25 2,28 2,32 17,36 0.091,37 3,38 27,39 30.505,40 34.488,41 21.58,42 20.204,44 4.097}
{0 CHEMBL1812554,1 8.084,2 55.6,3 37,4 0.99,5 1.098,6 0.743,7 0.709,8 218.27,9 7.4,10 16,11 27,13 17,14 19,16 29,17 15,19 2,20 13,24 10,25 2,28 2,32 17,33 1,38 29,39 26.738,40 29.657,41 20.057,42 19.15,44 5.222}
{0 CHEMBL1812654,1 7.81,2 50,3 40,4 0.993,5 1.112,6 0.715,7 0.681,8 156.2,9 10,10 10,11 20,13 11,14 13,16 21,17 10,19 1,20 8,21 1,24 8,25 2,28 2,32 12,33 1,36 0.048,37 1,38 20,39 19.854,40 22.242,41 14.296,42 13.623,44 4.097}
{0 CHEMBL1812655,1 7.401,2 47.8,3 43.5,4 0.989,5 1.116,6 0.698,7 0.659,8 170.23,9 8.7,10 10,11 23,13 11,14 14,16 24,17 11,19 1,20 8,21 2,24 10,25 2,28 2,32 13,33 1,36 0.083,37 2,38 21,39 22.738,40 25.657,41 16.057,42 15.15,44 4.097}
{0 CHEMBL1812656,1 8.82,2 42.9,3 33.3,4 1.019,5 1.138,6 0.704,7 0.697,8 185.21,9 23.8,10 15,11 21,13 15,14 16,16 23,17 9,20 9,24 7,25 5,28 5,32 14,36 0.043,37 1,38 23.5,39 21.393,40 23.907,41 14.79,42 14.634,44 4.097}
{0 CHEMBL1812657,1 8.302,2 41.7,3 37.5,4 1.012,5 1.138,6 0.69,7 0.673,8 199.24,9 20.8,10 15,11 24,13 15,14 17,16 26,17 10,20 9,21 1,24 9,25 5,28 5,32 15,36 0.077,37 2,38 24.5,39 24.276,40 27.322,41 16.551,42 16.161,44 4.097}
{0 CHEMBL1812658,1 7.899,2 40.7,3 40.7,4 1.006,5 1.138,6 0.678,7 0.655,8 213.27,9 18.5,10 15,11 27,13 15,14 18,16 29,17 11,20 9,21 2,24 11,25 5,28 5,32 16,36 0.103,37 3,38 25.5,39 27.16,40 30.737,41 18.313,42 17.687,44 4.097}
{0 CHEMBL1812659,1 7.818,2 45.2,3 45.2,4 0.987,5 1.11,6 0.717,7 0.658,8 242.37,9 6.5,10 15,11 31,13 15,14 19,16 33,17 14,20 12,21 2,24 14,25 3,26 1,28 2,31 1,32 17,36 0.121,37 4,38 26.5,39 30.582,40 34.408,41 22.228,42 20.391,44 4.097}
{0 CHEMBL1909733,1 12.448,2 44.4,3 33.3,4 1.017,5 1.12,6 0.772,7 0.73,8 224.07,9 16.7,10 11,11 18,13 11,14 13,15 1,16 19,17 8,20 8,24 6,25 4,26 1,28 3,32 12,34 1,36 0.053,37 1,38 18.5,39 18.302,40 20.167,41 13.892,42 13.143,43 5.6,44 4}
{0 CHEMBL1909734,1 9.979,2 44.4,3 33.3,4 1.022,5 1.126,6 0.744,7 0.719,8 179.62,9 16.7,10 11,11 18,13 11,14 13,16 19,17 8,18 1,20 8,24 6,25 4,26 1,28 3,32 12,34 1,36 0.053,37 1,38 18.5,39 18.396,40 20.269,41 13.398,42 12.945,43 5.6,44 4}
{0 CHEMBL1909735,1 9.065,2 44.4,3 33.3,4 1.033,5 1.148,6 0.693,7 0.695,8 163.17,9 16.7,10 11,11 18,13 11,14 13,16 19,17 8,20 8,23 1,24 6,25 4,28 3,32 12,34 1,36 0.053,37 1,38 18.5,39 18.585,40 20.665,41 12.477,42 12.501,43 5.6,44 4}
{0 CHEMBL193664,1 8.066,2 44.4,3 38.9,4 1.004,5 1.129,6 0.697,7 0.673,8 145.18,9 16.7,10 11,11 18,13 11,14 12,16 19,17 8,20 8,24 7,25 3,28 3,32 11,36 0.053,37 1,38 17.5,39 18.073,40 20.325,41 12.54,42 12.118,44 4}
{0 CHEMBL194853,1 7.581,2 42.9,3 42.9,4 0.998,5 1.131,6 0.681,7 0.65,8 159.21,9 14.3,10 11,11 21,13 11,14 13,16 22,17 9,20 8,21 1,24 9,25 3,28 3,32 12,36 0.045,37 1,38 18.5,39 20.956,40 23.741,41 14.301,42 13.645,44 4}
{0 CHEMBL196408,1 7.581,2 42.9,3 42.9,4 0.998,5 1.131,6 0.681,7 0.65,8 159.21,9 14.3,10 11,11 21,13 11,14 13,16 22,17 9,20 8,21 1,24 9,25 3,28 3,32 12,36 0.045,37 1,38 18.5,39 20.956,40 23.741,41 14.301,42 13.645,44 4}
{0 CHEMBL198194,1 8.01,2 40,3 40,4 1.009,5 1.141,6 0.677,7 0.657,8 160.2,9 20,10 11,11 20,13 11,14 13,16 21,17 8,20 8,24 8,25 4,28 4,32 12,36 0.048,37 1,38 18.5,39 20.174,40 22.824,41 13.546,42 13.139,44 4}
{0 CHEMBL198937,1 8.483,2 42.1,3 36.8,4 1.021,5 1.133,6 0.684,7 0.675,8 161.18,9 15.8,10 11,11 19,13 11,14 13,16 20,17 8,20 8,24 7,25 4,28 3,29 1,32 12,35 5.3,36 0.05,37 1,38 18.5,39 19.4,40 21.535,41 12.994,42 12.833,44 4}
{0 CHEMBL206816,1 8.009,2 50,3 40,4 1.009,5 1.104,6 0.698,7 0.677,8 160.18,10 11,11 20,13 11,14 13,16 21,17 10,20 10,24 8,25 2,29 2,32 12,35 10,38 18.5,39 20.189,40 22.08,41 13.955,42 13.537,44 5}
{0 CHEMBL2146496,1 10.624,2 41.2,3 29.4,4 1.036,5 1.138,6 0.744,7 0.732,8 180.61,9 23.5,10 11,11 17,13 11,14 13,16 18,17 7,18 1,20 7,24 5,25 5,26 1,28 4,32 12,34 1,36 0.056,37 1,38 18.5,39 17.615,40 19.352,41 12.642,42 12.44,43 5.9,44 4}
{0 CHEMBL2147989,1 9.979,2 44.4,3 33.3,4 1.022,5 1.126,6 0.744,7 0.719,8 179.62,9 16.7,10 11,11 18,13 11,14 13,16 19,17 8,18 1,20 8,24 6,25 4,26 1,28 3,32 12,34 1,36 0.053,37 1,38 18.5,39 18.396,40 20.269,41 13.398,42 12.945,43 5.6,44 4}
{0 CHEMBL2147990,1 8.957,2 47.4,3 31.6,4 1.015,5 1.127,6 0.725,7 0.716,8 170.19,9 21.1,10 11,11 19,13 12,14 14,16 20,17 9,19 1,20 8,24 6,25 4,28 4,32 13,33 1,36 0.05,37 1,38 21.5,39 19.291,40 21.408,41 13.784,42 13.612,44 4}
{0 CHEMBL2147991,1 10.151,2 42.9,3 28.6,4 1.071,5 1.179,6 0.672,7 0.705,8 213.18,9 14.3,10 11,11 21,13 11,14 16,16 22,17 9,20 8,21 1,23 3,24 6,25 6,28 3,32 15,34 3,36 0.045,37 1,38 21.5,39 22.494,40 24.76,41 14.114,42 14.795,43 14.3,44 4}
{0 CHEMBL2147992,1 7.218,2 41.7,3 45.8,4 0.993,5 1.131,6 0.669,7 0.632,8 173.24,9 12.5,10 11,11 24,13 11,14 14,16 25,17 10,20 8,21 2,24 11,25 3,28 3,32 13,36 0.08,37 2,38 19.5,39 23.84,40 27.156,41 16.063,42 15.171,44 4}
{0 CHEMBL2147993,1 9.509,2 40,3 30,4 1.047,5 1.141,6 0.685,7 0.702,8 190.18,9 20,10 11,11 20,13 13,14 15,16 21,17 8,20 8,22 2,24 6,25 6,28 4,29 2,32 14,35 10,36 0.095,37 2,38 22.5,39 20.945,40 22.827,41 13.693,42 14.042,44 4}
{0 CHEMBL2147994,1 9.065,2 44.4,3 33.3,4 1.033,5 1.148,6 0.693,7 0.695,8 163.17,9 16.7,10 11,11 18,13 11,14 13,16 19,17 8,20 8,23 1,24 6,25 4,28 3,32 12,34 1,36 0.053,37 1,38 18.5,39 18.585,40 20.665,41 12.477,42 12.501,43 5.6,44 4}
{0 CHEMBL2147995,1 13.239,2 41.2,3 29.4,4 1.031,5 1.132,6 0.773,7 0.743,8 225.06,9 23.5,10 11,11 17,13 11,14 13,15 1,16 18,17 7,20 7,24 5,25 5,26 1,28 4,32 12,34 1,36 0.056,37 1,38 18.5,39 17.52,40 19.25,41 13.137,42 12.638,43 5.9,44 4}
{0 CHEMBL2147996,1 9.656,2 41.2,3 29.4,4 1.047,5 1.162,6 0.69,7 0.706,8 164.16,9 23.5,10 11,11 17,13 11,14 13,16 18,17 7,20 7,23 1,24 5,25 5,28 4,32 12,34 1,36 0.056,37 1,38 18.5,39 17.804,40 19.748,41 11.722,42 11.996,43 5.9,44 4}
{0 CHEMBL2147997,1 10.709,2 40,3 25,4 1.086,5 1.192,6 0.668,7 0.714,8 214.17,9 20,10 11,11 20,13 11,14 16,16 21,17 8,20 7,21 1,23 3,24 5,25 7,28 4,32 15,34 3,36 0.048,37 1,38 21.5,39 21.713,40 23.843,41 13.358,42 14.289,43 15,44 4}
{0 CHEMBL2147998,1 8.483,2 42.1,3 36.8,4 1.021,5 1.133,6 0.684,7 0.675,8 161.18,9 15.8,10 11,11 19,13 11,14 13,16 20,17 8,20 8,24 7,25 4,28 3,29 1,32 12,35 5.3,36 0.05,37 1,38 18.5,39 19.4,40 21.535,41 12.994,42 12.833,44 4}
{0 CHEMBL2147999,1 8.01,2 40,3 40,4 1.009,5 1.141,6 0.677,7 0.657,8 160.2,9 20,10 11,11 20,13 11,14 13,16 21,17 8,20 8,24 8,25 4,28 4,32 12,36 0.048,37 1,38 18.5,39 20.174,40 22.824,41 13.546,42 13.139,44 4}
{0 CHEMBL2148000,1 9.065,2 44.4,3 33.3,4 1.033,5 1.148,6 0.693,7 0.695,8 163.17,9 16.7,10 11,11 18,13 11,14 13,16 19,17 8,20 8,23 1,24 6,25 4,28 3,32 12,34 1,36 0.053,37 1,38 18.5,39 18.585,40 20.665,41 12.477,42 12.501,43 5.6,44 4}
{0 CHEMBL2148001,1 7.218,2 41.7,3 45.8,4 0.993,5 1.131,6 0.669,7 0.632,8 173.24,9 12.5,10 11,11 24,13 11,14 14,16 25,17 10,20 8,21 2,24 11,25 3,28 3,32 13,36 0.08,37 2,38 19.5,39 23.84,40 27.156,41 16.063,42 15.171,44 4}
{0 CHEMBL2148002,1 10.151,2 42.9,3 28.6,4 1.071,5 1.179,6 0.672,7 0.705,8 213.18,9 14.3,10 11,11 21,13 11,14 16,16 22,17 9,20 8,21 1,23 3,24 6,25 6,28 3,32 15,34 3,36 0.045,37 1,38 21.5,39 22.494,40 24.76,41 14.114,42 14.795,43 14.3,44 4}
{0 CHEMBL2148074,1 10.296,2 42.1,3 31.6,4 1.038,5 1.13,6 0.729,7 0.719,8 195.62,9 15.8,10 11,11 19,13 11,14 14,16 20,17 8,18 1,20 8,24 6,25 5,26 1,28 3,29 1,32 13,34 1,35 5.3,36 0.05,37 1,38 19.5,39 19.724,40 21.479,41 13.852,42 13.66,43 5.3,44 4}
{0 CHEMBL2148075,1 9.221,2 42.9,3 38.1,4 1.013,5 1.128,6 0.722,7 0.689,8 193.65,9 14.3,10 11,11 21,13 11,14 14,16 22,17 9,18 1,20 8,21 1,24 8,25 4,26 1,28 3,32 13,34 1,36 0.045,37 1,38 19.5,39 21.28,40 23.685,41 15.159,42 14.472,43 4.8,44 4}
{0 CHEMBL2148076,1 11.892,2 44.4,3 27.8,4 1.04,5 1.123,6 0.792,7 0.765,8 214.06,9 16.7,10 11,11 18,13 11,14 14,16 19,17 8,18 2,20 8,24 5,25 5,26 2,28 3,32 13,34 2,36 0.053,37 1,38 19.5,39 18.72,40 20.213,41 14.256,42 13.773,43 11.1,44 4}
{0 CHEMBL2148077,1 11.892,2 44.4,3 27.8,4 1.04,5 1.123,6 0.792,7 0.765,8 214.06,9 16.7,10 11,11 18,13 11,14 14,16 19,17 8,18 2,20 8,24 5,25 5,26 2,28 3,32 13,34 2,36 0.053,37 1,38 19.5,39 18.72,40 20.213,41 14.256,42 13.773,43 11.1,44 4}
{0 CHEMBL355606,1 8.217,2 51.7,3 37.9,4 1.005,5 1.118,6 0.716,7 0.692,8 238.28,9 6.9,10 16,11 29,13 17,14 20,16 31,17 15,20 15,22 1,23 1,24 11,25 3,28 2,32 18,34 1,36 0.065,37 2,38 29,39 29.134,40 32.412,41 20.756,42 20.06,43 3.4,44 6}
{0 CHEMBL372363,1 7.964,2 40.9,3 40.9,4 1.013,5 1.134,6 0.671,7 0.653,8 175.21,9 13.6,10 11,11 22,13 11,14 14,16 23,17 9,20 8,21 1,24 9,25 4,28 3,29 1,32 13,35 4.5,36 0.087,37 2,38 19.5,39 22.284,40 24.95,41 14.756,42 14.359,44 4}
{0 CHEMBL382312,1 12.448,2 44.4,3 33.3,4 1.017,5 1.12,6 0.772,7 0.73,8 224.07,9 16.7,10 11,11 18,13 11,14 13,15 1,16 19,17 8,20 8,24 6,25 4,26 1,28 3,32 12,34 1,36 0.053,37 1,38 18.5,39 18.302,40 20.167,41 13.892,42 13.143,43 5.6,44 4}
{0 CHEMBL435072,1 8.217,2 51.7,3 37.9,4 1.005,5 1.118,6 0.716,7 0.692,8 238.28,9 6.9,10 16,11 29,13 17,14 20,16 31,17 15,20 15,22 1,23 1,24 11,25 3,28 2,32 18,34 1,36 0.065,37 2,38 29,39 29.134,40 32.412,41 20.756,42 20.06,43 3.4,44 5.523}
{0 CHEMBL441669,1 7.596,2 51.7,3 41.4,4 0.987,5 1.106,6 0.718,7 0.679,8 220.29,9 6.9,10 16,11 29,13 17,14 19,16 31,17 15,20 15,22 1,24 12,25 2,28 2,32 17,36 0.065,37 2,38 28,39 28.622,40 32.073,41 20.818,42 19.677,44 6}
{0 CHEMBL445966,1 8.14,2 47.8,3 39.1,4 1.013,5 1.112,6 0.694,7 0.676,8 187.21,9 4.3,10 10,11 23,13 12,14 15,16 24,17 11,20 11,22 2,24 9,25 3,28 1,29 2,32 14,35 8.7,36 0.083,37 2,38 22,39 23.291,40 25.578,41 15.96,42 15.558,44 4.745}
{0 CHEMBL449298,1 8.01,2 45,3 40,4 1.009,5 1.123,6 0.688,7 0.667,8 160.19,9 10,10 11,11 20,13 11,14 13,16 21,17 9,20 9,24 8,25 3,28 2,29 1,32 12,35 5,38 18.5,39 20.182,40 22.452,41 13.75,42 13.338,44 5.301}
{0 CHEMBL46724,1 8.363,2 52.9,3 35.3,4 0.998,5 1.107,6 0.737,7 0.712,8 142.17,9 11.8,10 10,11 17,13 11,14 12,16 18,17 9,19 1,20 8,24 6,25 2,28 2,32 11,33 1,38 19,39 16.971,40 18.827,41 12.534,42 12.096,44 4.097}
{0 CHEMBL570794,1 7.117,2 46.4,3 46.4,4 0.99,5 1.114,6 0.68,7 0.639,8 398.54,9 3.6,10 6,11 56,13 14,14 33,16 59,17 26,20 18,21 8,22 8,24 26,25 4,28 2,29 2,32 30,35 3.6,36 0.051,37 3,38 44,39 55.461,40 62.398,41 38.057,42 35.794,44 4.301}
{0 CHEMBL570797,1 9.958,2 41.2,3 41.2,4 0.994,5 1.093,6 0.799,7 0.704,8 169.29,9 5.9,10 6,11 17,13 6,14 11,16 18,17 7,20 6,21 1,24 7,25 3,26 2,28 1,31 2,32 10,38 14,39 16.905,40 18.584,41 13.585,42 11.976,44 4.097}
{0 CHEMBL571208,1 6.686,2 44.1,3 50,4 0.985,5 1.119,6 0.663,7 0.616,8 454.66,9 2.9,10 6,11 68,13 14,14 37,16 71,17 30,20 18,21 12,22 8,24 34,25 4,28 2,29 2,32 34,35 2.9,36 0.099,37 7,38 48,39 66.996,40 76.059,41 45.103,42 41.901,44 4.301}
{0 CHEMBL571436,1 10.174,2 47.4,3 36.8,4 0.995,5 1.083,6 0.82,7 0.736,8 193.31,9 5.3,10 11,11 19,13 11,14 13,16 20,17 9,20 9,24 7,25 3,26 2,28 1,31 2,32 12,36 0.05,37 1,38 18.5,39 18.905,40 20.584,41 15.585,42 13.976,44 4.097}
{0 CHEMBL576123,1 6.881,2 45.2,3 48.4,4 0.988,5 1.117,6 0.671,7 0.627,8 213.3,9 3.2,10 6,11 31,13 9,14 17,16 32,17 14,20 10,21 4,22 3,24 15,25 2,28 1,29 1,32 16,35 3.2,36 0.031,37 1,38 23,39 30.614,40 34.614,41 20.79,42 19.424,44 5.201}
{0 CHEMBL577335,1 6.936,2 44.4,3 48.1,4 0.99,5 1.118,6 0.668,7 0.626,8 187.26,9 3.7,10 11,11 27,13 11,14 15,16 28,17 12,20 10,21 2,24 13,25 2,28 1,29 1,32 14,35 3.7,36 0.071,37 2,38 20.5,39 26.731,40 30.199,41 18.029,42 16.897,44 4.301}
{0 CHEMBL578212,1 6.71,2 43.3,3 50,4 0.987,5 1.12,6 0.66,7 0.614,8 201.29,9 3.3,10 11,11 30,13 11,14 16,16 31,17 13,20 10,21 3,24 15,25 2,28 1,29 1,32 15,35 3.3,36 0.065,37 2,38 21.5,39 29.614,40 33.614,41 19.79,42 18.424,44 4.824}
{0 CHEMBL584991,1 10.866,2 36,3 28,4 1.071,5 1.161,6 0.69,7 0.712,8 271.66,9 20,10 11,11 25,13 12,14 19,16 26,17 9,18 1,20 9,22 1,23 1,24 7,25 9,26 1,28 5,29 2,32 18,34 2,35 8,36 0.115,37 3,38 25.5,39 26.767,40 29.024,41 17.256,42 17.801,43 8,44 4.222}
