"molecule_id","AMW","C.","pXC50"
{1 7.691,2 42.4,3 7.699}
{0 CHEMBL2169895,1 7.899,2 43.8,3 6.347}
{0 CHEMBL2170553,1 7.755,2 43.3,3 5.699}
{0 CHEMBL2170554,1 7.623,2 42.9,3 5.301}
{0 CHEMBL2170555,1 7.763,2 44.6,3 7.523}
{0 CHEMBL2170556,1 7.992,2 45.9,3 7.824}
{0 CHEMBL2170557,1 8.283,2 45,3 7.155}
{0 CHEMBL2170558,1 7.564,2 44.4,3 7}
{0 CHEMBL2170559,1 7.992,2 45.9,3 7.77}
{0 CHEMBL2170560,1 7.503,2 39.3,3 7.721}
{0 CHEMBL2170561,1 7.503,2 40.7,3 7.638}
{0 CHEMBL2170562,1 7.701,2 44.6,3 7.456}
{0 CHEMBL2170563,1 7.969,2 43.8,3 7.824}
{0 CHEMBL2170703,1 7.701,2 44.6,3 7.398}
{0 CHEMBL2170704,1 7.611,2 41,3 5.456}
{0 CHEMBL2170705,1 7.503,2 40.7,3 5.301}
{0 CHEMBL2170706,1 7.709,2 45,3 5.5}
{0 CHEMBL2170707,1 7.564,2 44.4,3 5.301}
{0 CHEMBL2170708,1 7.702,2 43.5,3 5.699}
{0 CHEMBL2170709,1 7.563,2 43.1,3 6.155}
{0 CHEMBL2170710,1 7.435,2 42.6,3 5.5}
{0 CHEMBL2170711,1 8.171,2 41.2,3 5.301}
{0 CHEMBL2170712,1 8.04,2 44.4,3 5.301}
{0 CHEMBL2170713,1 7.887,2 43.9,3 8.398}
{0 CHEMBL2170714,1 7.604,2 40.5,3 8.301}
{0 CHEMBL2170715,1 7.604,2 40.5,3 5.456}
{0 CHEMBL2170716,1 7.604,2 40.5,3 6.561}
{0 CHEMBL2170717,1 7.604,2 40.5,3 5.699}
{0 CHEMBL2170718,1 7.712,2 40.7,3 7.222}
{0 CHEMBL2170719,1 7.712,2 40.7,3 6.62}
{0 CHEMBL2170720,1 7.712,2 40.7,3 5.602}
{0 CHEMBL2170721,1 7.712,2 40.7,3 5.5}
{0 CHEMBL2170722,1 7.723,2 41.6,3 7.398}
{0 CHEMBL2170723,1 7.502,2 41.8,3 5.699}
{0 CHEMBL2170724,1 7.845,2 44.3,3 6.699}
{0 CHEMBL2170725,1 7.712,2 40.7,3 7.854}
{0 CHEMBL394528,1 7.696,2 43.8,3 7.046}
{0 CHEMBL555196,1 7.703,2 40,3 8.155}
