"molecule_id","FCFP4_1024b56","FCFP4_1024b124","FCFP4_1024b868","FCFP4_1024b860","FCFP4_1024b65","FCFP4_1024b492","FCFP4_1024b132","FCFP4_1024b138","FCFP4_1024b281","FCFP4_1024b78","FCFP4_1024b507","FCFP4_1024b859","FCFP4_1024b574","FCFP4_1024b482","FCFP4_1024b524","FCFP4_1024b396","FCFP4_1024b653","FCFP4_1024b233","FCFP4_1024b429","FCFP4_1024b464","FCFP4_1024b178","FCFP4_1024b1020","FCFP4_1024b725","FCFP4_1024b922","FCFP4_1024b114","FCFP4_1024b151","FCFP4_1024b374","FCFP4_1024b964","FCFP4_1024b301","FCFP4_1024b376","FCFP4_1024b137","FCFP4_1024b9","FCFP4_1024b115","FCFP4_1024b436","FCFP4_1024b48","FCFP4_1024b420","FCFP4_1024b242","FCFP4_1024b970","FCFP4_1024b933","FCFP4_1024b171","FCFP4_1024b297","FCFP4_1024b702","FCFP4_1024b742","FCFP4_1024b705","FCFP4_1024b1","FCFP4_1024b10","FCFP4_1024b100","FCFP4_1024b1000","FCFP4_1024b1001","FCFP4_1024b1002","FCFP4_1024b1003","pXC50"
{8 1,9 1,13 1,15 1,18 1,28 1,29 1,37 1,38 1,40 1,41 1,42 1,45 1,46 1,52 6}
{0 CHEMBL104698,8 1,9 1,10 1,13 1,15 1,18 1,25 1,26 1,27 1,28 1,37 1,40 1,42 1,45 1,46 1,52 6}
{0 CHEMBL104793,8 1,9 1,10 1,13 1,15 1,18 1,25 1,26 1,27 1,28 1,37 1,38 1,40 1,41 1,42 1,45 1,46 1,52 6}
{0 CHEMBL105570,8 1,9 1,13 1,15 1,18 1,21 1,28 1,29 1,32 1,37 1,38 1,40 1,42 1,45 1,46 1,52 6}
{0 CHEMBL105659,8 1,9 1,13 1,15 1,18 1,28 1,29 1,37 1,38 1,40 1,42 1,45 1,46 1,52 6}
{0 CHEMBL105975,8 1,9 1,10 1,13 1,15 1,18 1,25 1,26 1,27 1,28 1,38 1,40 1,41 1,45 1,46 1,52 6}
{0 CHEMBL106803,8 1,9 1,13 1,15 1,18 1,21 1,28 1,29 1,32 1,37 1,38 1,40 1,41 1,42 1,45 1,46 1,52 6}
{0 CHEMBL106907,8 1,9 1,10 1,13 1,15 1,18 1,25 1,26 1,27 1,28 1,40 1,45 1,46 1,52 6}
{0 CHEMBL107128,8 1,9 1,10 1,13 1,15 1,18 1,25 1,26 1,27 1,28 1,37 1,38 1,40 1,41 1,42 1,45 1,46 1,52 6}
{0 CHEMBL107439,8 1,9 1,10 1,13 1,15 1,18 1,25 1,26 1,27 1,28 1,37 1,40 1,42 1,45 1,46 1,52 6}
{0 CHEMBL1078231,1 1,5 1,11 1,13 1,19 1,24 1,45 1,46 1,52 4.301}
{0 CHEMBL1088867,6 1,10 1,12 1,13 1,14 1,31 1,36 1,39 1,45 1,46 1,52 5.853}
{0 CHEMBL1088912,6 1,10 1,12 1,13 1,21 1,31 1,36 1,39 1,45 1,46 1,52 7.167}
{0 CHEMBL1088913,6 1,10 1,12 1,13 1,21 1,31 1,32 1,36 1,39 1,45 1,46 1,52 7.658}
{0 CHEMBL1088916,6 1,10 1,12 1,13 1,21 1,31 1,32 1,36 1,39 1,45 1,46 1,52 7.125}
{0 CHEMBL1089434,10 1,12 1,13 1,14 1,31 1,36 1,39 1,45 1,46 1,52 6.602}
{0 CHEMBL1089844,6 1,10 1,12 1,13 1,31 1,36 1,39 1,45 1,46 1,52 7.114}
{0 CHEMBL1089845,6 1,10 1,12 1,13 1,31 1,36 1,39 1,45 1,46 1,52 6.796}
{0 CHEMBL1089846,6 1,10 1,12 1,13 1,31 1,36 1,39 1,45 1,46 1,52 6.012}
{0 CHEMBL1090509,10 1,12 1,13 1,14 1,31 1,36 1,39 1,45 1,46 1,52 4.535}
{0 CHEMBL1091591,10 1,12 1,13 1,31 1,36 1,39 1,45 1,46 1,52 7.119}
{0 CHEMBL1092301,10 1,12 1,13 1,31 1,36 1,39 1,45 1,46 1,52 7.06}
{0 CHEMBL1092302,10 1,12 1,13 1,31 1,32 1,36 1,39 1,45 1,46 1,52 6.721}
{0 CHEMBL1092324,6 1,10 1,12 1,13 1,14 1,31 1,36 1,39 1,45 1,46 1,52 6.924}
{0 CHEMBL1092596,6 1,10 1,12 1,13 1,21 1,31 1,32 1,36 1,39 1,45 1,46 1,52 6.289}
{0 CHEMBL1092628,10 1,12 1,13 1,31 1,36 1,39 1,45 1,46 1,52 6.355}
{0 CHEMBL1092629,6 1,10 1,12 1,13 1,21 1,31 1,32 1,39 1,45 1,52 5.495}
{0 CHEMBL1092637,10 1,12 1,13 1,19 1,22 1,29 1,31 1,36 1,39 1,45 1,46 1,52 8.347}
{0 CHEMBL1093008,6 1,10 1,12 1,13 1,31 1,36 1,39 1,45 1,46 1,52 7.427}
{0 CHEMBL1093137,10 1,12 1,13 1,14 1,31 1,36 1,39 1,45 1,46 1,52 6.921}
{0 CHEMBL1093149,6 1,10 1,12 1,13 1,21 1,31 1,32 1,36 1,39 1,45 1,46 1,52 6.686}
{0 CHEMBL1093302,6 1,10 1,12 1,13 1,31 1,36 1,39 1,45 1,46 1,52 5.864}
{0 CHEMBL1094864,10 1,12 1,13 1,15 1,31 1,36 1,39 1,45 1,46 1,52 7.796}
{0 CHEMBL1096504,10 1,12 1,13 1,31 1,36 1,39 1,45 1,46 1,52 8.469}
{0 CHEMBL1099015,6 1,10 1,12 1,13 1,21 1,31 1,32 1,36 1,39 1,45 1,46 1,52 7.131}
{0 CHEMBL1202230,12 1,14 1,45 1,46 1,52 5.36}
{0 CHEMBL1202231,10 1,12 1,14 1,45 1,46 1,52 9}
{0 CHEMBL122226,12 1,13 1,14 1,45 1,46 1,52 -4.69}
{0 CHEMBL1242210,6 1,10 1,12 1,13 1,31 1,36 1,39 1,45 1,46 1,52 8.546}
{0 CHEMBL1256528,2 1,3 1,6 1,9 1,10 1,12 1,13 1,15 1,16 1,17 1,20 1,22 1,32 1,33 1,34 1,45 1,46 1,52 8.357}
{0 CHEMBL1256529,2 1,3 1,6 1,9 1,10 1,12 1,13 1,15 1,16 1,17 1,20 1,22 1,32 1,33 1,34 1,45 1,46 1,52 7.728}
{0 CHEMBL1256530,2 1,3 1,6 1,9 1,10 1,12 1,13 1,15 1,16 1,17 1,20 1,22 1,32 1,33 1,34 1,45 1,46 1,52 8.149}
{0 CHEMBL1256583,2 1,3 1,6 1,9 1,10 1,12 1,13 1,15 1,16 1,17 1,20 1,22 1,32 1,33 1,34 1,45 1,46 1,52 8.229}
{0 CHEMBL126657,19 1,30 1,45 1,52 7.276}
{0 CHEMBL129,6 1,12 1,13 1,15 1,32 1,45 1,46 1,52 7.319}
{0 CHEMBL1644070,6 1,10 1,12 1,13 1,31 1,36 1,39 1,45 1,46 1,52 6.66}
{0 CHEMBL1644071,6 1,10 1,12 1,13 1,31 1,36 1,39 1,45 1,46 1,52 7.292}
{0 CHEMBL1644072,5 1,6 1,10 1,12 1,13 1,19 1,30 1,31 1,36 1,39 1,45 1,46 1,52 8.301}
{0 CHEMBL1644073,6 1,10 1,12 1,13 1,31 1,36 1,39 1,45 1,46 1,52 8}
{0 CHEMBL1644074,6 1,10 1,12 1,13 1,31 1,36 1,39 1,45 1,46 1,52 7.959}
{0 CHEMBL1644075,6 1,10 1,12 1,13 1,28 1,31 1,36 1,39 1,40 1,45 1,46 1,52 7.678}
{0 CHEMBL1644076,6 1,10 1,12 1,13 1,31 1,36 1,39 1,45 1,46 1,52 6.9}
{0 CHEMBL1644077,6 1,10 1,12 1,13 1,31 1,36 1,39 1,45 1,46 1,52 7.409}
{0 CHEMBL1644078,6 1,10 1,12 1,13 1,31 1,36 1,39 1,45 1,46 1,52 7.824}
{0 CHEMBL1644079,6 1,10 1,12 1,13 1,22 1,31 1,36 1,39 1,45 1,46 1,51 1,52 8.301}
{0 CHEMBL1644080,6 1,10 1,12 1,13 1,31 1,36 1,39 1,45 1,46 1,52 7.703}
{0 CHEMBL1644081,6 1,10 1,12 1,13 1,30 1,31 1,39 1,45 1,52 7.051}
{0 CHEMBL1644082,6 1,10 1,12 1,13 1,30 1,31 1,39 1,45 1,52 7.352}
{0 CHEMBL1644083,6 1,10 1,12 1,13 1,31 1,36 1,39 1,45 1,46 1,52 6.796}
{0 CHEMBL1644085,6 1,10 1,12 1,13 1,31 1,36 1,39 1,45 1,46 1,52 7.222}
{0 CHEMBL1644088,6 1,10 1,12 1,13 1,31 1,36 1,39 1,45 1,46 1,52 7.921}
{0 CHEMBL1644089,6 1,10 1,12 1,13 1,31 1,36 1,39 1,45 1,46 1,52 7.678}
{0 CHEMBL1644092,6 1,10 1,12 1,13 1,31 1,36 1,39 1,45 1,46 1,52 8.886}
{0 CHEMBL1644094,6 1,10 1,12 1,13 1,31 1,36 1,39 1,45 1,46 1,52 7.678}
{0 CHEMBL1644095,6 1,10 1,12 1,13 1,30 1,31 1,39 1,45 1,52 7.886}
{0 CHEMBL1644096,6 1,10 1,12 1,13 1,30 1,31 1,39 1,45 1,52 7.602}
{0 CHEMBL1668019,1 1,4 1,5 1,6 1,7 1,11 1,13 1,14 1,19 1,24 1,30 1,45 1,46 1,52 4.523}
{0 CHEMBL1682854,6 1,10 1,12 1,13 1,21 1,31 1,32 1,36 1,39 1,45 1,46 1,52 7.745}
{0 CHEMBL1682855,6 1,10 1,12 1,13 1,21 1,31 1,32 1,36 1,39 1,45 1,46 1,52 7.041}
{0 CHEMBL1682856,6 1,10 1,12 1,13 1,21 1,31 1,32 1,36 1,39 1,45 1,46 1,52 7.456}
{0 CHEMBL1682857,6 1,10 1,12 1,13 1,21 1,31 1,32 1,36 1,39 1,45 1,46 1,52 7.276}
{0 CHEMBL1682858,6 1,10 1,12 1,13 1,21 1,31 1,32 1,36 1,39 1,45 1,46 1,52 7.42}
{0 CHEMBL1682859,6 1,10 1,12 1,13 1,21 1,31 1,32 1,36 1,39 1,45 1,46 1,52 7.721}
{0 CHEMBL1682860,6 1,10 1,12 1,13 1,21 1,22 1,31 1,32 1,36 1,39 1,45 1,46 1,52 7.31}
{0 CHEMBL1682861,6 1,10 1,12 1,13 1,21 1,31 1,32 1,36 1,39 1,45 1,46 1,52 5.79}
{0 CHEMBL1682862,6 1,10 1,12 1,13 1,21 1,31 1,32 1,36 1,39 1,45 1,46 1,52 6.889}
{0 CHEMBL1682863,6 1,10 1,12 1,13 1,21 1,22 1,31 1,32 1,36 1,39 1,45 1,46 1,52 7.569}
{0 CHEMBL1682864,6 1,10 1,12 1,13 1,21 1,31 1,32 1,36 1,39 1,45 1,46 1,52 7.201}
{0 CHEMBL1682865,6 1,10 1,12 1,13 1,21 1,31 1,32 1,36 1,39 1,45 1,46 1,52 7.102}
{0 CHEMBL1682866,6 1,10 1,12 1,13 1,21 1,31 1,32 1,36 1,39 1,45 1,46 1,52 7.357}
{0 CHEMBL1682986,6 1,12 1,13 1,21 1,31 1,32 1,36 1,39 1,45 1,46 1,52 7.638}
{0 CHEMBL1682987,6 1,12 1,13 1,21 1,22 1,31 1,32 1,36 1,39 1,45 1,46 1,52 7.143}
{0 CHEMBL1682988,6 1,12 1,13 1,21 1,31 1,32 1,36 1,39 1,45 1,46 1,52 6.955}
{0 CHEMBL1682989,6 1,12 1,13 1,21 1,31 1,32 1,36 1,39 1,45 1,46 1,47 1,52 7.745}
{0 CHEMBL1682990,6 1,12 1,13 1,21 1,31 1,32 1,36 1,39 1,45 1,46 1,52 7.18}
{0 CHEMBL1682991,6 1,12 1,13 1,21 1,31 1,32 1,36 1,39 1,45 1,46 1,52 6.738}
{0 CHEMBL1682992,6 1,12 1,13 1,21 1,31 1,32 1,36 1,39 1,45 1,46 1,52 7.699}
{0 CHEMBL1682993,6 1,12 1,13 1,21 1,31 1,32 1,36 1,39 1,45 1,46 1,52 8.097}
{0 CHEMBL1682994,6 1,10 1,12 1,13 1,21 1,31 1,32 1,36 1,39 1,45 1,46 1,52 7.017}
{0 CHEMBL1682995,6 1,10 1,12 1,13 1,21 1,31 1,32 1,36 1,39 1,45 1,46 1,52 7.201}
{0 CHEMBL1682996,6 1,10 1,12 1,13 1,21 1,22 1,31 1,32 1,36 1,39 1,45 1,46 1,52 7.963}
{0 CHEMBL1682997,6 1,12 1,13 1,21 1,31 1,32 1,36 1,39 1,45 1,46 1,52 7.78}
{0 CHEMBL1682998,6 1,12 1,13 1,21 1,31 1,32 1,36 1,39 1,45 1,46 1,52 7.446}
{0 CHEMBL1802329,44 1,45 1,46 1,50 1,52 8.268}
{0 CHEMBL1802333,12 1,39 1,44 1,45 1,46 1,52 9.097}
{0 CHEMBL18442,12 1,13 1,14 1,45 1,46 1,52 6.575}
{0 CHEMBL191639,6 1,10 1,12 1,13 1,22 1,33 1,34 1,45 1,52 6.276}
{0 CHEMBL191651,6 1,10 1,12 1,13 1,45 1,52 5}
{0 CHEMBL191687,6 1,10 1,12 1,13 1,45 1,52 7.201}
{0 CHEMBL191869,6 1,10 1,12 1,13 1,32 1,45 1,52 6}
{0 CHEMBL191942,2 1,3 1,6 1,10 1,12 1,13 1,15 1,16 1,17 1,32 1,45 1,52 5.796}
{0 CHEMBL191949,6 1,10 1,12 1,13 1,45 1,52 5}
{0 CHEMBL191998,6 1,10 1,12 1,13 1,45 1,52 5}
{0 CHEMBL192183,2 1,3 1,6 1,10 1,12 1,13 1,15 1,16 1,45 1,52 8}
{0 CHEMBL192290,6 1,10 1,12 1,13 1,32 1,45 1,52 4}
{0 CHEMBL192368,6 1,10 1,12 1,13 1,32 1,45 1,52 7.481}
{0 CHEMBL192594,6 1,10 1,12 1,13 1,21 1,32 1,45 1,52 7.721}
{0 CHEMBL192685,6 1,10 1,12 1,13 1,45 1,52 6.638}
{0 CHEMBL192913,6 1,10 1,12 1,13 1,22 1,32 1,33 1,34 1,45 1,52 6.161}
{0 CHEMBL192988,2 1,3 1,6 1,10 1,12 1,13 1,15 1,17 1,22 1,33 1,34 1,45 1,52 5}
{0 CHEMBL193204,2 1,3 1,6 1,10 1,13 1,15 1,17 1,22 1,33 1,34 1,45 1,52 5}
{0 CHEMBL193217,6 1,10 1,12 1,13 1,45 1,52 7.62}
{0 CHEMBL1949675,2 1,3 1,6 1,10 1,12 1,13 1,15 1,17 1,32 1,45 1,52 6}
{0 CHEMBL1949730,2 1,3 1,6 1,10 1,12 1,13 1,15 1,17 1,45 1,52 7.317}
{0 CHEMBL1949731,2 1,3 1,6 1,10 1,12 1,13 1,15 1,17 1,21 1,32 1,45 1,52 8.222}
{0 CHEMBL1949732,2 1,3 1,6 1,10 1,12 1,13 1,15 1,17 1,32 1,45 1,52 7.222}
{0 CHEMBL1949733,2 1,3 1,6 1,10 1,12 1,13 1,15 1,17 1,32 1,45 1,52 7.174}
{0 CHEMBL1949734,2 1,3 1,6 1,10 1,12 1,13 1,15 1,17 1,32 1,45 1,52 8.398}
{0 CHEMBL1949735,2 1,3 1,6 1,10 1,12 1,13 1,15 1,17 1,32 1,45 1,52 7.721}
{0 CHEMBL1949736,2 1,3 1,6 1,10 1,12 1,13 1,15 1,17 1,32 1,45 1,52 7.921}
{0 CHEMBL1949737,2 1,3 1,6 1,10 1,12 1,13 1,15 1,17 1,32 1,45 1,52 8.398}
{0 CHEMBL1949738,2 1,3 1,6 1,10 1,12 1,13 1,15 1,17 1,32 1,45 1,52 8.523}
{0 CHEMBL1949739,2 1,3 1,6 1,10 1,12 1,13 1,15 1,17 1,32 1,45 1,52 8.699}
{0 CHEMBL1949740,2 1,3 1,6 1,10 1,12 1,13 1,15 1,17 1,32 1,45 1,52 8.398}
{0 CHEMBL1949741,2 1,3 1,6 1,10 1,12 1,13 1,15 1,17 1,32 1,45 1,52 7.481}
{0 CHEMBL1949884,2 1,3 1,6 1,10 1,12 1,13 1,15 1,17 1,32 1,45 1,52 8.097}
{0 CHEMBL1949885,2 1,3 1,6 1,10 1,12 1,13 1,15 1,17 1,32 1,45 1,52 8.222}
{0 CHEMBL1949886,2 1,3 1,6 1,10 1,12 1,13 1,15 1,17 1,32 1,45 1,52 7.854}
{0 CHEMBL1949887,2 1,3 1,6 1,10 1,12 1,13 1,15 1,17 1,32 1,45 1,46 1,52 7.009}
{0 CHEMBL1949888,2 1,3 1,6 1,10 1,12 1,13 1,15 1,17 1,32 1,45 1,46 1,52 7.509}
{0 CHEMBL1949889,2 1,3 1,6 1,10 1,12 1,13 1,15 1,17 1,32 1,45 1,46 1,52 7.409}
{0 CHEMBL1949890,2 1,3 1,6 1,10 1,12 1,13 1,15 1,17 1,32 1,45 1,46 1,52 7.77}
{0 CHEMBL1956254,6 1,10 1,12 1,13 1,21 1,32 1,45 1,52 7.013}
{0 CHEMBL1956255,6 1,10 1,12 1,13 1,32 1,45 1,52 7.292}
{0 CHEMBL2012523,2 1,3 1,6 1,10 1,12 1,13 1,15 1,16 1,17 1,19 1,20 1,21 1,22 1,23 1,32 1,33 1,34 1,45 1,52 8.019}
{0 CHEMBL2012524,2 1,3 1,6 1,10 1,12 1,13 1,15 1,16 1,17 1,19 1,20 1,21 1,22 1,23 1,32 1,33 1,34 1,45 1,52 8.246}
{0 CHEMBL2012525,2 1,3 1,6 1,10 1,12 1,13 1,15 1,16 1,17 1,19 1,20 1,21 1,22 1,23 1,32 1,33 1,34 1,45 1,52 8.807}
{0 CHEMBL2012526,2 1,3 1,6 1,10 1,12 1,13 1,15 1,16 1,17 1,19 1,20 1,21 1,22 1,23 1,32 1,33 1,34 1,45 1,52 8.654}
{0 CHEMBL2012527,2 1,3 1,6 1,10 1,12 1,13 1,15 1,16 1,17 1,19 1,20 1,21 1,22 1,23 1,32 1,33 1,34 1,45 1,52 8.866}
{0 CHEMBL2012528,2 1,3 1,6 1,10 1,12 1,13 1,15 1,16 1,17 1,19 1,20 1,21 1,22 1,23 1,32 1,33 1,34 1,45 1,52 7.207}
{0 CHEMBL2012529,2 1,3 1,6 1,10 1,12 1,13 1,15 1,16 1,17 1,19 1,20 1,21 1,22 1,23 1,32 1,33 1,34 1,45 1,52 6.77}
{0 CHEMBL2012530,2 1,3 1,6 1,10 1,12 1,13 1,15 1,16 1,17 1,19 1,20 1,21 1,22 1,23 1,32 1,33 1,34 1,45 1,52 7.664}
{0 CHEMBL2012531,2 1,3 1,6 1,10 1,12 1,13 1,15 1,16 1,17 1,19 1,20 1,21 1,22 1,23 1,32 1,33 1,34 1,45 1,52 7.673}
{0 CHEMBL2012532,2 1,3 1,6 1,10 1,12 1,13 1,15 1,16 1,17 1,19 1,20 1,21 1,22 1,23 1,32 1,33 1,34 1,45 1,52 7.548}
{0 CHEMBL2012651,2 1,3 1,6 1,10 1,12 1,13 1,15 1,16 1,17 1,19 1,20 1,21 1,22 1,23 1,32 1,33 1,34 1,45 1,52 7.413}
{0 CHEMBL2012652,2 1,3 1,6 1,10 1,12 1,13 1,15 1,16 1,17 1,19 1,20 1,21 1,22 1,23 1,32 1,33 1,34 1,45 1,52 7.782}
{0 CHEMBL2012653,2 1,3 1,6 1,10 1,12 1,13 1,15 1,16 1,17 1,19 1,20 1,21 1,22 1,23 1,32 1,33 1,34 1,45 1,52 7.603}
{0 CHEMBL2018969,5 1,6 1,9 1,19 1,30 1,45 1,52 5}
{0 CHEMBL2029608,6 1,10 1,12 1,13 1,19 1,32 1,45 1,52 6.481}
{0 CHEMBL2029609,6 1,10 1,12 1,13 1,19 1,45 1,52 6.301}
{0 CHEMBL2029610,6 1,10 1,12 1,13 1,19 1,45 1,52 5.602}
{0 CHEMBL2029611,6 1,10 1,12 1,13 1,19 1,45 1,52 7}
{0 CHEMBL2029612,6 1,10 1,12 1,13 1,19 1,32 1,45 1,52 5}
{0 CHEMBL2029613,2 1,3 1,6 1,10 1,12 1,13 1,15 1,17 1,45 1,52 6.538}
{0 CHEMBL2042117,3 1,6 1,10 1,12 1,13 1,15 1,22 1,32 1,45 1,52 8.027}
{0 CHEMBL2042118,6 1,10 1,12 1,13 1,32 1,45 1,52 8.377}
{0 CHEMBL2042119,6 1,10 1,12 1,13 1,32 1,45 1,52 8.31}
{0 CHEMBL2042120,3 1,6 1,10 1,12 1,13 1,15 1,22 1,32 1,45 1,52 7.959}
{0 CHEMBL2042232,3 1,6 1,10 1,12 1,13 1,15 1,17 1,32 1,45 1,52 7.796}
{0 CHEMBL2042233,3 1,6 1,10 1,12 1,13 1,15 1,17 1,32 1,45 1,52 6.168}
{0 CHEMBL2042234,3 1,6 1,10 1,12 1,13 1,15 1,17 1,32 1,45 1,52 6.476}
{0 CHEMBL2062277,13 1,14 1,45 1,46 1,52 8.553}
{0 CHEMBL2096822,6 1,10 1,12 1,13 1,19 1,32 1,43 1,45 1,52 4.509}
{0 CHEMBL2112323,6 1,10 1,12 1,13 1,32 1,45 1,52 6.721}
{0 CHEMBL2113067,6 1,10 1,12 1,13 1,19 1,32 1,43 1,45 1,52 4.678}
{0 CHEMBL2113070,6 1,10 1,12 1,13 1,32 1,45 1,52 6.745}
{0 CHEMBL2113071,6 1,10 1,12 1,13 1,32 1,45 1,52 7.495}
{0 CHEMBL2170299,12 1,13 1,45 1,46 1,52 6.102}
{0 CHEMBL2170443,12 1,13 1,45 1,46 1,52 5.959}
{0 CHEMBL2170444,12 1,13 1,45 1,46 1,52 6.456}
{0 CHEMBL217587,2 1,3 1,6 1,10 1,12 1,13 1,15 1,16 1,17 1,21 1,22 1,23 1,32 1,33 1,34 1,45 1,52 8.167}
{0 CHEMBL2179708,6 1,10 1,12 1,13 1,22 1,32 1,45 1,52 4.827}
{0 CHEMBL2179709,6 1,10 1,12 1,13 1,32 1,45 1,52 6.169}
{0 CHEMBL2179710,6 1,10 1,12 1,13 1,32 1,45 1,52 4}
{0 CHEMBL2179711,6 1,10 1,12 1,13 1,32 1,45 1,52 4}
{0 CHEMBL2179712,6 1,10 1,12 1,13 1,32 1,45 1,52 5.539}
{0 CHEMBL2180076,6 1,10 1,12 1,13 1,32 1,45 1,52 6.329}
{0 CHEMBL2180077,6 1,10 1,12 1,13 1,32 1,45 1,52 6.109}
{0 CHEMBL2180078,6 1,10 1,12 1,13 1,32 1,45 1,52 4.442}
{0 CHEMBL2180079,6 1,10 1,12 1,13 1,45 1,52 5.447}
{0 CHEMBL2180080,6 1,10 1,12 1,13 1,45 1,52 4.726}
{0 CHEMBL2180081,6 1,10 1,12 1,13 1,45 1,52 4.716}
{0 CHEMBL2180082,6 1,10 1,12 1,13 1,32 1,45 1,52 5.269}
{0 CHEMBL2180083,6 1,10 1,12 1,13 1,32 1,45 1,52 6.251}
{0 CHEMBL2180084,6 1,10 1,12 1,13 1,32 1,45 1,52 6.588}
{0 CHEMBL2180085,6 1,10 1,12 1,13 1,21 1,32 1,45 1,52 6.18}
{0 CHEMBL2180086,6 1,10 1,12 1,13 1,32 1,45 1,52 5.142}
{0 CHEMBL218771,6 1,10 1,12 1,13 1,45 1,52 6}
{0 CHEMBL218806,2 1,3 1,6 1,10 1,12 1,13 1,15 1,17 1,45 1,52 8.523}
{0 CHEMBL218862,6 1,10 1,12 1,13 1,45 1,52 6}
{0 CHEMBL218863,2 1,3 1,6 1,10 1,12 1,13 1,15 1,16 1,17 1,32 1,45 1,52 6}
{0 CHEMBL218864,2 1,3 1,6 1,10 1,12 1,13 1,15 1,16 1,17 1,32 1,45 1,52 6}
{0 CHEMBL218972,2 1,3 1,6 1,10 1,12 1,13 1,15 1,16 1,17 1,32 1,45 1,52 6}
{0 CHEMBL219075,6 1,10 1,13 1,45 1,52 6.777}
{0 CHEMBL219096,3 1,6 1,10 1,12 1,13 1,15 1,22 1,45 1,52 6.893}
{0 CHEMBL219135,6 1,10 1,12 1,13 1,32 1,45 1,52 6.456}
{0 CHEMBL219339,6 1,10 1,12 1,13 1,32 1,45 1,52 8.097}
{0 CHEMBL219474,6 1,10 1,12 1,13 1,32 1,45 1,52 8.398}
{0 CHEMBL2311028,12 1,13 1,14 1,45 1,46 1,52 6.372}
{0 CHEMBL2311089,12 1,13 1,14 1,45 1,46 1,52 8.155}
{0 CHEMBL2347623,12 1,13 1,32 1,45 1,52 6.585}
{0 CHEMBL2347624,12 1,13 1,32 1,45 1,52 6.553}
{0 CHEMBL2347625,12 1,13 1,45 1,52 6.292}
{0 CHEMBL2347626,12 1,13 1,32 1,45 1,52 6.658}
{0 CHEMBL2347627,12 1,13 1,32 1,45 1,52 7.208}
{0 CHEMBL2347628,12 1,13 1,32 1,45 1,52 6.959}
{0 CHEMBL2347629,12 1,13 1,32 1,45 1,52 6.721}
{0 CHEMBL2347630,12 1,13 1,32 1,45 1,52 6.745}
{0 CHEMBL2347631,12 1,13 1,32 1,45 1,52 6.959}
{0 CHEMBL2347632,12 1,13 1,32 1,45 1,52 7.398}
{0 CHEMBL2347633,12 1,13 1,32 1,45 1,52 7.032}
{0 CHEMBL2347634,12 1,13 1,45 1,52 6.42}
{0 CHEMBL2347635,12 1,13 1,45 1,52 6.523}
{0 CHEMBL235310,35 1,44 1,45 1,52 1}
{0 CHEMBL235312,35 1,38 1,44 1,45 1,52 2.3}
{0 CHEMBL237164,5 1,19 1,30 1,45 1,52 -3}
{0 CHEMBL237415,5 1,30 1,40 1,45 1,52 2.3}
{0 CHEMBL237437,21 1,32 1,35 1,44 1,45 1,52 3}
{0 CHEMBL237438,35 1,44 1,45 1,52 3}
{0 CHEMBL237439,35 1,44 1,45 1,52 1}
{0 CHEMBL237628,35 1,44 1,45 1,52 2}
{0 CHEMBL237630,35 1,44 1,45 1,52 3}
{0 CHEMBL237829,5 1,19 1,30 1,35 1,44 1,45 1,52 1}
{0 CHEMBL237830,39 1,44 1,45 1,52 8.745}
{0 CHEMBL263853,2 1,3 1,6 1,10 1,12 1,13 1,15 1,16 1,17 1,20 1,21 1,22 1,23 1,32 1,33 1,34 1,45 1,52 8.325}
{0 CHEMBL266632,6 1,10 1,12 1,13 1,19 1,21 1,22 1,23 1,28 1,32 1,33 1,34 1,40 1,43 1,45 1,52 4.444}
{0 CHEMBL267468,2 1,3 1,6 1,10 1,12 1,13 1,15 1,16 1,17 1,20 1,21 1,22 1,23 1,32 1,33 1,34 1,45 1,52 8.032}
{0 CHEMBL267469,2 1,3 1,6 1,10 1,12 1,13 1,15 1,16 1,17 1,20 1,21 1,22 1,23 1,32 1,33 1,34 1,45 1,52 7.796}
{0 CHEMBL268578,2 1,3 1,6 1,10 1,12 1,13 1,15 1,16 1,17 1,20 1,21 1,22 1,23 1,32 1,33 1,34 1,45 1,52 6.444}
{0 CHEMBL269038,2 1,3 1,6 1,10 1,12 1,13 1,15 1,16 1,17 1,21 1,22 1,23 1,32 1,33 1,34 1,45 1,52 8.921}
{0 CHEMBL274771,2 1,3 1,6 1,10 1,12 1,13 1,15 1,16 1,17 1,21 1,22 1,23 1,32 1,33 1,34 1,45 1,52 7.143}
{0 CHEMBL317860,8 1,9 1,10 1,13 1,15 1,18 1,25 1,26 1,27 1,28 1,38 1,40 1,41 1,45 1,46 1,52 6}
{0 CHEMBL319622,8 1,9 1,10 1,13 1,15 1,18 1,21 1,28 1,29 1,32 1,36 1,37 1,38 1,40 1,41 1,42 1,45 1,46 1,52 6}
{0 CHEMBL321539,8 1,9 1,10 1,13 1,15 1,18 1,28 1,29 1,36 1,37 1,38 1,40 1,41 1,42 1,45 1,46 1,52 6}
{0 CHEMBL362983,6 1,10 1,12 1,13 1,32 1,45 1,52 6}
{0 CHEMBL364011,6 1,10 1,12 1,13 1,45 1,52 6.77}
{0 CHEMBL364014,6 1,10 1,12 1,13 1,32 1,45 1,52 5}
{0 CHEMBL364295,6 1,10 1,12 1,13 1,32 1,45 1,52 7.268}
{0 CHEMBL365952,6 1,10 1,12 1,13 1,21 1,32 1,45 1,52 7.013}
{0 CHEMBL366033,6 1,10 1,12 1,13 1,32 1,45 1,52 6.215}
{0 CHEMBL370001,6 1,10 1,12 1,13 1,32 1,45 1,52 8.347}
{0 CHEMBL371993,3 1,6 1,10 1,12 1,13 1,15 1,45 1,52 6.31}
{0 CHEMBL372422,6 1,10 1,12 1,13 1,21 1,45 1,52 7.796}
{0 CHEMBL372874,2 1,3 1,6 1,10 1,12 1,13 1,15 1,16 1,45 1,52 8.004}
{0 CHEMBL373155,3 1,6 1,10 1,12 1,13 1,15 1,45 1,52 7.377}
{0 CHEMBL373420,6 1,10 1,12 1,13 1,45 1,52 6}
{0 CHEMBL373440,6 1,10 1,12 1,13 1,45 1,52 6.886}
{0 CHEMBL373636,6 1,10 1,13 1,45 1,52 7.959}
{0 CHEMBL373637,2 1,3 1,6 1,10 1,12 1,13 1,15 1,16 1,17 1,32 1,45 1,52 6.194}
{0 CHEMBL374108,6 1,10 1,12 1,13 1,45 1,52 7.201}
{0 CHEMBL374421,2 1,3 1,6 1,10 1,12 1,13 1,15 1,17 1,45 1,52 7.638}
{0 CHEMBL374862,6 1,10 1,13 1,45 1,52 6.592}
{0 CHEMBL375168,2 1,3 1,6 1,10 1,12 1,13 1,15 1,16 1,17 1,32 1,45 1,52 6}
{0 CHEMBL375850,3 1,6 1,10 1,12 1,13 1,15 1,22 1,45 1,52 6.602}
{0 CHEMBL375990,6 1,10 1,13 1,45 1,52 7.959}
{0 CHEMBL375991,6 1,10 1,12 1,13 1,32 1,45 1,52 7.328}
{0 CHEMBL375992,2 1,3 1,6 1,10 1,12 1,13 1,15 1,16 1,17 1,32 1,45 1,52 6}
{0 CHEMBL375993,3 1,6 1,10 1,12 1,13 1,15 1,22 1,45 1,52 6.804}
{0 CHEMBL376219,2 1,3 1,6 1,10 1,12 1,13 1,15 1,17 1,45 1,52 7.678}
{0 CHEMBL376513,6 1,10 1,12 1,13 1,45 1,52 6}
{0 CHEMBL376811,6 1,10 1,13 1,45 1,52 7.036}
{0 CHEMBL384429,6 1,10 1,12 1,13 1,45 1,52 6.638}
{0 CHEMBL386864,2 1,3 1,6 1,10 1,12 1,13 1,15 1,16 1,17 1,20 1,21 1,22 1,23 1,32 1,33 1,34 1,45 1,52 8.051}
{0 CHEMBL387120,6 1,10 1,13 1,45 1,52 6.77}
{0 CHEMBL387121,2 1,3 1,6 1,10 1,12 1,13 1,15 1,16 1,17 1,32 1,45 1,52 6}
{0 CHEMBL387122,2 1,3 1,6 1,10 1,12 1,13 1,15 1,16 1,17 1,32 1,45 1,52 6}
{0 CHEMBL391151,5 1,19 1,30 1,35 1,44 1,45 1,52 1.4}
{0 CHEMBL393882,2 1,3 1,6 1,10 1,12 1,13 1,15 1,16 1,17 1,21 1,22 1,23 1,32 1,33 1,34 1,45 1,52 9.222}
{0 CHEMBL396667,45 1,52 1.7}
{0 CHEMBL407787,2 1,3 1,6 1,10 1,12 1,13 1,15 1,16 1,17 1,20 1,21 1,22 1,23 1,32 1,33 1,34 1,45 1,52 5.602}
{0 CHEMBL408062,6 1,10 1,12 1,13 1,22 1,32 1,33 1,34 1,45 1,52 6}
{0 CHEMBL409377,2 1,3 1,6 1,10 1,12 1,13 1,15 1,16 1,17 1,21 1,22 1,23 1,32 1,33 1,34 1,45 1,52 7.907}
{0 CHEMBL409717,2 1,3 1,6 1,10 1,12 1,13 1,15 1,16 1,17 1,21 1,22 1,23 1,32 1,33 1,34 1,45 1,52 6.398}
{0 CHEMBL409897,2 1,3 1,6 1,10 1,12 1,13 1,15 1,16 1,17 1,21 1,22 1,23 1,32 1,33 1,34 1,45 1,52 7.398}
{0 CHEMBL409991,6 1,10 1,12 1,13 1,19 1,20 1,21 1,22 1,23 1,32 1,33 1,34 1,43 1,45 1,52 5.149}
{0 CHEMBL410557,2 1,3 1,6 1,10 1,12 1,13 1,15 1,16 1,17 1,20 1,21 1,22 1,23 1,32 1,33 1,34 1,45 1,52 6.056}
{0 CHEMBL410868,2 1,3 1,6 1,10 1,12 1,13 1,15 1,16 1,17 1,20 1,21 1,22 1,23 1,32 1,33 1,34 1,45 1,52 7.642}
{0 CHEMBL411142,2 1,3 1,6 1,10 1,12 1,13 1,15 1,16 1,17 1,20 1,21 1,22 1,23 1,32 1,33 1,34 1,45 1,52 7.77}
{0 CHEMBL411260,2 1,3 1,6 1,10 1,12 1,13 1,15 1,16 1,17 1,20 1,21 1,22 1,23 1,32 1,33 1,34 1,45 1,52 7.432}
{0 CHEMBL411497,2 1,3 1,6 1,10 1,12 1,13 1,15 1,16 1,17 1,20 1,21 1,22 1,23 1,32 1,33 1,34 1,45 1,52 7.796}
{0 CHEMBL411516,2 1,3 1,6 1,10 1,12 1,13 1,15 1,16 1,17 1,20 1,21 1,22 1,23 1,32 1,33 1,34 1,45 1,52 7.796}
{0 CHEMBL411581,2 1,3 1,6 1,10 1,12 1,13 1,15 1,16 1,17 1,20 1,21 1,22 1,32 1,33 1,34 1,45 1,52 7.252}
{0 CHEMBL411678,2 1,3 1,6 1,10 1,12 1,13 1,15 1,16 1,17 1,21 1,22 1,23 1,32 1,33 1,34 1,45 1,52 7.629}
{0 CHEMBL411700,2 1,3 1,6 1,10 1,12 1,13 1,15 1,16 1,17 1,20 1,21 1,22 1,23 1,32 1,33 1,34 1,45 1,52 8.481}
{0 CHEMBL412276,2 1,3 1,6 1,10 1,12 1,13 1,15 1,16 1,17 1,20 1,21 1,22 1,23 1,25 1,26 1,27 1,32 1,33 1,34 1,45 1,52 8.081}
{0 CHEMBL414085,6 1,10 1,12 1,13 1,19 1,20 1,21 1,22 1,23 1,25 1,26 1,27 1,32 1,33 1,34 1,43 1,45 1,52 4.546}
{0 CHEMBL414302,2 1,3 1,6 1,10 1,12 1,13 1,15 1,16 1,17 1,20 1,21 1,22 1,23 1,32 1,33 1,34 1,45 1,52 7.824}
{0 CHEMBL414380,6 1,10 1,12 1,13 1,32 1,45 1,52 6}
{0 CHEMBL414473,2 1,3 1,6 1,10 1,12 1,13 1,15 1,16 1,17 1,20 1,21 1,22 1,23 1,32 1,33 1,34 1,45 1,52 5.886}
{0 CHEMBL414510,2 1,3 1,6 1,10 1,12 1,13 1,15 1,16 1,17 1,20 1,21 1,22 1,23 1,32 1,33 1,34 1,45 1,52 7.991}
{0 CHEMBL414532,2 1,3 1,6 1,10 1,12 1,13 1,15 1,16 1,17 1,20 1,21 1,22 1,23 1,32 1,33 1,34 1,45 1,52 7.444}
{0 CHEMBL414536,2 1,3 1,6 1,10 1,12 1,13 1,15 1,16 1,17 1,20 1,21 1,22 1,23 1,32 1,33 1,34 1,45 1,52 7.167}
{0 CHEMBL415415,2 1,3 1,6 1,10 1,12 1,13 1,15 1,16 1,17 1,20 1,21 1,22 1,23 1,32 1,33 1,34 1,45 1,52 8.108}
{0 CHEMBL415437,2 1,3 1,6 1,10 1,12 1,13 1,15 1,16 1,17 1,20 1,21 1,22 1,23 1,32 1,33 1,34 1,45 1,52 7.745}
{0 CHEMBL424826,2 1,3 1,6 1,10 1,12 1,13 1,15 1,16 1,17 1,32 1,45 1,52 6.377}
{0 CHEMBL426169,3 1,6 1,10 1,12 1,13 1,15 1,22 1,45 1,52 6.249}
{0 CHEMBL426635,6 1,10 1,12 1,13 1,45 1,52 6.569}
{0 CHEMBL436083,6 1,10 1,12 1,13 1,22 1,32 1,33 1,34 1,45 1,52 6}
{0 CHEMBL436097,6 1,10 1,12 1,13 1,32 1,45 1,52 8.367}
{0 CHEMBL436283,6 1,10 1,12 1,13 1,32 1,45 1,52 7.266}
{0 CHEMBL436536,2 1,3 1,6 1,10 1,12 1,13 1,15 1,17 1,45 1,52 7.004}
{0 CHEMBL437416,2 1,3 1,6 1,10 1,12 1,13 1,15 1,16 1,17 1,20 1,21 1,22 1,23 1,32 1,33 1,34 1,45 1,52 7.328}
{0 CHEMBL437848,2 1,3 1,6 1,10 1,12 1,13 1,15 1,16 1,17 1,21 1,22 1,23 1,32 1,33 1,34 1,45 1,52 8.18}
{0 CHEMBL438019,2 1,3 1,6 1,10 1,12 1,13 1,15 1,16 1,17 1,20 1,21 1,22 1,23 1,32 1,33 1,34 1,45 1,52 7.824}
{0 CHEMBL438769,2 1,3 1,6 1,10 1,12 1,13 1,15 1,16 1,17 1,21 1,22 1,23 1,32 1,33 1,34 1,45 1,52 7.714}
{0 CHEMBL438934,2 1,3 1,5 1,6 1,10 1,12 1,13 1,15 1,16 1,17 1,19 1,20 1,21 1,22 1,23 1,30 1,32 1,33 1,34 1,45 1,52 8.409}
{0 CHEMBL439451,2 1,3 1,6 1,10 1,12 1,13 1,15 1,16 1,17 1,20 1,21 1,22 1,23 1,32 1,33 1,34 1,45 1,52 8.553}
{0 CHEMBL440638,6 1,10 1,12 1,13 1,19 1,21 1,22 1,23 1,32 1,33 1,34 1,43 1,45 1,52 5.151}
{0 CHEMBL440998,6 1,10 1,12 1,13 1,19 1,21 1,22 1,23 1,25 1,26 1,27 1,32 1,33 1,34 1,43 1,45 1,52 5.301}
{0 CHEMBL441194,2 1,3 1,6 1,10 1,12 1,13 1,15 1,16 1,17 1,20 1,21 1,22 1,23 1,32 1,33 1,34 1,45 1,52 7.296}
{0 CHEMBL441197,2 1,3 1,6 1,10 1,12 1,13 1,15 1,16 1,17 1,20 1,21 1,22 1,23 1,32 1,33 1,34 1,45 1,52 8.398}
{0 CHEMBL441757,2 1,3 1,6 1,10 1,12 1,13 1,15 1,16 1,17 1,21 1,22 1,23 1,32 1,33 1,34 1,45 1,52 8.569}
{0 CHEMBL441759,6 1,10 1,12 1,13 1,20 1,21 1,22 1,23 1,32 1,33 1,34 1,45 1,52 7.77}
{0 CHEMBL442310,2 1,3 1,6 1,10 1,12 1,13 1,15 1,16 1,17 1,20 1,21 1,22 1,23 1,32 1,33 1,34 1,45 1,52 6.347}
{0 CHEMBL443092,6 1,9 1,10 1,12 1,13 1,19 1,25 1,26 1,27 1,29 1,45 1,52 5.523}
{0 CHEMBL444094,6 1,10 1,12 1,13 1,45 1,52 6}
{0 CHEMBL446868,6 1,9 1,10 1,12 1,13 1,25 1,26 1,27 1,29 1,45 1,52 5.432}
{0 CHEMBL449621,5 1,13 1,15 1,17 1,19 1,24 1,45 1,46 1,52 4.301}
{0 CHEMBL450041,6 1,9 1,10 1,12 1,13 1,15 1,19 1,25 1,26 1,27 1,29 1,45 1,52 5.658}
{0 CHEMBL450815,6 1,9 1,10 1,12 1,13 1,15 1,19 1,25 1,26 1,27 1,29 1,45 1,52 5.921}
{0 CHEMBL452864,13 1,15 1,17 1,45 1,52 7.319}
{0 CHEMBL452868,8 1,13 1,15 1,17 1,45 1,52 5.447}
{0 CHEMBL454689,13 1,15 1,17 1,45 1,52 5.416}
{0 CHEMBL454896,13 1,15 1,17 1,45 1,52 7.569}
{0 CHEMBL455708,15 1,45 1,52 5}
{0 CHEMBL460298,13 1,15 1,17 1,45 1,52 7.553}
{0 CHEMBL460299,13 1,15 1,17 1,45 1,52 6.596}
{0 CHEMBL460482,13 1,15 1,17 1,45 1,52 5.139}
{0 CHEMBL460483,13 1,15 1,17 1,28 1,40 1,45 1,52 5}
{0 CHEMBL460484,13 1,15 1,17 1,45 1,52 5.02}
{0 CHEMBL460491,11 1,13 1,15 1,17 1,45 1,52 8.528}
{0 CHEMBL461358,13 1,24 1,45 1,52 6.068}
{0 CHEMBL461359,13 1,15 1,19 1,45 1,52 7.489}
{0 CHEMBL462588,13 1,15 1,17 1,19 1,45 1,52 5.814}
{0 CHEMBL472323,6 1,9 1,10 1,12 1,13 1,25 1,26 1,27 1,29 1,45 1,52 5.523}
{0 CHEMBL477121,12 1,13 1,14 1,31 1,39 1,45 1,46 1,52 -8.01}
{0 CHEMBL478168,12 1,13 1,14 1,45 1,46 1,52 -5.76}
{0 CHEMBL480502,6 1,9 1,10 1,12 1,13 1,29 1,45 1,52 5.569}
{0 CHEMBL506505,6 1,10 1,12 1,13 1,32 1,45 1,52 6.963}
{0 CHEMBL508054,13 1,15 1,17 1,45 1,52 7.602}
{0 CHEMBL508684,6 1,9 1,10 1,12 1,13 1,25 1,26 1,27 1,29 1,45 1,52 5.77}
{0 CHEMBL516480,13 1,15 1,17 1,18 1,45 1,52 5.327}
{0 CHEMBL516630,13 1,15 1,17 1,45 1,52 6.733}
{0 CHEMBL516989,13 1,15 1,17 1,45 1,52 5.045}
{0 CHEMBL518004,6 1,9 1,10 1,12 1,13 1,29 1,45 1,52 5.319}
{0 CHEMBL518041,11 1,13 1,19 1,45 1,52 5.727}
{0 CHEMBL518501,11 1,13 1,15 1,17 1,45 1,52 8.367}
{0 CHEMBL518924,6 1,10 1,12 1,13 1,21 1,31 1,32 1,36 1,39 1,45 1,46 1,52 7.886}
{0 CHEMBL535616,1 1,4 1,7 1,10 1,11 1,12 1,13 1,19 1,45 1,46 1,52 5}
{0 CHEMBL536063,1 1,4 1,7 1,10 1,11 1,12 1,13 1,19 1,45 1,46 1,52 5}
{0 CHEMBL536288,1 1,4 1,7 1,10 1,11 1,12 1,13 1,19 1,24 1,45 1,46 1,52 5.087}
{0 CHEMBL536743,1 1,4 1,5 1,7 1,11 1,13 1,14 1,19 1,24 1,30 1,45 1,46 1,52 5}
{0 CHEMBL537424,1 1,4 1,5 1,7 1,11 1,13 1,14 1,19 1,24 1,30 1,45 1,46 1,52 5}
{0 CHEMBL537425,1 1,4 1,7 1,10 1,11 1,12 1,13 1,19 1,45 1,46 1,52 5}
{0 CHEMBL538038,12 1,13 1,14 1,45 1,46 1,52 5.241}
{0 CHEMBL538084,1 1,4 1,7 1,10 1,11 1,12 1,13 1,19 1,45 1,46 1,52 5}
{0 CHEMBL539854,1 1,4 1,11 1,13 1,14 1,19 1,40 1,45 1,46 1,52 4.523}
{0 CHEMBL540108,1 1,4 1,5 1,7 1,11 1,13 1,14 1,19 1,24 1,30 1,42 1,45 1,46 1,52 5}
{0 CHEMBL540366,1 1,4 1,5 1,7 1,11 1,13 1,14 1,19 1,24 1,30 1,45 1,46 1,52 5}
{0 CHEMBL541337,12 1,13 1,14 1,45 1,46 1,52 4.456}
{0 CHEMBL541728,13 1,15 1,17 1,45 1,52 7.553}
{0 CHEMBL543895,12 1,13 1,14 1,45 1,46 1,52 7.174}
{0 CHEMBL545063,12 1,13 1,14 1,32 1,45 1,46 1,52 4.456}
{0 CHEMBL545532,12 1,13 1,14 1,45 1,46 1,52 4.456}
{0 CHEMBL553964,12 1,13 1,14 1,45 1,46 1,52 4.456}
{0 CHEMBL555039,12 1,13 1,14 1,37 1,45 1,46 1,52 4.456}
{0 CHEMBL556188,1 1,4 1,11 1,13 1,14 1,19 1,40 1,45 1,46 1,52 4.523}
{0 CHEMBL556798,1 1,4 1,5 1,7 1,11 1,13 1,14 1,19 1,24 1,30 1,45 1,46 1,52 5}
{0 CHEMBL557015,1 1,4 1,5 1,7 1,11 1,13 1,14 1,19 1,24 1,30 1,45 1,46 1,52 4.523}
{0 CHEMBL557150,1 1,4 1,5 1,7 1,11 1,13 1,14 1,19 1,30 1,45 1,46 1,52 4.523}
{0 CHEMBL557199,1 1,4 1,7 1,11 1,13 1,14 1,19 1,24 1,45 1,46 1,52 4.523}
{0 CHEMBL577268,6 1,10 1,12 1,13 1,21 1,29 1,31 1,36 1,39 1,45 1,46 1,52 7.328}
{0 CHEMBL595990,5 1,30 1,45 1,52 4.222}
{0 CHEMBL604277,5 1,30 1,42 1,45 1,46 1,52 4.222}
{0 CHEMBL604583,5 1,30 1,39 1,45 1,52 4.222}
{0 CHEMBL853,6 1,12 1,13 1,15 1,17 1,45 1,52 7.056}
