{
  "data_features": {
    "feature": [
      {
        "data_type": "nominal",
        "index": "0",
        "is_ignore": "false",
        "is_row_identifier": "true",
        "is_target": "false",
        "name": "molecule_id",
        "nominal_value": [
          "CHEMBL312942",
          "CHEMBL314162",
          "CHEMBL314219",
          "CHEMBL314238",
          "CHEMBL314731",
          "CHEMBL314761",
          "CHEMBL315192",
          "CHEMBL315863",
          "CHEMBL316275",
          "CHEMBL327390",
          "CHEMBL327911",
          "CHEMBL328126",
          "CHEMBL328148",
          "CHEMBL328150",
          "CHEMBL328318",
          "CHEMBL328354",
          "CHEMBL329889",
          "CHEMBL330010",
          "CHEMBL330292",
          "CHEMBL330563",
          "CHEMBL419128",
          "CHEMBL431216",
          "CHEMBL433350",
          "CHEMBL541213",
          "CHEMBL88325",
          "CHEMBL88486",
          "CHEMBL88538",
          "CHEMBL88546",
          "CHEMBL88844",
          "CHEMBL88904",
          "CHEMBL88925",
          "CHEMBL89428",
          "CHEMBL90169",
          "CHEMBL90252",
          "CHEMBL90261",
          "CHEMBL90341",
          "CHEMBL90373",
          "CHEMBL91165",
          "CHEMBL91196",
          "CHEMBL91274",
          "CHEMBL91331",
          "CHEMBL91376",
          "CHEMBL91459",
          "CHEMBL91540",
          "CHEMBL91568",
          "CHEMBL91630",
          "CHEMBL91648",
          "CHEMBL91652",
          "CHEMBL91721",
          "CHEMBL91730",
          "CHEMBL91934",
          "CHEMBL92440",
          "CHEMBL92498"
        ],
        "number_of_missing_values": "0"
      },
      {
        "data_type": "numeric",
        "index": "1",
        "is_ignore": "false",
        "is_row_identifier": "false",
        "is_target": "false",
        "name": "AMW",
        "number_of_missing_values": "0"
      },
      {
        "data_type": "numeric",
        "index": "2",
        "is_ignore": "false",
        "is_row_identifier": "false",
        "is_target": "false",
        "name": "C.",
        "number_of_missing_values": "0"
      },
      {
        "data_type": "numeric",
        "index": "3",
        "is_ignore": "false",
        "is_row_identifier": "false",
        "is_target": "false",
        "name": "H.",
        "number_of_missing_values": "0"
      },
      {
        "data_type": "numeric",
        "index": "4",
        "is_ignore": "false",
        "is_row_identifier": "false",
        "is_target": "false",
        "name": "Me",
        "number_of_missing_values": "0"
      },
      {
        "data_type": "numeric",
        "index": "5",
        "is_ignore": "false",
        "is_row_identifier": "false",
        "is_target": "false",
        "name": "Mi",
        "number_of_missing_values": "0"
      },
      {
        "data_type": "numeric",
        "index": "6",
        "is_ignore": "false",
        "is_row_identifier": "false",
        "is_target": "false",
        "name": "Mp",
        "number_of_missing_values": "0"
      },
      {
        "data_type": "numeric",
        "index": "7",
        "is_ignore": "false",
        "is_row_identifier": "false",
        "is_target": "false",
        "name": "Mv",
        "number_of_missing_values": "0"
      },
      {
        "data_type": "numeric",
        "index": "8",
        "is_ignore": "false",
        "is_row_identifier": "false",
        "is_target": "false",
        "name": "MW",
        "number_of_missing_values": "0"
      },
      {
        "data_type": "numeric",
        "index": "9",
        "is_ignore": "false",
        "is_row_identifier": "false",
        "is_target": "false",
        "name": "N.",
        "number_of_missing_values": "0"
      },
      {
        "data_type": "numeric",
        "index": "10",
        "is_ignore": "false",
        "is_row_identifier": "false",
        "is_target": "false",
        "name": "nAB",
        "number_of_missing_values": "0"
      },
      {
        "data_type": "numeric",
        "index": "11",
        "is_ignore": "false",
        "is_row_identifier": "false",
        "is_target": "false",
        "name": "nAT",
        "number_of_missing_values": "0"
      },
      {
        "data_type": "numeric",
        "index": "12",
        "is_ignore": "false",
        "is_row_identifier": "false",
        "is_target": "false",
        "name": "nB",
        "number_of_missing_values": "0"
      },
      {
        "data_type": "numeric",
        "index": "13",
        "is_ignore": "false",
        "is_row_identifier": "false",
        "is_target": "false",
        "name": "nBM",
        "number_of_missing_values": "0"
      },
      {
        "data_type": "numeric",
        "index": "14",
        "is_ignore": "false",
        "is_row_identifier": "false",
        "is_target": "false",
        "name": "nBO",
        "number_of_missing_values": "0"
      },
      {
        "data_type": "numeric",
        "index": "15",
        "is_ignore": "false",
        "is_row_identifier": "false",
        "is_target": "false",
        "name": "nBR",
        "number_of_missing_values": "0"
      },
      {
        "data_type": "numeric",
        "index": "16",
        "is_ignore": "false",
        "is_row_identifier": "false",
        "is_target": "false",
        "name": "nBT",
        "number_of_missing_values": "0"
      },
      {
        "data_type": "numeric",
        "index": "17",
        "is_ignore": "false",
        "is_row_identifier": "false",
        "is_target": "false",
        "name": "nC",
        "number_of_missing_values": "0"
      },
      {
        "data_type": "numeric",
        "index": "18",
        "is_ignore": "false",
        "is_row_identifier": "false",
        "is_target": "false",
        "name": "nCL",
        "number_of_missing_values": "0"
      },
      {
        "data_type": "numeric",
        "index": "19",
        "is_ignore": "false",
        "is_row_identifier": "false",
        "is_target": "false",
        "name": "nCsp",
        "number_of_missing_values": "0"
      },
      {
        "data_type": "numeric",
        "index": "20",
        "is_ignore": "false",
        "is_row_identifier": "false",
        "is_target": "false",
        "name": "nCsp2",
        "number_of_missing_values": "0"
      },
      {
        "data_type": "numeric",
        "index": "21",
        "is_ignore": "false",
        "is_row_identifier": "false",
        "is_target": "false",
        "name": "nCsp3",
        "number_of_missing_values": "0"
      },
      {
        "data_type": "numeric",
        "index": "22",
        "is_ignore": "false",
        "is_row_identifier": "false",
        "is_target": "false",
        "name": "nDB",
        "number_of_missing_values": "0"
      },
      {
        "data_type": "numeric",
        "index": "23",
        "is_ignore": "false",
        "is_row_identifier": "false",
        "is_target": "false",
        "name": "nF",
        "number_of_missing_values": "0"
      },
      {
        "data_type": "numeric",
        "index": "24",
        "is_ignore": "false",
        "is_row_identifier": "false",
        "is_target": "false",
        "name": "nH",
        "number_of_missing_values": "0"
      },
      {
        "data_type": "numeric",
        "index": "25",
        "is_ignore": "false",
        "is_row_identifier": "false",
        "is_target": "false",
        "name": "nHet",
        "number_of_missing_values": "0"
      },
      {
        "data_type": "numeric",
        "index": "26",
        "is_ignore": "false",
        "is_row_identifier": "false",
        "is_target": "false",
        "name": "nHM",
        "number_of_missing_values": "0"
      },
      {
        "data_type": "numeric",
        "index": "27",
        "is_ignore": "false",
        "is_row_identifier": "false",
        "is_target": "false",
        "name": "nI",
        "number_of_missing_values": "0"
      },
      {
        "data_type": "numeric",
        "index": "28",
        "is_ignore": "false",
        "is_row_identifier": "false",
        "is_target": "false",
        "name": "nN",
        "number_of_missing_values": "0"
      },
      {
        "data_type": "numeric",
        "index": "29",
        "is_ignore": "false",
        "is_row_identifier": "false",
        "is_target": "false",
        "name": "nO",
        "number_of_missing_values": "0"
      },
      {
        "data_type": "numeric",
        "index": "30",
        "is_ignore": "false",
        "is_row_identifier": "false",
        "is_target": "false",
        "name": "nP",
        "number_of_missing_values": "0"
      },
      {
        "data_type": "numeric",
        "index": "31",
        "is_ignore": "false",
        "is_row_identifier": "false",
        "is_target": "false",
        "name": "nS",
        "number_of_missing_values": "0"
      },
      {
        "data_type": "numeric",
        "index": "32",
        "is_ignore": "false",
        "is_row_identifier": "false",
        "is_target": "false",
        "name": "nSK",
        "number_of_missing_values": "0"
      },
      {
        "data_type": "numeric",
        "index": "33",
        "is_ignore": "false",
        "is_row_identifier": "false",
        "is_target": "false",
        "name": "nTB",
        "number_of_missing_values": "0"
      },
      {
        "data_type": "numeric",
        "index": "34",
        "is_ignore": "false",
        "is_row_identifier": "false",
        "is_target": "false",
        "name": "nX",
        "number_of_missing_values": "0"
      },
      {
        "data_type": "numeric",
        "index": "35",
        "is_ignore": "false",
        "is_row_identifier": "false",
        "is_target": "false",
        "name": "O.",
        "number_of_missing_values": "0"
      },
      {
        "data_type": "numeric",
        "index": "36",
        "is_ignore": "false",
        "is_row_identifier": "false",
        "is_target": "false",
        "name": "RBF",
        "number_of_missing_values": "0"
      },
      {
        "data_type": "numeric",
        "index": "37",
        "is_ignore": "false",
        "is_row_identifier": "false",
        "is_target": "false",
        "name": "RBN",
        "number_of_missing_values": "0"
      },
      {
        "data_type": "numeric",
        "index": "38",
        "is_ignore": "false",
        "is_row_identifier": "false",
        "is_target": "false",
        "name": "SCBO",
        "number_of_missing_values": "0"
      },
      {
        "data_type": "numeric",
        "index": "39",
        "is_ignore": "false",
        "is_row_identifier": "false",
        "is_target": "false",
        "name": "Se",
        "number_of_missing_values": "0"
      },
      {
        "data_type": "numeric",
        "index": "40",
        "is_ignore": "false",
        "is_row_identifier": "false",
        "is_target": "false",
        "name": "Si",
        "number_of_missing_values": "0"
      },
      {
        "data_type": "numeric",
        "index": "41",
        "is_ignore": "false",
        "is_row_identifier": "false",
        "is_target": "false",
        "name": "Sp",
        "number_of_missing_values": "0"
      },
      {
        "data_type": "numeric",
        "index": "42",
        "is_ignore": "false",
        "is_row_identifier": "false",
        "is_target": "false",
        "name": "Sv",
        "number_of_missing_values": "0"
      },
      {
        "data_type": "numeric",
        "index": "43",
        "is_ignore": "false",
        "is_row_identifier": "false",
        "is_target": "false",
        "name": "X.",
        "number_of_missing_values": "0"
      },
      {
        "data_type": "numeric",
        "index": "44",
        "is_ignore": "false",
        "is_row_identifier": "false",
        "is_target": "true",
        "name": "pXC50",
        "number_of_missing_values": "0"
      }
    ]
  }
}