{
  "data_set_description": {
    "collection_date": "November 2013",
    "creator": "Dr Jeremy Besnard, Dr Ivan Olier, Dr Noureddin Sadawi, Dr Larisa Soldatova, Dr Crina Grosan, Prof Ross King, Dr Richard Bickerton, Prof Andrew Hopkins and Dr Willem van Hoorn",
    "default_target_attribute": "pXC50",
    "description": "This dataset contains QSAR data (from ChEMBL version 17) showing activity values (unit is pseudo-pCI50) of several compounds on drug target ChEMBL_ID: CHEMBL2052031 (TID: 104573), and it has 94 rows and 1232 features (not including molecule IDs and class feature: molecule_id and pXC50). The features represent Molecular Descriptors which were generated from SMILES strings. Missing value imputation was applied to this dataset (By choosing the Median).",
    "description_version": "1",
    "file_id": "3518578",
    "format": "ARFF",
    "id": "33978",
    "licence": "Public",
    "md5_checksum": "7fc278e25642afea95996d0cebeffc2e",
    "minio_url": "https://data.openml.org/datasets/0003/33978/dataset_33978.pq",
    "name": "QSAR-DATASET-FOR-DRUG-TARGET-CHEMBL2052031",
    "original_data_url": "https://www.ebi.ac.uk/chembl/target/inspect/CHEMBL2052031",
    "parquet_url": "https://data.openml.org/datasets/0003/33978/dataset_33978.pq",
    "processing_date": "2018-10-04 03:38:30",
    "row_id_attribute": "molecule_id",
    "status": "deactivated",
    "tag": [
      "MetaQSAR",
      "study_13"
    ],
    "upload_date": "2016-07-15T14:10:42",
    "url": "https://api.openml.org/data/v1/download/3518578/QSAR-DATASET-FOR-DRUG-TARGET-CHEMBL2052031.arff",
    "version": "12",
    "visibility": "public"
  }
}