{
  "data_features": {
    "feature": [
      {
        "data_type": "nominal",
        "index": "0",
        "is_ignore": "false",
        "is_row_identifier": "true",
        "is_target": "false",
        "name": "molecule_id",
        "nominal_value": [
          "CHEMBL1793955",
          "CHEMBL217517",
          "CHEMBL263545",
          "CHEMBL265017",
          "CHEMBL265119",
          "CHEMBL265264",
          "CHEMBL269715",
          "CHEMBL330022",
          "CHEMBL373742",
          "CHEMBL384292",
          "CHEMBL406303",
          "CHEMBL410025",
          "CHEMBL411357",
          "CHEMBL411420",
          "CHEMBL413249",
          "CHEMBL413706",
          "CHEMBL414582",
          "CHEMBL415230",
          "CHEMBL437631",
          "CHEMBL438387",
          "CHEMBL87636"
        ],
        "number_of_missing_values": "0"
      },
      {
        "data_type": "numeric",
        "index": "1",
        "is_ignore": "false",
        "is_row_identifier": "false",
        "is_target": "false",
        "name": "AMW",
        "number_of_missing_values": "0"
      },
      {
        "data_type": "numeric",
        "index": "2",
        "is_ignore": "false",
        "is_row_identifier": "false",
        "is_target": "false",
        "name": "C.",
        "number_of_missing_values": "0"
      },
      {
        "data_type": "numeric",
        "index": "3",
        "is_ignore": "false",
        "is_row_identifier": "false",
        "is_target": "true",
        "name": "pXC50",
        "number_of_missing_values": "0"
      }
    ]
  }
}