"molecule_id","nArCOOR","MATS1v","SpMAD_AEA.dm.","C.027","H.049","MATS1p","SM05_EA","Eig01_AEA.dm.","SpDiam_AEA.dm.","SpMax_AEA.dm.","ATSC4i","ATSC5i","ATSC5p","Eig02_AEA.dm.","SpMAD_AEA.ri.","Eig02_AEA.ed.","SM08_AEA.bo.","SM09_EA.bo.","SM11_EA.bo.","SM12_EA.bo.","ATSC1i","ATSC1p","SM06_EA","CATS2D_07_DD","CIC4","CIC5","SIC4","SIC5","SpMax3_Bh.s.","SpMin4_Bh.v.","ATSC5m","Eig04_AEA.dm.","Eig04_AEA.ed.","MWC10","nPyridines","GATS1e","TIE","SM03_EA.ed.","SM04_AEA.ed.","SM04_EA.ed.","SM05_EA.ed.","SM07_AEA.ed.","SM07_EA","SM07_EA.ed.","SM08_AEA.ed.","SM08_EA","SM08_EA.ed.","SM09_AEA.ed.","SM09_EA","SM09_EA.ed.","SM10_EA","SM10_EA.ed.","SM11_EA","SM11_EA.ed.","SM12_EA","SM13_EA","SM14_EA","ATS4s","MWC09","SM06_EA.ed.","SM10_AEA.ed.","SM11_AEA.ed.","SM12_AEA.ed.","pXC50"
{2 0.002,3 1.617,6 -0.009,7 6.217,8 3.983,9 5.983,10 3.983,11 0.787,12 0.663,13 6.407,14 3.03,15 1.529,16 5.732,17 12.716,18 13.019,19 15.832,20 17.312,21 0.331,22 2.062,23 7.687,25 0.345,26 0.345,27 0.929,28 0.929,29 4.765,30 1.314,31 14.996,32 2.694,33 5.251,34 11.821,36 0.54,37 31.728,38 7.326,39 8.775,40 10.488,41 12.343,42 14.136,43 8.564,44 17.273,45 15.979,46 9.847,47 19.82,48 17.84,49 10.905,50 22.198,51 12.124,52 24.692,53 13.262,54 27.125,55 14.461,56 15.633,57 16.829,58 5.391,59 10.909,60 15.044,61 19.716,62 21.604,63 23.502,64 4.301}
{0 CHEMBL148483,2 0.06,3 1.743,6 0.044,7 6.217,8 3.971,9 5.971,10 3.971,11 0.566,12 0.419,13 3.245,14 3.499,15 1.555,16 5.943,17 12.645,18 13.024,19 15.852,20 17.305,21 0.344,22 1.813,23 7.6,25 0.294,26 0.294,27 0.935,28 0.935,29 7.352,30 1.318,31 10.223,32 2.749,33 5.466,34 11.626,36 0.669,37 32.458,38 7.29,39 8.69,40 10.414,41 12.279,42 14.122,43 8.558,44 17.162,45 15.973,46 9.8,47 19.687,48 17.836,49 10.891,50 22.036,51 12.088,52 24.507,53 13.234,54 26.914,55 14.42,56 15.59,57 16.775,58 5.432,59 10.714,60 14.957,61 19.711,62 21.594,63 23.485,64 4.149}
{0 CHEMBL185698,2 -0.013,3 1.628,6 -0.029,7 6.463,8 3.981,9 5.981,10 3.981,11 0.961,12 0.857,13 7.919,14 3.321,15 1.539,16 6.185,17 12.904,18 13.226,19 16.032,20 17.495,21 0.434,22 2.944,23 7.933,25 0.286,26 0.171,27 0.944,28 0.967,29 4.957,30 1.513,31 13.247,32 2.898,33 5.554,34 12.081,36 0.712,37 40.699,38 7.576,39 9.026,40 10.723,41 12.546,42 14.372,43 8.796,44 17.42,45 16.205,46 10.074,47 19.945,48 18.055,49 11.115,50 22.297,51 12.323,52 24.774,53 13.443,54 27.19,55 14.63,56 15.786,57 16.968,58 5.617,59 11.169,60 15.225,61 19.918,62 21.792,63 23.677,64 4.87}
{0 CHEMBL187266,2 0.05,3 1.682,6 0.033,7 6.957,8 3.921,9 5.921,10 3.921,11 1.4,12 1.263,13 10.793,14 3.654,15 1.575,16 7.111,17 13.308,18 13.917,19 16.855,20 18.347,21 0.487,22 4.158,23 8.366,25 0.707,26 0.707,27 0.867,28 0.867,29 5.046,30 1.618,31 27.163,32 2.957,33 5.933,34 12.445,36 0.581,37 43.36,38 8.223,39 9.346,40 11.355,41 13.464,42 14.99,43 9.415,44 18.574,45 16.917,46 10.694,47 21.182,48 18.857,49 11.856,50 23.668,51 13.099,52 26.24,53 14.305,54 28.769,55 15.54,56 16.765,57 18.001,58 5.943,59 11.489,60 16.192,61 20.806,62 22.763,63 24.726,64 4.767}
{0 CHEMBL187460,2 0.054,3 1.697,6 0.037,7 6.957,8 3.954,9 5.954,10 3.954,11 1.473,12 1.322,13 11.286,14 3.659,15 1.572,16 7.111,17 13.273,18 13.721,19 16.636,20 18.119,21 0.529,22 4.529,23 8.366,25 0.721,26 0.721,27 0.866,28 0.866,29 4.81,30 1.618,31 29.227,32 3.023,33 5.933,34 12.445,36 0.582,37 44.886,38 8.223,39 9.346,40 11.355,41 13.464,42 14.99,43 9.415,44 18.574,45 16.917,46 10.694,47 21.182,48 18.857,49 11.856,50 23.668,51 13.099,52 26.24,53 14.305,54 28.769,55 15.54,56 16.765,57 18.001,58 5.961,59 11.489,60 16.192,61 20.806,62 22.763,63 24.726,64 4.527}
{0 CHEMBL187579,2 -0.015,3 1.742,6 -0.041,7 6.494,8 4.063,9 6.063,10 4.063,11 0.951,12 0.822,13 5.568,14 3.977,15 1.527,16 6.415,17 13.01,18 13.466,19 16.294,20 17.74,21 0.462,22 2.66,23 7.911,25 0.36,26 0.36,27 0.928,28 0.928,29 6.82,30 1.575,31 15.852,32 2.953,33 5.545,34 12.024,36 0.566,37 43.719,38 7.594,39 8.996,40 10.731,41 12.6,42 14.402,43 8.842,44 17.488,45 16.249,46 10.094,47 20.011,48 18.111,49 11.171,50 22.367,51 12.37,52 24.841,53 13.508,54 27.256,55 14.692,56 15.856,57 17.038,58 5.683,59 11.105,60 15.275,61 19.985,62 21.868,63 23.759,64 5.143}
{0 CHEMBL187598,2 0.032,3 1.628,6 0.038,7 6.479,8 3.984,9 5.984,10 3.984,11 0.963,12 0.84,13 6.025,14 3.096,15 1.541,16 6.245,17 13.045,18 13.816,19 16.743,20 18.242,21 0.445,22 2.67,23 7.937,25 0.063,26 0.063,27 0.988,28 0.988,29 7.352,30 1.453,31 13.222,32 2.907,33 5.552,34 12.099,36 0.514,37 41.587,38 7.576,39 9.018,40 10.73,41 12.564,42 14.375,43 8.823,44 17.445,45 16.211,46 10.096,47 19.969,48 18.063,49 11.151,50 22.322,51 12.357,52 24.796,53 13.484,54 27.211,55 14.671,56 15.829,57 17.011,58 5.575,59 11.182,60 15.244,61 19.928,62 21.805,63 23.691,64 5.317}
{0 CHEMBL187717,2 0.035,3 1.662,6 0.097,7 6.608,8 4.01,9 6.01,10 4.01,11 1.007,12 0.868,13 6.334,14 3.77,15 1.546,16 6.247,17 13.211,18 14.032,19 16.971,20 18.468,21 0.455,22 2.774,23 8.06,25 0.118,26 0.118,27 0.977,28 0.977,29 7.352,30 1.579,31 12.832,32 2.941,33 5.671,34 12.239,36 0.387,37 51.926,38 7.751,39 9.137,40 10.92,41 12.822,42 14.554,43 8.976,44 17.786,45 16.41,46 10.25,47 20.346,48 18.282,49 11.327,50 22.755,51 12.541,52 25.274,53 13.687,54 27.744,55 14.885,56 16.062,57 17.26,58 5.805,59 11.313,60 15.526,61 20.167,62 22.063,63 23.968,64 5.699}
{0 CHEMBL188487,2 -0.002,3 1.66,6 -0.008,7 6.431,8 3.984,9 5.984,10 3.984,11 0.832,12 0.676,13 6.509,14 3.273,15 1.55,16 6.083,17 12.9,18 13.288,19 16.095,20 17.555,21 0.395,22 1.768,23 7.852,25 0.069,26 0.069,27 0.986,28 0.986,29 7.352,30 1.306,31 20.178,32 2.895,33 5.541,34 11.96,36 0.534,37 47.817,38 7.509,39 8.95,40 10.644,41 12.474,42 14.31,43 8.748,44 17.363,45 16.146,46 10.005,47 19.898,48 17.998,49 11.063,50 22.257,51 12.264,52 24.742,53 13.394,54 27.164,55 14.581,56 15.743,57 16.928,58 5.67,59 11.047,60 15.161,61 19.864,62 21.741,63 23.628,64 5.027}
{0 CHEMBL188983,2 0.021,3 1.601,6 0.007,7 6.479,8 3.981,9 5.981,10 3.981,11 0.912,12 0.809,13 8.172,14 3.004,15 1.532,16 6.243,17 13.069,18 13.826,19 16.754,20 18.255,21 0.376,22 2.388,23 7.949,25 0.056,26 0.056,27 0.989,28 0.989,29 4.882,30 1.556,31 18.152,32 2.898,33 5.545,34 12.065,36 0.54,37 38.411,38 7.576,39 9.034,40 10.724,41 12.556,42 14.375,43 8.819,44 17.43,45 16.209,46 10.095,47 19.949,48 18.059,49 11.141,50 22.302,51 12.348,52 24.773,53 13.47,54 27.186,55 14.654,56 15.809,57 16.989,58 5.551,59 11.16,60 15.228,61 19.922,62 21.798,63 23.683,64 4.629}
{0 CHEMBL190743,2 0.02,3 1.622,6 0.006,7 6.479,8 3.983,9 5.983,10 3.983,11 0.84,12 0.704,13 7.111,14 3.095,15 1.552,16 6.245,17 13.045,18 13.816,19 16.743,20 18.242,21 0.33,22 1.945,23 7.937,25 0.063,26 0.063,27 0.988,28 0.988,29 4.87,30 1.452,31 15.707,32 2.879,33 5.552,34 12.099,36 0.539,37 34.585,38 7.576,39 9.018,40 10.73,41 12.564,42 14.375,43 8.823,44 17.445,45 16.211,46 10.096,47 19.969,48 18.063,49 11.151,50 22.322,51 12.357,52 24.796,53 13.484,54 27.211,55 14.671,56 15.829,57 17.011,58 5.474,59 11.182,60 15.244,61 19.928,62 21.805,63 23.691,64 6.022}
{0 CHEMBL191575,2 0.029,3 1.632,6 0.018,7 6.621,8 3.983,9 5.983,10 3.983,11 1.073,12 0.957,13 8.971,14 3.578,15 1.533,16 6.109,17 13.119,18 13.442,19 16.217,20 17.665,21 0.479,22 2.604,23 8.057,25 0.25,26 0.25,27 0.953,28 0.953,29 7.352,30 1.639,31 19.497,32 2.939,33 5.555,34 12.163,36 0.599,37 58.884,38 7.673,39 9.162,40 10.792,41 12.575,42 14.456,43 8.906,44 17.416,45 16.272,46 10.162,47 19.938,48 18.107,49 11.186,50 22.283,51 12.379,52 24.759,53 13.487,54 27.175,55 14.664,56 15.811,57 16.987,58 5.826,59 11.26,60 15.243,61 19.957,62 21.82,63 23.695,64 4.901}
{0 CHEMBL194398,2 0.002,3 1.556,6 -0.027,7 6.711,8 3.851,9 5.851,10 3.851,11 2.273,12 2.304,13 17.121,14 3.724,15 1.467,16 6.113,17 13.034,18 12.754,19 15.324,20 16.707,21 1.139,22 7.749,23 8.139,25 0.573,26 0.573,27 0.91,28 0.91,29 7.427,30 1.787,31 52.387,32 3.568,33 6.001,34 12.077,36 0.653,37 182.251,38 7.673,39 9.287,40 10.718,41 12.311,42 14.435,43 8.878,44 16.786,45 16.196,46 10.093,47 19.145,48 17.969,49 11.001,50 21.231,51 12.127,52 23.515,53 13.116,54 25.675,55 14.206,56 15.236,57 16.313,58 6.545,59 11.222,60 14.857,61 19.753,62 21.544,63 23.341,64 4.347}
{0 CHEMBL196635,2 -0.017,3 1.564,6 -0.054,7 6.686,8 3.85,9 5.731,10 3.85,11 2.177,12 2.203,13 16.545,14 3.724,15 1.467,16 6.1,17 12.971,18 12.641,19 15.195,20 16.521,21 1.121,22 7.709,23 8.075,25 0.689,26 0.689,27 0.892,28 0.892,29 7.427,30 1.787,31 53.29,32 3.568,33 5.987,34 11.975,36 0.659,37 217.525,38 7.63,39 9.23,40 10.652,41 12.258,42 14.384,43 8.838,44 16.735,45 16.146,46 10.032,47 19.092,48 17.922,49 10.953,50 21.182,51 12.068,52 23.465,53 13.065,54 25.627,55 14.15,56 15.183,57 16.258,58 6.54,59 11.122,60 14.797,61 19.706,62 21.499,63 23.298,64 4.155}
{0 CHEMBL20636,2 0.002,3 1.564,6 -0.035,7 6.77,8 3.837,9 5.837,10 3.837,11 2.241,12 2.244,13 14.802,14 3.723,15 1.472,16 6.113,17 13.092,18 12.873,19 15.452,20 16.829,21 1.208,22 7.346,23 8.181,25 0.556,26 0.556,27 0.912,28 0.912,29 7.431,30 1.787,31 50.942,32 3.568,33 6.001,34 12.116,36 0.658,37 199.052,38 7.722,39 9.333,40 10.753,41 12.337,42 14.474,43 8.925,44 16.801,45 16.23,46 10.132,47 19.159,48 18,49 11.04,50 21.24,51 12.162,52 23.523,53 13.15,54 25.681,55 14.237,56 15.265,57 16.34,58 6.575,59 11.261,60 14.879,61 19.779,62 21.567,63 23.361,64 5}
{0 CHEMBL207207,2 0.03,3 1.594,6 0.038,7 6.133,8 4.462,9 6.462,10 4.462,11 1.013,12 1.001,13 7.872,14 3.589,15 1.466,16 5.667,17 12.744,18 12.954,19 15.659,20 17.137,21 0.595,22 3.764,23 7.627,24 1,25 0.343,26 0.343,27 0.937,28 0.937,29 4.998,30 1.634,31 22.129,32 2.865,33 5.053,34 11.635,36 0.829,37 50.794,38 7.081,39 8.785,40 10.134,41 11.577,42 13.791,43 8.249,44 15.974,45 15.502,46 9.512,47 18.341,48 17.228,49 10.337,50 20.37,51 11.488,52 22.651,53 12.423,54 24.781,55 13.521,56 14.516,57 15.591,58 5.682,59 10.779,60 14.145,61 18.966,62 20.715,63 22.472,64 4}
{0 CHEMBL208584,2 0.029,3 1.591,6 0.055,7 5.802,8 4.462,9 6.462,10 4.462,11 0.894,12 0.844,13 6.652,14 3.58,15 1.433,16 5.519,17 12.399,18 12.508,19 15.166,20 16.636,21 0.548,22 3.5,23 7.29,24 1,25 0.494,26 0.494,27 0.906,28 0.906,29 4.946,30 1.616,31 19.515,32 2.869,33 4.973,34 11.242,36 0.795,37 44.414,38 6.698,39 8.466,40 9.701,41 11.001,42 13.366,43 7.854,44 15.164,45 15.031,46 9.107,47 17.46,48 16.705,49 9.871,50 19.306,51 11.005,52 21.494,53 11.881,54 23.448,55 12.954,56 13.894,57 14.936,58 5.478,59 10.404,60 13.514,61 18.386,62 20.073,63 21.765,64 4.523}
{0 CHEMBL208732,2 0.028,3 1.59,4 1,5 1,6 0.042,7 6.33,8 4.46,9 6.46,10 4.46,11 1.164,12 1.051,13 7.787,14 3.579,15 1.487,16 6.014,17 12.956,18 13.291,19 16.04,20 17.511,21 0.589,22 3.135,23 7.832,25 0.409,26 0.409,27 0.925,28 0.925,29 5.008,30 1.626,31 20.862,32 2.992,33 5.333,34 11.885,36 0.66,37 48.491,38 7.322,39 8.972,40 10.394,41 11.933,42 14.05,43 8.497,44 16.396,45 15.789,46 9.762,47 18.758,48 17.542,49 10.624,50 20.835,51 11.779,52 23.117,53 12.743,54 25.277,55 13.849,56 14.866,57 15.951,58 5.717,59 11.016,60 14.492,61 19.307,62 21.08,63 22.861,64 5.523}
{0 CHEMBL208763,2 0.021,3 1.587,4 1,5 1,6 0.037,7 6.236,8 4.46,9 6.46,10 4.46,11 1.134,12 1.032,13 7.237,14 3.577,15 1.479,16 6.014,17 12.883,18 13.177,19 15.916,20 17.396,21 0.616,22 3.499,23 7.764,25 0.409,26 0.409,27 0.925,28 0.925,29 4.946,30 1.63,31 17.549,32 2.938,33 5.318,34 11.811,36 0.636,37 44.244,38 7.248,39 8.904,40 10.309,41 11.868,42 13.978,43 8.404,44 16.33,45 15.717,46 9.681,47 18.681,48 17.472,49 10.526,50 20.771,51 11.686,52 23.051,53 12.639,54 25.22,55 13.747,56 14.757,57 15.844,58 5.671,59 10.952,60 14.408,61 19.237,62 21.012,63 22.795,64 4.824}
{0 CHEMBL209227,2 0.027,3 1.597,4 1,5 1,6 0.048,7 6.347,8 4.46,9 6.46,10 4.46,11 1.152,12 1.045,13 7.329,14 3.577,15 1.489,16 6.041,17 12.952,18 13.314,19 16.057,20 17.507,21 0.637,22 3.353,23 7.824,25 0.343,26 0.343,27 0.937,28 0.937,29 4.943,30 1.63,31 14.905,32 2.939,33 5.327,34 11.873,36 0.72,37 44.003,38 7.322,39 8.962,40 10.371,41 11.93,42 14.041,43 8.509,44 16.389,45 15.779,46 9.756,47 18.745,48 17.532,49 10.628,50 20.834,51 11.773,52 23.119,53 12.744,54 25.291,55 13.845,56 14.868,57 15.953,58 5.581,59 11.008,60 14.47,61 19.295,62 21.069,63 22.85,64 4.854}
{0 CHEMBL209287,2 -0.012,3 1.619,6 -0.015,7 6.089,8 3.979,9 5.979,10 3.979,11 0.722,12 0.629,13 6.329,14 2.992,15 1.503,16 5.676,17 12.525,18 12.9,19 15.737,20 17.198,21 0.368,22 2.563,23 7.529,25 0.384,26 0.384,27 0.92,28 0.92,29 4.685,30 1.369,31 15.714,32 2.567,33 4.908,34 11.634,36 0.552,37 30.706,38 7.213,39 8.611,40 10.378,41 12.278,42 14.034,43 8.462,44 17.233,45 15.892,46 9.735,47 19.782,48 17.767,49 10.828,50 22.168,51 12.045,52 24.661,53 13.202,54 27.097,55 14.403,56 15.584,57 16.781,58 5.291,59 10.719,60 14.983,61 19.654,62 21.551,63 23.457,64 4.18}
{0 CHEMBL209667,2 0.02,3 1.593,4 1,5 1,6 0.037,7 6.365,8 4.46,9 6.46,10 4.46,11 1.102,12 1.01,13 7.356,14 3.577,15 1.487,16 6.147,17 12.981,18 13.349,19 16.114,20 17.588,21 0.604,22 3.274,23 7.863,25 0.227,26 0.227,27 0.958,28 0.958,29 4.946,30 1.63,31 18.535,32 2.941,33 5.345,34 11.903,36 0.629,37 49.946,38 7.391,39 9,40 10.46,41 12.083,42 14.133,43 8.555,44 16.638,45 15.895,46 9.819,47 19.029,48 17.673,49 10.706,50 21.182,51 11.866,52 23.509,53 12.853,54 25.737,55 13.969,56 15.008,57 16.108,58 5.756,59 11.037,60 14.651,61 19.463,62 21.264,63 23.074,64 4.824}
{0 CHEMBL210092,2 0.04,3 1.671,4 1,5 1,6 0.066,7 6.608,8 4.46,9 6.46,10 4.46,11 1.501,12 1.484,13 12.188,14 4.368,15 1.491,16 6.203,17 13.176,18 13.754,19 16.626,20 18.111,21 0.703,22 4.349,23 8.067,25 0.476,26 0.476,27 0.916,28 0.916,29 4.941,30 1.689,31 31.31,32 3.199,33 5.482,34 12.179,36 0.684,37 53.182,38 7.678,39 9.182,40 10.793,41 12.574,42 14.433,43 8.87,44 17.402,45 16.242,46 10.129,47 19.916,48 18.071,49 11.121,50 22.254,51 12.309,52 24.724,53 13.393,54 27.13,55 14.561,56 15.692,57 16.858,58 5.764,59 11.282,60 15.231,61 19.917,62 21.777,63 23.65,64 4.959}
{0 CHEMBL210097,2 0.021,3 1.576,4 1,5 1,6 0.033,7 6.868,8 4.461,9 6.461,10 4.461,11 1.608,12 1.354,13 8.678,14 4.459,15 1.517,16 6.493,17 13.268,18 13.563,19 16.328,20 17.786,21 0.878,22 3.768,23 8.282,25 0.314,26 0.314,27 0.943,28 0.943,29 7.999,30 1.648,31 19.555,32 3.272,33 5.499,34 12.116,36 0.594,37 82.077,38 7.96,39 9.313,40 10.948,41 12.844,42 14.665,43 9.161,44 17.636,45 16.508,46 10.406,47 20.098,48 18.37,49 11.439,50 22.439,51 12.623,52 24.871,53 13.727,54 27.265,55 14.894,56 16.033,57 17.198,58 6.153,59 11.237,60 15.422,61 20.247,62 22.136,63 24.034,64 4.824}
{0 CHEMBL210487,2 0.024,3 1.653,6 0.029,7 6.581,8 4.642,9 6.642,10 4.642,11 1.6,12 1.617,13 11.202,14 4.085,15 1.463,16 6.076,17 13.137,18 13.479,19 16.282,20 17.758,21 0.771,22 5.039,23 8.025,24 1,25 0.441,26 0.441,27 0.924,28 0.924,29 6.821,30 1.776,31 30.723,32 3.543,33 5.739,34 12.047,36 0.78,37 92.628,38 7.647,39 9.166,40 10.706,41 12.392,42 14.392,43 8.794,44 17.022,45 16.178,46 10.031,47 19.454,48 17.978,49 10.973,50 21.664,51 12.127,52 24.044,53 13.155,54 26.337,55 14.278,56 15.349,57 16.464,58 6.222,59 11.169,60 14.983,61 19.788,62 21.608,63 23.436,64 4.222}
{0 CHEMBL210497,2 0.068,3 1.7,6 0.006,7 6.804,8 4.661,9 6.661,10 4.661,11 1.421,12 1.352,13 9.65,14 4.463,15 1.48,16 6.684,17 13.448,18 14.305,19 17.299,20 18.826,21 0.762,22 4.618,23 8.214,24 1,25 0.383,26 0.383,27 0.932,28 0.932,29 6.999,30 1.733,31 23.287,32 3.579,33 5.497,34 12.03,36 0.756,37 91.656,38 7.928,39 9.24,40 10.92,41 12.849,42 14.63,43 9.113,44 17.686,45 16.485,46 10.36,47 20.168,48 18.358,49 11.411,50 22.528,51 12.602,52 24.976,53 13.721,54 27.382,55 14.897,56 16.047,57 17.221,58 6.193,59 11.149,60 15.446,61 20.245,62 22.144,63 24.053,64 4.398}
{0 CHEMBL210525,2 0.041,3 1.681,6 0.028,7 6.236,8 3.979,9 5.979,10 3.979,11 0.735,12 0.625,13 4.803,14 3.499,15 1.52,16 5.957,17 12.668,18 13.035,19 15.863,20 17.317,21 0.422,22 2.491,23 7.649,25 0.371,26 0.371,27 0.924,28 0.924,29 7.352,30 1.493,31 13.673,32 2.769,33 5.51,34 11.735,36 0.644,37 40.493,38 7.353,39 8.736,40 10.492,41 12.382,42 14.169,43 8.592,44 17.3,45 16.023,46 9.848,47 19.835,48 17.892,49 10.936,50 22.21,51 12.141,52 24.696,53 13.29,54 27.125,55 14.482,56 15.656,57 16.847,58 5.538,59 10.819,60 15.067,61 19.771,62 21.659,63 23.556,64 4.602}
{0 CHEMBL210612,2 0.033,3 1.584,4 1,5 1,6 0.057,7 6.089,8 4.46,9 6.46,10 4.46,11 1.212,12 1.156,13 9.874,14 3.577,15 1.462,16 5.931,17 12.646,18 12.821,19 15.509,20 16.967,21 0.621,22 4.216,23 7.576,25 0.625,26 0.625,27 0.885,28 0.885,29 4.751,30 1.606,31 27.723,32 2.861,33 5.312,34 11.536,36 0.707,37 39.027,38 7.071,39 8.729,40 10.094,41 11.634,42 13.801,43 8.23,44 16.019,45 15.536,46 9.476,47 18.327,48 17.284,49 10.318,50 20.371,51 11.452,52 22.604,53 12.39,54 24.726,55 13.474,56 14.462,57 15.523,58 5.556,59 10.692,60 14.135,61 19.041,62 20.805,63 22.575,64 4.398}
{0 CHEMBL210632,2 0.027,3 1.673,6 0.034,7 6.463,8 4.463,9 6.463,10 4.463,11 1.363,12 1.339,13 9.931,14 4.083,15 1.462,16 5.931,17 13.079,18 13.457,19 16.265,20 17.745,21 0.689,22 4.318,23 7.919,24 1,25 0.398,26 0.398,27 0.929,28 0.929,29 6.821,30 1.683,31 24.59,32 3.542,33 5.463,34 11.939,36 0.795,37 78.505,38 7.519,39 9.064,40 10.576,41 12.25,42 14.256,43 8.663,44 16.89,45 16.035,46 9.907,47 19.331,48 17.83,49 10.835,50 21.554,51 11.994,52 23.946,53 13.016,54 26.252,55 14.143,56 15.214,57 16.333,58 6.092,59 11.066,60 14.845,61 19.637,62 21.456,63 23.284,64 4.222}
{0 CHEMBL211969,2 0.019,3 1.735,6 0.009,7 6.836,8 5.362,9 7.362,10 5.362,11 1.185,12 1.094,13 8.189,14 4.082,15 1.518,16 6.8,17 13.504,18 14.636,19 17.751,20 19.326,21 0.535,22 3.646,23 8.223,25 0.73,26 0.73,27 0.859,28 0.859,29 6.999,30 1.556,31 26.917,32 3.213,33 5.374,34 12.057,35 1,36 0.309,37 78.435,38 8.097,39 9.203,40 11.205,41 13.4,42 14.892,43 9.288,44 18.624,45 16.846,46 10.566,47 21.282,48 18.819,49 11.745,50 23.852,51 12.998,52 26.488,53 14.223,54 29.096,55 15.473,56 16.718,57 17.972,58 6.176,59 11.134,60 16.152,61 20.804,62 22.801,63 24.805,64 4.886}
{0 CHEMBL212019,2 0.043,3 1.681,6 0.05,7 6.621,8 4.085,9 5.969,10 4.085,11 1.294,12 0.96,13 7.142,14 3.745,15 1.505,16 6.595,17 12.978,18 13.41,19 16.293,20 17.759,21 0.511,22 3.668,23 8.017,25 0.635,26 0.635,27 0.878,28 0.878,29 5.076,30 1.563,31 20.988,32 2.985,33 5.366,34 11.976,36 0.722,37 40.132,38 7.791,39 8.987,40 10.824,41 12.831,42 14.442,43 8.994,44 17.758,45 16.308,46 10.245,47 20.278,48 18.189,49 11.353,50 22.679,51 12.563,52 25.164,53 13.726,54 27.608,55 14.927,56 16.115,57 17.319,58 5.704,59 11.046,60 15.467,61 20.08,62 21.979,63 23.885,64 4.796}
{0 CHEMBL212080,2 -0.026,3 1.564,6 -0.091,7 6.909,8 3.856,9 5.856,10 3.856,11 2.492,12 2.58,13 17.873,14 3.728,15 1.461,16 6.296,17 13.025,18 12.227,19 14.6,20 15.945,21 1.279,22 8.913,23 8.288,25 0.845,26 0.845,27 0.871,28 0.871,29 7.429,30 1.926,31 64.68,32 3.584,33 6.028,34 12.046,36 0.751,37 259.185,38 7.908,39 9.356,40 10.849,41 12.585,42 14.55,43 9.104,44 17.148,45 16.328,46 10.309,47 19.521,48 18.12,49 11.277,50 21.705,51 12.416,52 24.03,53 13.457,54 26.277,55 14.574,56 15.653,57 16.766,58 6.641,59 11.191,60 15.101,61 19.922,62 21.733,63 23.552,64 7.237}
{0 CHEMBL212190,2 0.044,3 1.582,6 -0.018,7 6.995,8 4.686,9 6.686,10 4.686,11 1.301,12 1.116,13 7.803,14 3.57,15 1.558,16 7.136,17 13.438,18 14.342,19 17.356,20 18.878,21 0.672,22 4.611,23 8.353,25 0.931,26 0.931,27 0.828,28 0.828,29 5.098,30 1.602,31 22.548,32 2.594,33 5.5,34 12.022,36 0.592,37 50.626,38 8.169,39 9.254,40 11.153,41 13.289,42 14.87,43 9.409,44 18.288,45 16.791,46 10.655,47 20.823,48 18.726,49 11.804,50 23.274,51 13.018,52 25.783,53 14.203,54 28.265,55 15.41,56 16.609,57 17.817,58 5.918,59 11.114,60 15.919,61 20.669,62 22.619,63 24.575,64 5}
{0 CHEMBL212218,2 0.042,3 1.698,6 0.069,7 7.223,8 5.377,9 7.377,10 5.377,11 1.39,12 1.278,13 7.585,14 4.462,15 1.589,16 7.128,17 13.727,18 14.776,19 17.886,20 19.462,21 0.717,22 3.417,23 8.576,25 0.786,26 0.786,27 0.847,28 0.847,29 7.999,30 1.596,31 16.185,32 3.743,33 5.953,34 12.383,36 0.483,37 146.484,38 8.46,39 9.512,40 11.541,41 13.756,42 15.226,43 9.671,44 19.003,45 17.183,46 10.938,47 21.68,48 19.157,49 12.129,50 24.277,51 13.381,52 26.939,53 14.612,54 29.578,55 15.866,56 17.118,57 18.378,58 6.487,59 11.445,60 16.512,61 21.143,62 23.139,63 25.145,64 6.523}
{0 CHEMBL212240,2 0.101,3 1.668,6 0.033,7 6.723,8 5.352,9 7.352,10 5.352,11 0.722,12 0.55,13 7.058,14 3.576,15 1.552,16 6.293,17 13.329,18 14.445,19 17.552,20 19.124,21 0.319,22 2.749,23 8.098,25 0.621,26 0.621,27 0.872,28 0.872,29 6.999,30 1.23,31 31.058,32 3.007,33 5.512,34 11.798,36 0.722,37 65.473,38 7.928,39 9.075,40 10.983,41 13.164,42 14.724,43 9.143,44 18.346,45 16.668,46 10.408,47 20.982,48 18.631,49 11.568,50 23.544,51 12.807,52 26.161,53 14.014,54 28.755,55 15.251,56 16.481,57 17.723,58 5.878,59 10.901,60 15.881,61 20.609,62 22.6,63 24.599,64 4.796}
{0 CHEMBL212399,2 -0.007,3 1.754,6 0.082,7 6.648,8 4.411,9 6.411,10 4.411,11 1.259,12 1.3,13 6.879,14 4.011,15 1.516,16 6.755,17 13.265,18 14.128,19 17.101,20 18.604,21 0.631,22 3.1,23 8.07,25 0.452,26 0.452,27 0.913,28 0.913,29 6.82,30 1.587,31 16.509,32 3.265,33 5.694,34 12.277,36 0.385,37 49.425,38 7.842,39 9.142,40 11.021,41 13.009,42 14.63,43 9.038,44 18.038,45 16.51,46 10.3,47 20.611,48 18.405,49 11.41,50 23.047,51 12.626,52 25.577,53 13.792,54 28.061,55 14.997,56 16.186,57 17.391,58 5.927,59 11.338,60 15.725,61 20.311,62 22.227,63 24.151,64 4.745}
{0 CHEMBL212454,2 -0.02,3 1.638,6 -0.115,7 6.909,8 5.351,9 7.351,10 5.351,11 0.865,12 0.77,13 6.567,14 3.805,15 1.509,16 6.214,17 13.514,18 14.443,19 17.524,20 19.09,21 0.404,22 2.6,23 8.283,25 1.487,26 1.487,27 0.719,28 0.719,29 7.431,30 1.564,31 15.672,32 3.143,33 5.641,34 11.956,36 0.695,37 122.187,38 8.061,39 9.302,40 11.097,41 13.217,42 14.854,43 9.272,44 18.357,45 16.773,46 10.524,47 20.981,48 18.714,49 11.648,50 23.534,51 12.871,52 26.145,53 14.055,54 28.736,55 15.277,56 16.491,57 17.721,58 6.289,59 11.077,60 15.916,61 20.674,62 22.65,63 24.637,64 6.046}
{0 CHEMBL212504,2 0.019,3 1.721,6 0.005,7 6.781,8 5.362,9 7.362,10 5.362,11 1.069,12 1.017,13 7.441,14 4.082,15 1.517,16 6.8,17 13.466,18 14.617,19 17.739,20 19.315,21 0.495,22 3.286,23 8.183,25 0.652,26 0.652,27 0.871,28 0.871,29 6.999,30 1.553,31 23.738,32 3.209,33 5.35,34 12.008,35 1,36 0.312,37 72.473,38 8.063,39 9.151,40 11.183,41 13.391,42 14.866,43 9.255,44 18.621,45 16.828,46 10.541,47 21.281,48 18.805,49 11.726,50 23.852,51 12.983,52 26.487,53 14.211,54 29.095,55 15.464,56 16.71,57 17.966,58 6.131,59 11.086,60 16.146,61 20.795,62 22.794,63 24.8,64 4.886}
{0 CHEMBL213054,2 0.001,3 1.576,5 1,6 -0.045,7 6.878,8 3.857,9 5.857,10 3.857,11 2.506,12 2.504,13 17.349,14 3.732,15 1.467,16 6.297,17 12.966,18 12.147,19 14.524,20 15.873,21 1.257,22 8.717,23 8.286,25 0.858,26 0.858,27 0.868,28 0.868,29 7.429,30 1.937,31 63.467,32 3.585,33 6.038,34 12.073,36 0.719,37 194.165,38 7.901,39 9.347,40 10.856,41 12.596,42 14.551,43 9.093,44 17.161,45 16.332,46 10.313,47 19.535,48 18.126,49 11.277,50 21.718,51 12.423,52 24.041,53 13.463,54 26.288,55 14.584,56 15.661,57 16.776,58 6.615,59 11.215,60 15.114,61 19.93,62 21.743,63 23.561,64 7.276}
{0 CHEMBL213543,2 -0.016,3 1.548,6 -0.069,7 6.581,8 3.841,9 5.841,10 3.841,11 2.214,12 2.193,13 14.746,14 3.725,15 1.449,16 6.099,17 12.818,18 12.072,19 14.454,20 15.824,21 1.161,22 7.882,23 8.007,25 0.703,26 0.703,27 0.89,28 0.89,29 7.429,30 1.918,31 56.202,32 3.575,33 5.361,34 11.898,36 0.73,37 214.568,38 7.529,39 9.17,40 10.555,41 12.123,42 14.278,43 8.715,44 16.58,45 16.028,46 9.93,47 18.934,48 17.792,49 10.813,50 21.017,51 11.937,52 23.297,53 12.909,54 25.457,55 13.994,56 15.012,57 16.084,58 6.546,59 11.056,60 14.662,61 19.568,62 21.353,63 23.146,64 6.18}
{0 CHEMBL213581,2 0.138,3 1.632,4 1,5 1,6 0.066,7 6.538,8 5.358,9 7.358,10 5.358,11 0.717,12 0.586,13 4.325,14 3.222,15 1.52,16 5.987,17 13.187,18 14.376,19 17.515,20 19.102,21 0.452,22 2.508,23 7.939,25 0.519,26 0.519,27 0.891,28 0.891,29 5.283,30 1.317,31 13.957,32 2.475,33 4.97,34 11.624,36 0.7,37 39.029,38 7.796,39 8.883,40 10.876,41 13.133,42 14.581,43 8.999,44 18.404,45 16.552,46 10.289,47 21.073,48 18.542,49 11.472,50 23.667,51 12.735,52 26.31,53 13.967,54 28.928,55 15.226,56 16.476,57 17.737,58 5.925,59 10.717,60 15.887,61 20.547,62 22.562,63 24.585,64 5.222}
{0 CHEMBL214372,2 0.015,3 1.485,4 2,5 2,6 0.046,7 5.352,8 3.636,9 5.5,10 3.636,11 0.342,12 0.356,13 3.013,14 2.644,15 1.438,16 5.335,17 11.986,18 12.172,19 14.791,20 16.152,21 0.271,22 1.557,23 6.83,25 0.105,26 0.105,27 0.975,28 0.975,29 4.802,30 1.274,31 8.082,32 1.385,33 3.427,34 10.748,36 0.634,37 15.832,38 6.26,39 7.975,40 9.321,41 10.858,42 13.035,43 7.507,44 15.224,45 14.773,46 8.726,47 17.524,48 16.523,49 9.589,50 19.542,51 10.7,52 21.764,53 11.65,54 23.851,55 12.716,56 13.707,57 14.755,58 4.75,59 9.919,60 13.353,61 18.282,62 20.048,63 21.819,64 4.398}
{0 CHEMBL2146517,2 0.028,3 1.693,6 -0.009,7 7.074,8 4.194,9 6.194,10 4.194,11 1.42,12 1.387,13 11.598,14 3.905,15 1.552,16 7.154,17 13.429,18 13.989,19 16.922,20 18.411,21 0.529,22 4.413,23 8.497,25 0.471,26 0.471,27 0.913,28 0.913,29 7.352,30 1.629,31 28.788,32 3.054,33 5.933,34 12.57,36 0.629,37 61.675,38 8.405,39 9.476,40 11.569,41 13.79,42 15.201,43 9.574,44 19.063,45 17.163,46 10.871,47 21.74,48 19.142,49 12.063,50 24.336,51 13.328,52 26.993,53 14.563,54 29.626,55 15.823,56 17.075,57 18.337,58 6.194,59 11.614,60 16.566,61 21.134,62 23.135,63 25.145,64 4.826}
{0 CHEMBL215254,2 0.07,3 1.67,6 0.074,7 6.986,8 3.923,9 5.923,10 3.923,11 1.431,12 1.336,13 11.336,14 3.699,15 1.556,16 7.132,17 13.332,18 13.926,19 16.864,20 18.356,21 0.508,22 4.269,23 8.404,25 0.427,26 0.427,27 0.92,28 0.92,29 6.456,30 1.614,31 29.487,32 2.967,33 5.933,34 12.485,36 0.691,37 51.703,38 8.296,39 9.383,40 11.429,41 13.589,42 15.053,43 9.459,44 18.755,45 16.991,46 10.745,47 21.383,48 18.943,49 11.915,50 23.911,51 13.164,52 26.51,53 14.378,54 29.077,55 15.62,56 16.852,57 18.095,58 6.071,59 11.53,60 16.327,61 20.906,62 22.876,63 24.853,64 4.666}
{0 CHEMBL215397,2 0.045,3 1.646,6 0.098,7 6.635,8 5.351,9 7.351,10 5.351,11 0.795,12 0.584,13 4.54,14 3.779,15 1.538,16 5.94,17 13.35,18 14.476,19 17.565,20 19.129,21 0.438,22 2.914,23 8.028,25 1.655,26 1.655,27 0.659,28 0.659,29 7.714,30 1.484,31 10.948,32 3.106,33 5.533,34 11.681,36 0.254,37 67.751,38 7.865,39 8.996,40 10.9,41 13.114,42 14.645,43 9.059,44 18.306,45 16.595,46 10.331,47 20.939,48 18.563,49 11.486,50 23.51,51 12.728,52 26.127,53 13.935,54 28.724,55 15.174,56 16.404,57 17.647,58 6.027,59 10.793,60 15.82,61 20.548,62 22.543,63 24.548,64 4.602}
{0 CHEMBL215732,2 0.008,3 1.663,5 1,6 -0.051,7 6.804,8 5.351,9 7.351,10 5.351,11 1.467,12 1.391,13 10.011,14 4.109,15 1.438,16 6.009,17 13.525,18 14.425,19 17.513,20 19.083,21 0.797,22 5.551,23 8.238,25 0.658,26 0.553,27 0.887,28 0.905,29 6.999,30 1.798,31 25.797,32 3.573,33 5.639,34 11.944,36 0.731,37 137.338,38 8.015,39 9.253,40 11.047,41 13.188,42 14.782,43 9.187,44 18.336,45 16.703,46 10.462,47 20.961,48 18.649,49 11.574,50 23.522,51 12.807,52 26.135,53 13.991,54 28.729,55 15.221,56 16.439,57 17.675,58 6.486,59 11.075,60 15.878,61 20.614,62 22.595,63 24.589,64 4.796}
{0 CHEMBL215733,2 0.08,3 1.585,4 1,5 1,6 0.004,7 6.538,8 5.262,9 7.262,10 5.262,11 0.743,12 0.675,13 6.393,14 3.114,15 1.531,16 6.21,17 13.175,18 14.201,19 17.229,20 18.758,21 0.361,22 2.527,23 7.931,25 0.138,26 0.138,27 0.972,28 0.972,29 4.935,30 1.504,31 14.639,32 2.643,33 5.018,34 11.688,36 0.492,37 35.87,38 7.687,39 8.887,40 10.698,41 12.787,42 14.39,43 8.916,44 17.79,45 16.29,46 10.165,47 20.335,48 18.209,49 11.279,50 22.802,51 12.489,52 25.326,53 13.655,54 27.828,55 14.857,56 16.046,57 17.25,58 5.466,59 10.799,60 15.42,61 20.142,62 22.086,63 24.039,64 4.745}
{0 CHEMBL222234,1 1,2 -0.057,3 1.514,4 2,5 2,6 -0.104,7 5.525,8 3.684,9 5.684,10 3.684,11 0.31,12 0.257,13 2.329,14 2.962,15 1.47,16 5.48,17 12.154,18 12.323,19 14.969,20 16.398,21 0.253,22 1.659,23 7.002,27 1,28 1,29 4.926,30 1.06,31 7.962,32 2.185,33 4.171,34 10.921,35 1,36 0.821,37 18.43,38 6.447,39 8.156,40 9.49,41 10.977,42 13.197,43 7.657,44 15.326,45 14.923,46 8.893,47 17.641,48 16.662,49 9.735,50 19.635,51 10.861,52 21.863,53 11.796,54 23.936,55 12.871,56 13.854,57 14.907,58 4.971,59 10.082,60 13.495,61 18.411,62 20.167,63 21.93,64 7.301}
{0 CHEMBL222628,1 1,2 -0.037,3 1.515,4 2,5 3,6 -0.035,7 5.525,8 3.684,9 5.684,10 3.684,11 0.322,12 0.259,13 1.852,14 2.988,15 1.455,16 5.48,17 12.154,18 12.323,19 14.969,20 16.398,21 0.276,22 1.45,23 7.002,27 1,28 1,29 4.812,30 1.057,31 3.374,32 2.185,33 4.171,34 10.921,35 1,36 0.773,37 19.288,38 6.447,39 8.156,40 9.49,41 10.977,42 13.197,43 7.657,44 15.326,45 14.923,46 8.893,47 17.641,48 16.662,49 9.735,50 19.635,51 10.861,52 21.863,53 11.796,54 23.936,55 12.871,56 13.854,57 14.907,58 4.994,59 10.082,60 13.495,61 18.411,62 20.167,63 21.93,64 6.569}
{0 CHEMBL222735,1 1,2 -0.046,3 1.53,4 2,5 2,6 -0.122,7 5.707,8 3.686,9 5.686,10 3.686,11 0.527,12 0.471,13 3.994,14 2.991,15 1.451,16 5.504,17 12.325,18 12.481,19 15.151,20 16.625,21 0.345,22 2.414,23 7.197,25 0.17,26 0.17,27 0.965,28 0.965,29 4.85,30 1.298,31 11.245,32 2.456,33 4.753,34 11.138,35 1,36 0.754,37 27.34,38 6.676,39 8.357,40 9.7,41 11.171,42 13.395,43 7.832,44 15.517,45 15.116,46 9.084,47 17.843,48 16.849,49 9.912,50 19.836,51 11.051,52 22.075,53 11.98,54 24.157,55 13.065,56 14.048,57 15.109,58 5.332,59 10.294,60 13.698,61 18.591,62 20.342,63 22.099,64 6.469}
{0 CHEMBL222769,1 1,2 -0.022,3 1.544,4 2,5 2,6 -0.073,7 6.089,8 3.688,9 5.688,10 3.688,11 0.573,12 0.52,13 4.229,14 3.001,15 1.502,16 5.942,17 12.695,18 13.019,19 15.745,20 17.2,21 0.349,22 2.237,23 7.554,25 0.258,26 0.258,27 0.948,28 0.948,29 5.023,30 1.457,31 8.845,32 2.75,33 5.042,34 11.568,35 1,36 0.724,37 33.777,38 7.066,39 8.695,40 10.109,41 11.672,42 13.801,43 8.252,44 16.122,45 15.546,46 9.495,47 18.475,48 17.305,49 10.374,50 20.547,51 11.517,52 22.823,53 12.489,54 24.974,55 13.588,56 14.609,57 15.691,58 5.45,59 10.703,60 14.213,61 19.074,62 20.85,63 22.634,64 7.201}
{0 CHEMBL222840,1 1,2 -0.063,3 1.515,4 2,5 2,6 -0.154,7 5.525,8 3.684,9 5.684,10 3.684,11 0.304,12 0.252,13 1.997,14 2.988,15 1.467,16 5.48,17 12.154,18 12.323,19 14.969,20 16.398,21 0.261,22 1.669,23 7.002,27 1,28 1,29 5.02,30 1.064,31 5.052,32 2.185,33 4.171,34 10.921,35 1,36 0.801,37 19.317,38 6.447,39 8.156,40 9.49,41 10.977,42 13.197,43 7.657,44 15.326,45 14.923,46 8.893,47 17.641,48 16.662,49 9.735,50 19.635,51 10.861,52 21.863,53 11.796,54 23.936,55 12.871,56 13.854,57 14.907,58 5.022,59 10.082,60 13.495,61 18.411,62 20.167,63 21.93,64 7.222}
{0 CHEMBL222893,1 1,2 0.01,3 1.55,4 2,5 2,6 0.008,7 5.969,8 3.691,9 5.691,10 3.691,11 0.533,12 0.403,13 3.458,14 2.999,15 1.499,16 5.847,17 12.679,18 13.54,19 16.477,20 17.992,21 0.296,22 1.945,23 7.461,27 1,28 1,29 4.854,30 1.153,31 7.981,32 2.451,33 4.759,34 11.519,35 1,36 0.663,37 25.232,38 6.969,39 8.582,40 10.054,41 11.653,42 13.723,43 8.185,44 16.185,45 15.483,46 9.448,47 18.566,48 17.257,49 10.361,50 20.689,51 11.524,52 22.998,53 12.531,54 25.198,55 13.652,56 14.706,57 15.811,58 5.215,59 10.644,60 14.227,61 19.041,62 20.833,63 22.632,64 7.022}
{0 CHEMBL225515,1 1,2 0.015,3 1.55,4 2,5 2,6 -0.024,7 5.969,8 3.691,9 5.691,10 3.691,11 0.597,12 0.451,13 3.369,14 2.999,15 1.5,16 5.847,17 12.679,18 13.54,19 16.477,20 17.992,21 0.372,22 2.112,23 7.461,27 1,28 1,29 4.948,30 1.212,31 8.675,32 2.451,33 4.759,34 11.519,35 1,36 0.736,37 24.752,38 6.969,39 8.582,40 10.054,41 11.653,42 13.723,43 8.185,44 16.185,45 15.483,46 9.448,47 18.566,48 17.257,49 10.361,50 20.689,51 11.524,52 22.998,53 12.531,54 25.198,55 13.652,56 14.706,57 15.811,58 5.319,59 10.644,60 14.227,61 19.041,62 20.833,63 22.632,64 7.187}
{0 CHEMBL227075,2 0.046,3 1.679,6 0.028,7 6.648,8 3.944,9 5.944,10 3.944,11 1,12 0.941,13 7.863,14 3.258,15 1.559,16 6.675,17 13.205,18 14.111,19 17.133,20 18.669,21 0.398,22 3.369,23 8.086,25 0.329,26 0.329,27 0.936,28 0.936,29 4.894,30 1.46,31 18.934,32 2.835,33 5.932,34 12.335,36 0.579,37 38.526,38 7.861,39 9.165,40 11.054,41 13.007,42 14.673,43 9.044,44 18.017,45 16.554,46 10.319,47 20.602,48 18.449,49 11.424,50 23.015,51 12.647,52 25.552,53 13.814,54 28.025,55 15.026,56 16.22,57 17.432,58 5.817,59 11.388,60 15.74,61 20.353,62 22.267,63 24.187,64 4.951}
{0 CHEMBL277716,2 0.003,3 1.531,6 -0.039,7 6.608,8 3.844,9 5.844,10 3.844,11 2.337,12 2.332,13 15.794,14 3.726,15 1.447,16 6.103,17 12.942,18 12.317,19 14.75,20 16.204,21 1.192,22 8.015,23 8.08,25 0.677,26 0.608,27 0.895,28 0.905,29 7.429,30 1.946,31 55.436,32 3.575,33 5.375,34 12.009,36 0.725,37 181.99,38 7.576,39 9.237,40 10.62,41 12.176,42 14.333,43 8.755,44 16.626,45 16.08,46 9.995,47 18.978,48 17.842,49 10.858,50 21.055,51 11.994,52 23.333,53 12.955,54 25.49,55 14.046,56 15.057,57 16.131,58 6.56,59 11.166,60 14.715,61 19.615,62 21.397,63 23.187,64 5.646}
{0 CHEMBL348660,2 0.063,3 1.647,6 0.064,7 6.347,8 3.983,9 5.983,10 3.983,11 0.917,12 0.794,13 5.81,14 3.499,15 1.524,16 5.963,17 12.838,18 13.139,19 15.947,20 17.419,21 0.455,22 2.737,23 7.799,25 0.364,26 0.364,27 0.928,28 0.928,29 7.352,30 1.497,31 15.276,32 2.821,33 5.511,34 11.921,36 0.628,37 44.278,38 7.452,39 8.892,40 10.593,41 12.441,42 14.261,43 8.682,44 17.338,45 16.102,46 9.952,47 19.872,48 17.958,49 11.006,50 22.239,51 12.215,52 24.726,53 13.346,54 27.153,55 14.537,56 15.703,57 16.892,58 5.663,59 11.008,60 15.124,61 19.827,62 21.707,63 23.597,64 4.9}
{0 CHEMBL358279,2 0.07,3 1.64,6 0.076,7 6.567,8 3.983,9 5.983,10 3.983,11 1.143,12 1.01,13 7.685,14 3.499,15 1.535,16 6.185,17 13.13,18 13.8,19 16.697,20 18.19,21 0.512,22 3.218,23 8.022,25 0.256,26 0.154,27 0.951,28 0.971,29 7.352,30 1.522,31 18.847,32 2.919,33 5.637,34 12.159,36 0.612,37 49.109,38 7.676,39 9.118,40 10.807,41 12.627,42 14.472,43 8.891,44 17.476,45 16.304,46 10.159,47 19.991,48 18.15,49 11.197,50 22.334,51 12.398,52 24.805,53 13.514,54 27.216,55 14.695,56 15.846,57 17.024,58 5.818,59 11.246,60 15.293,61 20.009,62 21.879,63 23.758,64 6.92}
{0 CHEMBL363535,2 0.041,3 1.662,6 0.023,7 6.648,8 3.908,9 5.908,10 3.908,11 0.891,12 0.861,13 7.187,14 3.188,15 1.561,16 6.675,17 13.242,18 14.248,19 17.272,20 18.806,21 0.35,22 2.944,23 8.086,25 0.288,26 0.288,27 0.943,28 0.943,29 5.055,30 1.461,31 16.393,32 2.791,33 5.932,34 12.335,36 0.58,37 37.005,38 7.861,39 9.165,40 11.054,41 13.007,42 14.673,43 9.044,44 18.017,45 16.554,46 10.319,47 20.602,48 18.449,49 11.424,50 23.015,51 12.647,52 25.552,53 13.814,54 28.025,55 15.026,56 16.22,57 17.432,58 5.797,59 11.388,60 15.74,61 20.353,62 22.267,63 24.187,64 4.863}
{0 CHEMBL365134,2 0.024,3 1.629,6 0.02,7 6.509,8 3.996,9 5.996,10 3.996,11 0.798,12 0.635,13 6.981,14 3.148,15 1.547,16 6.245,17 13.073,18 13.87,19 16.808,20 18.308,21 0.336,22 2.24,23 7.971,25 0.063,26 0.063,27 0.988,28 0.988,29 4.87,30 1.447,31 26.152,32 2.941,33 5.671,34 12.137,36 0.537,37 35.334,38 7.642,39 9.046,40 10.812,41 12.7,42 14.449,43 8.879,44 17.648,45 16.301,46 10.157,47 20.198,48 18.17,49 11.231,50 22.594,51 12.446,52 25.101,53 13.588,54 27.555,55 14.786,56 15.959,57 17.153,58 5.499,59 11.216,60 15.399,61 20.052,62 21.944,63 23.846,64 6.009}
{0 CHEMBL365469,2 0.027,3 1.633,6 0.029,7 6.509,8 3.999,9 5.999,10 3.999,11 0.807,12 0.678,13 5.962,14 3.139,15 1.545,16 6.249,17 13.074,18 13.875,19 16.816,20 18.317,21 0.352,22 2.328,23 7.971,25 0.063,26 0.063,27 0.988,28 0.988,29 4.914,30 1.453,31 14.116,32 2.89,33 5.55,34 12.134,36 0.531,37 37.083,38 7.642,39 9.046,40 10.811,41 12.696,42 14.449,43 8.879,44 17.636,45 16.301,46 10.157,47 20.183,48 18.169,49 11.23,50 22.573,51 12.444,52 25.075,53 13.586,54 27.524,55 14.783,56 15.955,57 17.148,58 5.622,59 11.212,60 15.393,61 20.051,62 21.943,63 23.844,64 4.951}
{0 CHEMBL370923,2 0.006,3 1.638,6 -0.003,7 6.581,8 3.983,9 5.983,10 3.983,11 1.29,12 1.116,13 11.209,14 3.696,15 1.542,16 6.407,17 13.008,18 13.325,19 16.118,20 17.555,21 0.586,22 3.882,23 8.032,25 0.558,26 0.558,27 0.897,28 0.897,29 7.352,30 1.617,31 28.919,32 2.92,33 5.561,34 12.149,36 0.575,37 53.73,38 7.67,39 9.126,40 10.816,41 12.638,42 14.479,43 8.906,44 17.501,45 16.313,46 10.172,47 20.023,48 18.164,49 11.215,50 22.365,51 12.415,52 24.837,53 13.534,54 27.244,55 14.715,56 15.867,57 17.045,58 5.872,59 11.241,60 15.315,61 20.027,62 21.902,63 23.785,64 4.757}
{0 CHEMBL375130,2 0.034,3 1.553,6 0.117,7 6.347,8 3.844,9 5.844,10 3.844,11 1.057,12 0.971,13 7.194,14 3.066,15 1.512,16 6.183,17 12.952,18 13.691,19 16.573,20 18.035,21 0.589,22 3.358,23 7.769,25 0.375,26 0.375,27 0.927,28 0.927,29 4.906,30 1.651,31 20.401,32 2.558,33 5.304,34 11.784,36 0.41,37 35.245,38 7.409,39 8.869,40 10.515,41 12.346,42 14.188,43 8.638,44 17.144,45 16.014,46 9.874,47 19.614,48 17.855,49 10.901,50 21.93,51 12.073,52 24.353,53 13.167,54 26.725,55 14.319,56 15.444,57 16.591,58 5.687,59 10.898,60 14.967,61 19.709,62 21.574,63 23.446,64 4.699}
{0 CHEMBL377150,2 0.018,3 1.589,4 1,5 1,6 0.036,7 6.878,8 4.471,9 6.471,10 4.471,11 1.832,12 1.59,13 10.225,14 4.46,15 1.528,16 6.304,17 13.273,18 13.63,19 16.421,20 17.874,21 0.959,22 4.181,23 8.286,25 0.448,26 0.406,27 0.92,28 0.927,29 7.999,30 1.696,31 24.092,32 3.03,33 5.525,34 12.158,36 0.586,37 74.673,38 7.966,39 9.307,40 10.977,41 12.901,42 14.676,43 9.186,44 17.777,45 16.529,46 10.434,47 20.29,48 18.402,49 11.49,50 22.688,51 12.688,52 25.179,53 13.818,54 27.634,55 15.006,56 16.173,57 17.364,58 6.117,59 11.268,60 15.517,61 20.292,62 22.197,63 24.114,64 5}
{0 CHEMBL377253,2 0.07,3 1.641,6 0.03,7 6.686,8 5.366,9 7.366,10 5.366,11 0.908,12 0.916,13 8.234,14 3.639,15 1.537,16 6.481,17 13.321,18 14.473,19 17.618,20 19.207,21 0.404,22 3.624,23 8.1,25 0.447,26 0.265,27 0.911,28 0.947,29 7.428,30 1.516,31 23.531,32 3.059,33 5.066,34 11.883,36 0.551,37 67.856,38 7.982,39 9.055,40 11.109,41 13.355,42 14.784,43 9.17,44 18.641,45 16.756,46 10.465,47 21.327,48 18.745,49 11.656,50 23.93,51 12.922,52 26.593,53 14.16,54 29.229,55 15.424,56 16.682,57 17.949,58 6.01,59 10.971,60 16.129,61 20.747,62 22.758,63 24.777,64 4.796}
{0 CHEMBL378342,2 -0.019,3 1.559,5 1,6 -0.094,7 6.948,8 5.351,9 7.351,10 5.351,11 1.699,12 1.741,13 13.178,14 3.819,15 1.448,16 6.384,17 13.576,18 14.467,19 17.542,20 19.106,21 0.975,22 7.502,23 8.38,25 1.288,26 1.117,27 0.792,28 0.82,29 7.432,30 1.821,31 36.484,32 3.42,33 5.64,34 12.126,36 0.744,37 193.693,38 8.148,39 9.409,40 11.203,41 13.309,42 14.929,43 9.326,44 18.425,45 16.843,46 10.597,47 21.036,48 18.78,49 11.702,50 23.577,51 12.929,52 26.178,53 14.104,54 28.761,55 15.325,56 16.533,57 17.76,58 6.76,59 11.253,60 15.997,61 20.736,62 22.707,63 24.69,64 4.495}
{0 CHEMBL378674,2 0.04,3 1.673,4 1,5 1,6 0.066,7 6.635,8 4.46,9 6.46,10 4.46,11 1.489,12 1.477,13 12.228,14 4.368,15 1.49,16 6.203,17 13.199,18 13.8,19 16.672,20 18.155,21 0.703,22 4.349,23 8.095,25 0.319,26 0.319,27 0.944,28 0.944,29 4.937,30 1.689,31 32.76,32 3.2,33 5.501,34 12.197,36 0.684,37 54.312,38 7.719,39 9.205,40 10.842,41 12.638,42 14.491,43 8.916,44 17.46,45 16.308,46 10.175,47 19.966,48 18.143,49 11.177,50 22.296,51 12.363,52 24.759,53 13.451,54 27.158,55 14.616,56 15.746,57 16.909,58 5.785,59 11.299,60 15.292,61 19.993,62 21.855,63 23.728,64 4.921}
{0 CHEMBL378700,2 0.082,3 1.683,6 0.059,7 6.723,8 5.379,9 7.379,10 5.379,11 1.121,12 1.074,13 8.409,14 4.326,15 1.506,16 6.325,17 13.367,18 14.504,19 17.639,20 19.222,21 0.574,22 3.834,23 8.161,25 0.399,26 0.399,27 0.923,28 0.923,29 6.999,30 1.591,31 21.756,32 3.164,33 5.112,34 12.017,36 0.532,37 55.153,38 8.001,39 9.12,40 11.129,41 13.364,42 14.793,43 9.2,44 18.651,45 16.756,46 10.498,47 21.335,48 18.739,49 11.676,50 23.947,51 12.941,52 26.612,53 14.173,54 29.254,55 15.435,56 16.69,57 17.956,58 6.062,59 11.103,60 16.131,61 20.737,62 22.747,63 24.766,64 4.824}
{0 CHEMBL379642,2 0.029,3 1.566,6 0.037,7 6.567,8 4.743,9 6.743,10 4.743,11 0.954,12 0.868,13 4.766,14 4.459,15 1.52,16 6.106,17 13.03,18 13.165,19 15.888,20 17.329,21 0.706,22 2.795,23 7.971,25 0.387,26 0.387,27 0.923,28 0.923,29 7.999,30 1.602,31 10.065,32 3.04,33 5.354,34 11.69,36 0.637,37 50.75,38 7.644,39 8.959,40 10.598,41 12.551,42 14.337,43 8.879,44 17.379,45 16.193,46 10.123,47 19.853,48 18.07,49 11.179,50 22.231,51 12.37,52 24.685,53 13.494,54 27.11,55 14.672,56 15.829,57 17.008,58 5.658,59 10.824,60 15.118,61 19.962,62 21.867,63 23.782,64 5.523}
{0 CHEMBL379727,2 0.036,3 1.655,6 0.023,7 6.236,8 3.979,9 5.979,10 3.979,11 0.817,12 0.712,13 5.278,14 3.499,15 1.5,16 5.957,17 12.671,18 13.035,19 15.863,20 17.318,21 0.461,22 2.832,23 7.659,25 0.399,26 0.399,27 0.92,28 0.92,29 7.352,30 1.497,31 16.592,32 2.769,33 5.51,34 11.754,36 0.637,37 44.572,38 7.353,39 8.747,40 10.495,41 12.382,42 14.171,43 8.592,44 17.3,45 16.025,46 9.852,47 19.836,48 17.893,49 10.936,50 22.21,51 12.143,52 24.696,53 13.29,54 27.126,55 14.483,56 15.657,57 16.848,58 5.587,59 10.837,60 15.068,61 19.771,62 21.66,63 23.556,64 4.721}
{0 CHEMBL380403,2 0.038,3 1.63,6 0.025,7 6.995,8 5.359,9 7.359,10 5.359,11 1.195,12 0.981,13 5.76,14 4.461,15 1.573,16 7.118,17 13.486,18 14.528,19 17.639,20 19.214,21 0.64,22 3.152,23 8.361,25 0.558,26 0.558,27 0.886,28 0.886,29 7.999,30 1.533,31 11.388,32 3.124,33 5.327,34 11.989,36 0.475,37 91.282,38 8.244,39 9.258,40 11.273,41 13.519,42 14.993,43 9.455,44 18.716,45 16.958,46 10.726,47 21.354,48 18.938,49 11.913,50 23.919,51 13.16,52 26.539,53 14.383,54 29.137,55 15.628,56 16.866,57 18.113,58 6.182,59 11.073,60 16.234,61 20.928,62 22.927,63 24.931,64 4.921}
{0 CHEMBL380470,2 0.011,3 1.578,6 -0.001,7 6.217,8 4.461,9 6.461,10 4.461,11 1.207,12 1.23,13 9.48,14 3.581,15 1.448,16 6.167,17 12.815,18 13.119,19 15.864,20 17.34,21 0.662,22 4.384,23 7.717,24 1,25 0.585,26 0.543,27 0.895,28 0.902,29 4.941,30 1.644,31 25.464,32 2.92,33 5.392,34 11.729,36 0.885,37 51.979,38 7.248,39 8.867,40 10.299,41 11.86,42 13.966,43 8.385,44 16.324,45 15.711,46 9.647,47 18.678,48 17.469,49 10.513,50 20.757,51 11.665,52 23.032,53 12.631,54 25.186,55 13.734,56 14.75,57 15.832,58 5.794,59 10.871,60 14.409,61 19.237,62 21.014,63 22.798,64 4.347}
{0 CHEMBL383725,2 0.015,3 1.618,6 -0.004,7 6.463,8 3.983,9 5.983,10 3.983,11 0.984,12 0.861,13 8.043,14 3.058,15 1.539,16 6.185,17 13.04,18 13.74,19 16.644,20 18.142,21 0.376,22 2.444,23 7.933,25 0.229,26 0.114,27 0.955,28 0.978,29 4.901,30 1.521,31 17.172,32 2.873,33 5.554,34 12.081,36 0.53,37 36.764,38 7.576,39 9.026,40 10.723,41 12.546,42 14.372,43 8.796,44 17.42,45 16.205,46 10.074,47 19.945,48 18.055,49 11.115,50 22.297,51 12.323,52 24.774,53 13.443,54 27.19,55 14.63,56 15.786,57 16.968,58 5.59,59 11.169,60 15.225,61 19.918,62 21.792,63 23.677,64 5.959}
{0 CHEMBL384739,2 0.022,3 1.678,4 1,5 1,6 0.026,7 6.635,8 5.362,9 7.362,10 5.362,11 0.71,12 0.528,13 4.281,14 3.785,15 1.533,16 6.082,17 13.353,18 14.59,19 17.717,20 19.299,21 0.406,22 2.617,23 8.027,25 0.444,26 0.444,27 0.907,28 0.907,29 7.467,30 1.374,31 10.506,32 2.91,33 5.089,34 11.733,35 1,36 0.329,37 63.027,38 7.877,39 8.989,40 10.949,41 13.179,42 14.663,43 9.077,44 18.425,45 16.622,46 10.357,47 21.087,48 18.602,49 11.531,50 23.676,51 12.785,52 26.316,53 14.009,54 28.932,55 15.261,56 16.506,57 17.762,58 6.136,59 10.83,60 15.922,61 20.597,62 22.603,63 24.618,64 4.824}
{0 CHEMBL426082,2 0.034,3 1.618,6 0.038,7 6.399,8 3.982,9 5.982,10 3.982,11 0.844,12 0.698,13 5.979,14 3.095,15 1.535,16 6.245,17 12.982,18 13.761,19 16.693,20 18.195,21 0.365,22 2.632,23 7.88,25 0.063,26 0.063,27 0.988,28 0.988,29 4.87,30 1.454,31 14.167,32 2.767,33 5.54,34 12.033,36 0.536,37 31.675,38 7.519,39 8.955,40 10.684,41 12.536,42 14.329,43 8.766,44 17.423,45 16.171,46 10.049,47 19.945,48 18.029,49 11.105,50 22.3,51 12.316,52 24.772,53 13.444,54 27.186,55 14.631,56 15.79,57 16.971,58 5.468,59 11.12,60 15.214,61 19.899,62 21.78,63 23.668,64 4.882}
{0 CHEMBL426898,1 1,2 -0.025,3 1.55,4 2,5 2,6 -0.09,7 5.969,8 3.691,9 5.691,10 3.691,11 0.505,12 0.386,13 3.064,14 2.999,15 1.502,16 5.847,17 12.679,18 13.54,19 16.477,20 17.992,21 0.317,22 2.098,23 7.461,27 1,28 1,29 5.033,30 1.157,31 7.149,32 2.451,33 4.759,34 11.519,35 1,36 0.745,37 25.459,38 6.969,39 8.582,40 10.054,41 11.653,42 13.723,43 8.185,44 16.185,45 15.483,46 9.448,47 18.566,48 17.257,49 10.361,50 20.689,51 11.524,52 22.998,53 12.531,54 25.198,55 13.652,56 14.706,57 15.811,58 5.265,59 10.644,60 14.227,61 19.041,62 20.833,63 22.632,64 6.77}
{0 CHEMBL427404,2 0.007,3 1.587,6 0.067,7 6.929,8 4.462,9 6.462,10 4.462,11 1.263,12 1.138,13 6.639,14 3.839,15 1.567,16 6.706,17 13.321,18 13.906,19 16.761,20 18.207,21 0.818,22 3.247,23 8.288,25 0.44,26 0.44,27 0.916,28 0.916,29 7.999,30 1.675,31 15.527,32 3.046,33 6.018,34 12.134,36 0.56,37 79.533,38 8.036,39 9.29,40 11.058,41 13.035,42 14.774,43 9.276,44 17.895,45 16.649,46 10.505,47 20.378,48 18.536,49 11.603,50 22.736,51 12.791,52 25.181,53 13.935,54 27.583,55 15.112,56 16.276,57 17.454,58 6.189,59 11.229,60 15.644,61 20.434,62 22.34,63 24.252,64 5.301}
{0 CHEMBL45830,2 0.052,3 1.674,6 0.056,7 6.836,8 3.911,9 5.911,10 3.911,11 1.505,12 1.363,13 11.719,14 3.656,15 1.551,16 6.892,17 13.13,18 13.526,19 16.414,20 17.888,21 0.538,22 4.685,23 8.228,25 0.954,26 0.954,27 0.824,28 0.824,29 4.718,30 1.617,31 30.372,32 2.782,33 5.495,34 12.191,36 0.482,37 45.91,38 8.078,39 9.211,40 11.173,41 13.274,42 14.836,43 9.267,44 18.359,45 16.757,46 10.536,47 20.955,48 18.692,49 11.688,50 23.437,51 12.922,52 26.001,53 14.119,54 28.526,55 15.346,56 16.563,57 17.791,58 5.896,59 11.251,60 15.984,61 20.638,62 22.591,63 24.552,64 4.523}
