"molecule_id","FCFP4_1024b1024","FCFP4_1024b374","FCFP4_1024b658","FCFP4_1024b675","FCFP4_1024b788","FCFP4_1024b920","FCFP4_1024b286","FCFP4_1024b396","FCFP4_1024b104","FCFP4_1024b244","FCFP4_1024b249","FCFP4_1024b351","FCFP4_1024b370","FCFP4_1024b394","FCFP4_1024b540","FCFP4_1024b562","FCFP4_1024b749","FCFP4_1024b800","FCFP4_1024b873","FCFP4_1024b557","FCFP4_1024b801","FCFP4_1024b32","FCFP4_1024b218","FCFP4_1024b729","FCFP4_1024b197","FCFP4_1024b48","FCFP4_1024b695","FCFP4_1024b891","FCFP4_1024b723","FCFP4_1024b408","FCFP4_1024b653","FCFP4_1024b691","FCFP4_1024b771","FCFP4_1024b44","FCFP4_1024b872","FCFP4_1024b152","FCFP4_1024b603","FCFP4_1024b799","FCFP4_1024b943","FCFP4_1024b18","FCFP4_1024b1","FCFP4_1024b10","FCFP4_1024b100","FCFP4_1024b1000","FCFP4_1024b1001","FCFP4_1024b1002","FCFP4_1024b1003","FCFP4_1024b1004","FCFP4_1024b1005","FCFP4_1024b1006","FCFP4_1024b1007","pXC50"
{35 1,36 1,37 1,38 1,39 1,41 1,52 5.523}
{0 CHEMBL1200679,52 5.958}
{0 CHEMBL1213205,20 1,29 1,32 1,33 1,36 1,37 1,38 1,39 1,41 1,52 6.65}
{0 CHEMBL1213210,7 1,20 1,29 1,31 1,32 1,33 1,36 1,37 1,38 1,39 1,40 1,41 1,52 4.785}
{0 CHEMBL1213211,20 1,29 1,32 1,33 1,36 1,37 1,38 1,39 1,41 1,52 7.218}
{0 CHEMBL160,20 1,29 1,32 1,33 1,36 1,37 1,38 1,39 1,41 1,52 6.738}
{0 CHEMBL216652,30 1,32 1,36 1,37 1,38 1,39 1,40 1,41 1,52 5.813}
{0 CHEMBL262704,30 1,32 1,36 1,37 1,38 1,39 1,40 1,41 1,52 5.301}
{0 CHEMBL263032,1 1,2 1,3 1,4 1,5 1,6 1,7 1,8 1,9 1,10 1,11 1,12 1,13 1,14 1,15 1,16 1,17 1,18 1,19 1,20 1,21 1,22 1,25 1,26 1,27 1,28 1,30 1,31 1,34 1,35 1,40 1,41 1,52 7.854}
{0 CHEMBL263984,20 1,29 1,32 1,33 1,36 1,37 1,38 1,39 1,41 1,52 5.301}
{0 CHEMBL264568,1 1,2 1,3 1,4 1,5 1,6 1,7 1,8 1,9 1,10 1,11 1,12 1,13 1,14 1,15 1,16 1,17 1,18 1,19 1,20 1,21 1,22 1,23 1,24 1,25 1,26 1,27 1,28 1,30 1,31 1,34 1,35 1,40 1,41 1,52 8.135}
{0 CHEMBL266705,1 1,2 1,3 1,4 1,5 1,6 1,7 1,8 1,9 1,10 1,11 1,12 1,13 1,14 1,15 1,16 1,17 1,18 1,19 1,20 1,21 1,22 1,23 1,24 1,25 1,26 1,27 1,28 1,30 1,31 1,34 1,35 1,40 1,41 1,52 8.402}
{0 CHEMBL268110,1 1,2 1,3 1,4 1,5 1,6 1,7 1,8 1,9 1,10 1,11 1,12 1,13 1,14 1,15 1,16 1,17 1,18 1,19 1,20 1,21 1,22 1,23 1,24 1,25 1,26 1,27 1,28 1,30 1,31 1,34 1,35 1,40 1,41 1,52 8.38}
{0 CHEMBL269260,20 1,29 1,32 1,33 1,36 1,37 1,38 1,39 1,41 1,52 6.44}
{0 CHEMBL269732,1 1,2 1,3 1,4 1,5 1,6 1,7 1,8 1,9 1,10 1,11 1,12 1,13 1,14 1,15 1,16 1,17 1,18 1,19 1,20 1,21 1,25 1,26 1,27 1,28 1,29 1,30 1,31 1,34 1,35 1,40 1,41 1,52 7.699}
{0 CHEMBL275103,1 1,2 1,3 1,4 1,5 1,6 1,7 1,8 1,9 1,10 1,11 1,12 1,13 1,14 1,15 1,16 1,17 1,18 1,19 1,20 1,21 1,22 1,23 1,24 1,25 1,26 1,27 1,28 1,30 1,31 1,34 1,35 1,40 1,41 1,52 8.102}
{0 CHEMBL305081,1 1,2 1,3 1,4 1,5 1,6 1,7 1,8 1,9 1,10 1,11 1,12 1,13 1,14 1,15 1,16 1,17 1,18 1,19 1,20 1,21 1,22 1,23 1,24 1,25 1,26 1,27 1,28 1,30 1,31 1,34 1,35 1,40 1,41 1,52 8.06}
{0 CHEMBL306125,25 1,26 1,27 1,28 1,30 1,31 1,32 1,34 1,35 1,40 1,41 1,52 6}
{0 CHEMBL384316,20 1,29 1,32 1,33 1,36 1,37 1,38 1,39 1,41 1,52 6.236}
{0 CHEMBL387036,20 1,29 1,32 1,33 1,36 1,37 1,38 1,39 1,41 1,52 5.718}
{0 CHEMBL405486,30 1,32 1,36 1,37 1,38 1,39 1,40 1,41 1,52 6.076}
{0 CHEMBL405917,1 1,2 1,3 1,4 1,5 1,6 1,7 1,8 1,9 1,10 1,11 1,12 1,13 1,14 1,15 1,16 1,17 1,18 1,19 1,20 1,21 1,22 1,23 1,24 1,25 1,26 1,27 1,28 1,30 1,31 1,34 1,35 1,40 1,41 1,52 8.307}
{0 CHEMBL406186,1 1,2 1,3 1,4 1,5 1,6 1,7 1,8 1,9 1,10 1,11 1,12 1,13 1,14 1,15 1,16 1,17 1,18 1,19 1,20 1,21 1,22 1,25 1,26 1,27 1,28 1,30 1,31 1,34 1,35 1,40 1,41 1,52 8.143}
{0 CHEMBL407332,1 1,2 1,3 1,4 1,5 1,6 1,7 1,8 1,9 1,10 1,11 1,12 1,13 1,14 1,15 1,16 1,17 1,18 1,19 1,20 1,21 1,22 1,23 1,24 1,25 1,26 1,27 1,28 1,30 1,31 1,34 1,35 1,40 1,41 1,52 8.553}
{0 CHEMBL407550,9 1,10 1,11 1,12 1,13 1,14 1,15 1,16 1,17 1,18 1,19 1,20 1,25 1,26 1,27 1,28 1,29 1,30 1,31 1,34 1,35 1,40 1,41 1,52 6.523}
{0 CHEMBL411789,30 1,32 1,36 1,37 1,38 1,39 1,40 1,41 1,52 6.051}
{0 CHEMBL412791,1 1,2 1,3 1,4 1,5 1,6 1,7 1,8 1,9 1,10 1,11 1,12 1,13 1,14 1,15 1,16 1,17 1,18 1,19 1,20 1,21 1,22 1,23 1,24 1,25 1,26 1,27 1,28 1,30 1,31 1,34 1,35 1,40 1,41 1,52 8.233}
{0 CHEMBL412946,20 1,29 1,32 1,33 1,36 1,37 1,38 1,39 1,41 1,52 5.668}
{0 CHEMBL413883,20 1,29 1,32 1,33 1,36 1,37 1,38 1,39 1,41 1,52 6.197}
{0 CHEMBL421507,8 1,9 1,10 1,11 1,12 1,13 1,14 1,15 1,16 1,17 1,18 1,19 1,20 1,21 1,25 1,26 1,27 1,28 1,29 1,30 1,31 1,34 1,35 1,40 1,41 1,52 6.456}
{0 CHEMBL430805,21 1,25 1,26 1,27 1,28 1,30 1,31 1,32 1,34 1,35 1,40 1,41 1,52 6}
{0 CHEMBL431368,1 1,2 1,3 1,4 1,5 1,6 1,7 1,8 1,9 1,10 1,11 1,12 1,13 1,14 1,15 1,16 1,17 1,18 1,19 1,20 1,21 1,22 1,23 1,24 1,25 1,26 1,27 1,28 1,30 1,31 1,34 1,35 1,40 1,41 1,52 8.063}
{0 CHEMBL65863,1 1,2 1,3 1,4 1,5 1,6 1,7 1,8 1,9 1,10 1,11 1,12 1,13 1,14 1,15 1,16 1,17 1,18 1,19 1,20 1,21 1,22 1,23 1,24 1,25 1,26 1,27 1,28 1,30 1,31 1,34 1,35 1,40 1,41 1,52 8.14}
{0 CHEMBL66247,1 1,2 1,3 1,4 1,5 1,6 1,7 1,8 1,9 1,10 1,11 1,12 1,13 1,14 1,15 1,16 1,17 1,18 1,19 1,20 1,21 1,25 1,26 1,27 1,28 1,29 1,30 1,31 1,34 1,35 1,40 1,41 1,52 7.83}
{0 CHEMBL77154,21 1,22 1,25 1,26 1,27 1,28 1,30 1,32 1,34 1,35 1,40 1,41 1,52 6}
{0 CHEMBL83,34 1,41 1,42 1,52 4.515}
