{
  "data_set_description": {
    "collection_date": "November 2013",
    "creator": "Dr Jeremy Besnard, Dr Ivan Olier, Dr Noureddin Sadawi, Dr Larisa Soldatova, Dr Crina Grosan, Prof Ross King, Dr Richard Bickerton, Prof Andrew Hopkins and Dr Willem van Hoorn",
    "default_target_attribute": "pXC50",
    "description": "This dataset contains QSAR data (from ChEMBL version 17) showing activity values (unit is pseudo-pCI50) of several compounds on drug target ChEMBL_ID: CHEMBL5419 (TID: 100979), and it has 63 rows and 1237 features (not including molecule IDs and class feature: molecule_id and pXC50). The features represent Molecular Descriptors which were generated from SMILES strings. Missing value imputation was applied to this dataset (By choosing the Median).",
    "description_version": "1",
    "file_id": "3517424",
    "format": "ARFF",
    "id": "33938",
    "licence": "Public",
    "md5_checksum": "aa502656e6d9ef7303cb8b31a4281285",
    "minio_url": "https://data.openml.org/datasets/0003/33938/dataset_33938.pq",
    "name": "QSAR-DATASET-FOR-DRUG-TARGET-CHEMBL5419",
    "original_data_url": "https://www.ebi.ac.uk/chembl/target/inspect/CHEMBL5419",
    "parquet_url": "https://data.openml.org/datasets/0003/33938/dataset_33938.pq",
    "processing_date": "2018-10-04 03:39:22",
    "row_id_attribute": "molecule_id",
    "status": "deactivated",
    "tag": [
      "MetaQSAR",
      "study_13"
    ],
    "upload_date": "2016-07-15T14:04:18",
    "url": "https://api.openml.org/data/v1/download/3517424/QSAR-DATASET-FOR-DRUG-TARGET-CHEMBL5419.arff",
    "version": "11",
    "visibility": "public"
  }
}