"molecule_id","nP","N.","nO","RBF","RBN","C.","pXC50"
{2 6.1,3 1,4 0.038,5 2,6 44.9,7 7.215}
{0 CHEMBL1650508,2 6.1,3 1,4 0.038,5 2,6 44.9,7 8.222}
{0 CHEMBL1650510,2 6.1,3 1,4 0.038,5 2,6 44.9,7 8.509}
{0 CHEMBL1650511,2 5.8,3 1,4 0.036,5 2,6 44.2,7 9.097}
{0 CHEMBL1650512,2 6.5,3 1,4 0.04,5 2,6 45.7,7 8.538}
{0 CHEMBL1650513,2 5.4,3 2,4 0.05,5 3,6 42.9,7 8.102}
{0 CHEMBL1650514,2 6,3 2,4 0.056,5 3,6 44,7 8.959}
{0 CHEMBL1650515,2 6.1,3 3,4 0.037,5 2,6 44.9,7 7.041}
{0 CHEMBL1650516,2 6.5,3 1,4 0.04,5 2,6 45.7,7 8.62}
{0 CHEMBL1650517,2 6,3 2,4 0.056,5 3,6 44,7 8.602}
{0 CHEMBL1650518,2 6.5,3 1,4 0.04,5 2,6 45.7,7 8.638}
{0 CHEMBL1650519,2 6.1,3 1,4 0.038,5 2,6 44.9,7 9.222}
{0 CHEMBL1650520,2 6,3 2,4 0.056,5 3,6 44,7 9.097}
{0 CHEMBL1650521,2 6.1,3 1,4 0.038,5 2,6 44.9,7 8.658}
{0 CHEMBL1650522,2 6.1,3 1,4 0.038,5 2,6 44.9,7 8.481}
{0 CHEMBL1650523,2 8,3 1,4 0.037,5 2,6 46,7 9.155}
{0 CHEMBL1650524,2 6.1,3 1,4 0.038,5 2,6 44.9,7 8.569}
{0 CHEMBL1650525,2 6.1,3 1,4 0.038,5 2,6 44.9,7 8.77}
{0 CHEMBL1650526,2 5.7,3 2,4 0.053,5 3,6 43.4,7 8.921}
{0 CHEMBL1650527,2 6.1,3 1,4 0.038,5 2,6 44.9,7 9}
{0 CHEMBL1650528,2 5.1,3 2,4 0.079,5 5,6 42.4,7 9.699}
{0 CHEMBL1650529,2 6.4,3 2,4 0.039,5 2,6 44.7,7 8.174}
{0 CHEMBL1650530,2 6.1,3 1,4 0.038,5 2,6 44.9,7 9.046}
{0 CHEMBL1650531,2 6,3 2,4 0.037,5 2,6 44,7 8.854}
{0 CHEMBL1650532,2 6.4,3 2,4 0.039,5 2,6 44.7,7 8.398}
{0 CHEMBL1955867,2 4.4,4 0.063,5 3,6 46.7,7 6.959}
{0 CHEMBL1955984,2 4.4,4 0.063,5 3,6 46.7,7 7.678}
{0 CHEMBL1955985,2 4.4,4 0.063,5 3,6 46.7,7 8.051}
{0 CHEMBL1955986,2 4.2,4 0.059,5 3,6 45.8,7 8.149}
{0 CHEMBL1955987,2 4.1,3 1,4 0.077,5 4,6 44.9,7 8.051}
{0 CHEMBL1955988,2 4.1,3 1,4 0.077,5 4,6 44.9,7 7.854}
{0 CHEMBL1955989,2 4.2,4 0.059,5 3,6 45.8,7 7.959}
{0 CHEMBL1955990,2 3.9,4 0.056,5 3,6 45.1,7 7.91}
{0 CHEMBL1955991,2 6.4,4 0.06,5 3,6 44.7,7 7.42}
{0 CHEMBL1955992,2 4.2,4 0.059,5 3,6 45.8,7 8.066}
{0 CHEMBL1955993,2 4.3,3 1,4 0.082,5 4,6 45.7,7 6.959}
{0 CHEMBL1955994,2 4.2,4 0.059,5 3,6 45.8,7 7.678}
{0 CHEMBL1955995,2 3.9,4 0.056,5 3,6 45.1,7 8.051}
{0 CHEMBL1955996,2 4.3,3 1,4 0.061,5 3,6 45.7,7 8.149}
{0 CHEMBL1955997,2 4.1,3 1,4 0.058,5 3,6 44.9,7 8.051}
{0 CHEMBL1955998,2 4.3,4 0.061,5 3,6 45.7,7 7.509}
{0 CHEMBL2016589,1 1,3 3,4 0.174,5 8,6 40,7 6.022}
{0 CHEMBL2017500,1 1,2 1.7,3 3,4 0.145,5 9,6 44.1,7 5.854}
{0 CHEMBL2017501,1 1,3 3,4 0.16,5 8,6 41.7,7 6.155}
{0 CHEMBL2017502,1 1,3 3,4 0.151,5 8,6 43.1,7 6.921}
{0 CHEMBL2017503,1 1,3 3,4 0.151,5 8,6 43.1,7 6.301}
{0 CHEMBL2017504,1 1,3 3,4 0.16,5 8,6 41.7,7 6.602}
{0 CHEMBL2017505,1 1,3 3,4 0.151,5 8,6 41.2,7 6.735}
{0 CHEMBL2017506,1 1,3 4,4 0.16,5 8,6 41.7,7 6.301}
{0 CHEMBL2017507,1 1,3 3,4 0.151,5 8,6 41.2,7 6.444}
{0 CHEMBL2017508,1 1,3 3,4 0.151,5 8,6 41.2,7 7.509}
{0 CHEMBL2017509,1 1,3 3,4 0.151,5 8,6 41.2,7 6.943}
{0 CHEMBL2017510,1 1,3 3,4 0.151,5 8,6 41.2,7 7.658}
{0 CHEMBL2017511,1 1,3 3,4 0.151,5 8,6 41.2,7 6.839}
{0 CHEMBL2017512,1 1,3 3,4 0.143,5 8,6 40.7,7 7.187}
{0 CHEMBL2017513,1 1,3 3,4 0.143,5 8,6 40.7,7 6.86}
{0 CHEMBL2017514,1 1,3 4,4 0.158,5 9,6 40,7 6.917}
{0 CHEMBL2017655,1 1,3 3,4 0.143,5 8,6 40.7,7 6.438}
{0 CHEMBL2017656,1 1,3 4,4 0.158,5 9,6 40,7 6.62}
{0 CHEMBL2017657,1 1,3 3,4 0.151,5 8,6 41.2,7 7.237}
{0 CHEMBL2017658,1 1,3 3,4 0.151,5 8,6 41.2,7 7.194}
{0 CHEMBL2017659,1 1,3 3,4 0.151,5 8,6 41.2,7 6.523}
{0 CHEMBL2017660,1 1,3 3,4 0.143,5 8,6 40.7,7 6.28}
{0 CHEMBL2017661,1 1,3 3,4 0.143,5 8,6 40.7,7 6.921}
{0 CHEMBL2017662,1 1,3 3,4 0.16,5 8,6 41.7,7 6.409}
{0 CHEMBL2017663,1 1,3 3,4 0.155,5 9,6 41.8,7 6.936}
{0 CHEMBL2017664,1 1,3 3,4 0.148,5 9,6 41.4,7 6.836}
{0 CHEMBL2017665,1 1,3 3,4 0.141,5 9,6 41,7 7.585}
{0 CHEMBL2017666,1 1,3 3,4 0.134,5 9,6 40.6,7 6.456}
{0 CHEMBL2017667,1 1,3 3,4 0.154,5 10,6 39.7,7 6.796}
{0 CHEMBL2017668,1 1,3 3,4 0.153,5 9,6 40.4,7 7.921}
{0 CHEMBL2017670,1 1,3 1,4 0.14,5 8,6 41.8,7 6.783}
{0 CHEMBL2017671,1 1,3 3,4 0.136,5 8,6 40.4,7 7.62}
{0 CHEMBL2017672,1 1,3 1,4 0.127,5 8,6 41,7 6.91}
{0 CHEMBL2017673,1 1,3 3,4 0.163,5 7,6 40.5,7 5.444}
{0 CHEMBL2346684,2 5.7,3 1,4 0.088,5 5,6 47.2,7 8.097}
{0 CHEMBL2348324,2 3.7,3 1,4 0.088,5 5,6 46.3,7 7.347}
{0 CHEMBL2348325,2 3.7,3 1,4 0.088,5 5,6 46.3,7 8.222}
{0 CHEMBL2348326,2 3.1,3 3,4 0.103,5 7,6 48.4,7 7.252}
{0 CHEMBL2348327,2 6.8,3 1,4 0.095,5 6,6 47.5,7 8}
{0 CHEMBL2348328,2 5,3 1,4 0.094,5 6,6 48.3,7 7.602}
{0 CHEMBL2348329,2 5,3 1,4 0.094,5 6,6 48.3,7 8.155}
{0 CHEMBL2348655,2 3.9,3 1,4 0.093,5 5,6 47.1,7 8.046}
{0 CHEMBL2348656,2 3.6,3 2,4 0.083,5 5,6 46.4,7 7.854}
{0 CHEMBL2348657,2 3.5,3 3,4 0.098,5 6,6 47.4,7 7.387}
{0 CHEMBL2348658,2 3.5,3 3,4 0.098,5 6,6 47.4,7 7.108}
{0 CHEMBL2348659,2 5.7,3 1,4 0.088,5 5,6 47.2,7 7.602}
{0 CHEMBL2348660,2 3.7,3 1,4 0.086,5 5,6 48.1,7 8.523}
{0 CHEMBL2348661,2 3.5,3 3,4 0.1,5 6,6 45.6,7 7.481}
{0 CHEMBL2348662,2 3.7,3 1,4 0.088,5 5,6 46.3,7 7.77}
{0 CHEMBL2348663,2 3.7,3 1,4 0.088,5 5,6 46.3,7 7.357}
{0 CHEMBL2348664,2 3.7,3 1,4 0.088,5 5,6 46.3,7 8.097}
{0 CHEMBL2348665,2 3.7,3 1,4 0.088,5 5,6 46.3,7 7.367}
{0 CHEMBL2348666,2 3.7,3 1,4 0.088,5 5,6 46.3,7 8.301}
{0 CHEMBL2348667,2 3.5,3 3,4 0.1,5 6,6 45.6,7 7.18}
{0 CHEMBL2348668,2 3.5,3 3,4 0.1,5 6,6 45.6,7 7.398}
{0 CHEMBL2348669,2 5.7,3 1,4 0.089,5 5,6 45.3,7 7.721}
{0 CHEMBL2348670,2 5.7,3 1,4 0.089,5 5,6 45.3,7 7.602}
{0 CHEMBL2348671,2 5.7,3 1,4 0.089,5 5,6 45.3,7 8.155}
{0 CHEMBL2348672,2 3.4,3 2,4 0.098,5 6,6 44.8,7 7.921}
{0 CHEMBL2348673,2 3.7,3 1,4 0.088,5 5,6 46.3,7 7.137}
{0 CHEMBL2348674,2 3.7,3 1,4 0.088,5 5,6 46.3,7 6.86}
{0 CHEMBL2348675,2 3.7,3 1,4 0.088,5 5,6 46.3,7 7.959}
{0 CHEMBL2348676,2 3.7,3 1,4 0.088,5 5,6 46.3,7 7.432}
{0 CHEMBL2348677,2 3.7,3 1,4 0.088,5 5,6 46.3,7 8.046}
{0 CHEMBL2348678,2 3.7,3 1,4 0.088,5 5,6 46.3,7 8.155}
{0 CHEMBL2348679,2 3.7,3 1,4 0.088,5 5,6 46.3,7 8.301}
{0 CHEMBL2348680,2 3.7,3 1,4 0.088,5 5,6 46.3,7 6.775}
{0 CHEMBL2348681,2 3.7,3 1,4 0.088,5 5,6 46.3,7 7.387}
{0 CHEMBL2348682,2 3.4,3 2,4 0.098,5 6,6 44.8,7 7.481}
{0 CHEMBL2348683,2 3.7,3 1,4 0.088,5 5,6 46.3,7 7.523}
{0 CHEMBL2348684,2 3.7,3 1,4 0.088,5 5,6 46.3,7 7.222}
