{
  "data_qualities": {
    "quality": [
      {
        "name": "AutoCorrelation",
        "value": "0.5731249999999998"
      },
      {
        "name": "ClassEntropy",
        "value": []
      },
      {
        "name": "Dimensionality",
        "value": "0.23529411764705882"
      },
      {
        "name": "EquivalentNumberOfAtts",
        "value": []
      },
      {
        "name": "MajorityClassPercentage",
        "value": []
      },
      {
        "name": "MajorityClassSize",
        "value": []
      },
      {
        "name": "MaxAttributeEntropy",
        "value": []
      },
      {
        "name": "MaxKurtosisOfNumericAtts",
        "value": "0.8513317016954018"
      },
      {
        "name": "MaxMeansOfNumericAtts",
        "value": "44.81764705882353"
      },
      {
        "name": "MaxMutualInformation",
        "value": []
      },
      {
        "name": "MaxNominalAttDistinctValues",
        "value": []
      },
      {
        "name": "MaxSkewnessOfNumericAtts",
        "value": "0.7086167062550109"
      },
      {
        "name": "MaxStdDevOfNumericAtts",
        "value": "3.9607820083472216"
      },
      {
        "name": "MeanAttributeEntropy",
        "value": []
      },
      {
        "name": "MeanKurtosisOfNumericAtts",
        "value": "0.18000465149971162"
      },
      {
        "name": "MeanMeansOfNumericAtts",
        "value": "16.84270588235294"
      },
      {
        "name": "MeanMutualInformation",
        "value": []
      },
      {
        "name": "MeanNoiseToSignalRatio",
        "value": []
      },
      {
        "name": "MeanNominalAttDistinctValues",
        "value": []
      },
      {
        "name": "MeanSkewnessOfNumericAtts",
        "value": "-0.13124779499075928"
      },
      {
        "name": "MeanStdDevOfNumericAtts",
        "value": "1.4975886619132042"
      },
      {
        "name": "MinAttributeEntropy",
        "value": []
      },
      {
        "name": "MinKurtosisOfNumericAtts",
        "value": "-0.6866585016191351"
      },
      {
        "name": "MinMeansOfNumericAtts",
        "value": "1.048470588235294"
      },
      {
        "name": "MinMutualInformation",
        "value": []
      },
      {
        "name": "MinNominalAttDistinctValues",
        "value": []
      },
      {
        "name": "MinSkewnessOfNumericAtts",
        "value": "-0.9208292896877599"
      },
      {
        "name": "MinStdDevOfNumericAtts",
        "value": "0.02482719689941567"
      },
      {
        "name": "MinorityClassPercentage",
        "value": []
      },
      {
        "name": "MinorityClassSize",
        "value": []
      },
      {
        "name": "NumberOfBinaryFeatures",
        "value": "0.0"
      },
      {
        "name": "NumberOfClasses",
        "value": "0.0"
      },
      {
        "name": "NumberOfFeatures",
        "value": "4.0"
      },
      {
        "name": "NumberOfInstances",
        "value": "17.0"
      },
      {
        "name": "NumberOfInstancesWithMissingValues",
        "value": "0.0"
      },
      {
        "name": "NumberOfMissingValues",
        "value": "0.0"
      },
      {
        "name": "NumberOfNumericFeatures",
        "value": "3.0"
      },
      {
        "name": "NumberOfSymbolicFeatures",
        "value": "1.0"
      },
      {
        "name": "PercentageOfBinaryFeatures",
        "value": "0.0"
      },
      {
        "name": "PercentageOfInstancesWithMissingValues",
        "value": "0.0"
      },
      {
        "name": "PercentageOfMissingValues",
        "value": "0.0"
      },
      {
        "name": "PercentageOfNumericFeatures",
        "value": "75.0"
      },
      {
        "name": "PercentageOfSymbolicFeatures",
        "value": "25.0"
      },
      {
        "name": "Quartile1AttributeEntropy",
        "value": []
      },
      {
        "name": "Quartile1KurtosisOfNumericAtts",
        "value": "-0.6866585016191351"
      },
      {
        "name": "Quartile1MeansOfNumericAtts",
        "value": "1.048470588235294"
      },
      {
        "name": "Quartile1MutualInformation",
        "value": []
      },
      {
        "name": "Quartile1SkewnessOfNumericAtts",
        "value": "-0.9208292896877599"
      },
      {
        "name": "Quartile1StdDevOfNumericAtts",
        "value": "0.02482719689941567"
      },
      {
        "name": "Quartile2AttributeEntropy",
        "value": []
      },
      {
        "name": "Quartile2KurtosisOfNumericAtts",
        "value": "0.3753407544228682"
      },
      {
        "name": "Quartile2MeansOfNumericAtts",
        "value": "4.662"
      },
      {
        "name": "Quartile2MutualInformation",
        "value": []
      },
      {
        "name": "Quartile2SkewnessOfNumericAtts",
        "value": "-0.18153080153952894"
      },
      {
        "name": "Quartile2StdDevOfNumericAtts",
        "value": "0.5071567804929755"
      },
      {
        "name": "Quartile3AttributeEntropy",
        "value": []
      },
      {
        "name": "Quartile3KurtosisOfNumericAtts",
        "value": "0.8513317016954018"
      },
      {
        "name": "Quartile3MeansOfNumericAtts",
        "value": "44.81764705882353"
      },
      {
        "name": "Quartile3MutualInformation",
        "value": []
      },
      {
        "name": "Quartile3SkewnessOfNumericAtts",
        "value": "0.7086167062550109"
      },
      {
        "name": "Quartile3StdDevOfNumericAtts",
        "value": "3.9607820083472216"
      },
      {
        "name": "StdvNominalAttDistinctValues",
        "value": []
      }
    ]
  }
}