{
  "data_set_description": {
    "collection_date": "November 2013",
    "creator": "Dr Jeremy Besnard, Dr Ivan Olier, Dr Noureddin Sadawi, Dr Larisa Soldatova, Dr Crina Grosan, Prof Ross King, Dr Richard Bickerton, Prof Andrew Hopkins and Dr Willem van Hoorn",
    "default_target_attribute": "pXC50",
    "description": "This dataset contains QSAR data (from ChEMBL version 17) showing activity values (unit is pseudo-pCI50) of several compounds on drug target ChEMBL_ID: CHEMBL1255162 (TID: 103573), and it has 11 rows and 1059 features (not including molecule IDs and class feature: molecule_id and pXC50). The features represent Molecular Descriptors which were generated from SMILES strings. Missing value imputation was applied to this dataset (By choosing the Median).",
    "description_version": "1",
    "file_id": "3515173",
    "format": "ARFF",
    "id": "33835",
    "licence": "Public",
    "md5_checksum": "d49a7ff36cfa3df0db78457b11cd7d6e",
    "minio_url": "https://data.openml.org/datasets/0003/33835/dataset_33835.pq",
    "name": "QSAR-DATASET-FOR-DRUG-TARGET-CHEMBL1255162",
    "original_data_url": "https://www.ebi.ac.uk/chembl/target/inspect/CHEMBL1255162",
    "parquet_url": "https://data.openml.org/datasets/0003/33835/dataset_33835.pq",
    "processing_date": "2018-10-04 03:55:46",
    "row_id_attribute": "molecule_id",
    "status": "deactivated",
    "tag": [
      "MetaQSAR",
      "study_13"
    ],
    "upload_date": "2016-07-15T13:48:39",
    "url": "https://api.openml.org/data/v1/download/3515173/QSAR-DATASET-FOR-DRUG-TARGET-CHEMBL1255162.arff",
    "version": "11",
    "visibility": "public"
  }
}