{
  "data_features": {
    "feature": [
      {
        "data_type": "nominal",
        "index": "0",
        "is_ignore": "false",
        "is_row_identifier": "true",
        "is_target": "false",
        "name": "molecule_id",
        "nominal_value": [
          "CHEMBL100454",
          "CHEMBL101326",
          "CHEMBL1125",
          "CHEMBL1161036",
          "CHEMBL117",
          "CHEMBL11709",
          "CHEMBL12",
          "CHEMBL12014",
          "CHEMBL12063",
          "CHEMBL1269093",
          "CHEMBL127135",
          "CHEMBL128348",
          "CHEMBL128970",
          "CHEMBL129742",
          "CHEMBL131516",
          "CHEMBL131910",
          "CHEMBL132060",
          "CHEMBL132561",
          "CHEMBL133047",
          "CHEMBL133180",
          "CHEMBL133628",
          "CHEMBL145850",
          "CHEMBL145881",
          "CHEMBL145980",
          "CHEMBL146145",
          "CHEMBL146284",
          "CHEMBL146434",
          "CHEMBL146633",
          "CHEMBL146761",
          "CHEMBL147868",
          "CHEMBL148858",
          "CHEMBL149545",
          "CHEMBL153195",
          "CHEMBL153252",
          "CHEMBL153979",
          "CHEMBL153980",
          "CHEMBL154342",
          "CHEMBL1544",
          "CHEMBL154754",
          "CHEMBL156846",
          "CHEMBL157109",
          "CHEMBL16",
          "CHEMBL160058",
          "CHEMBL16171",
          "CHEMBL1687",
          "CHEMBL171531",
          "CHEMBL171651",
          "CHEMBL1794855",
          "CHEMBL181500",
          "CHEMBL181760",
          "CHEMBL182710",
          "CHEMBL183157",
          "CHEMBL184150",
          "CHEMBL184173",
          "CHEMBL184176",
          "CHEMBL184494",
          "CHEMBL184495",
          "CHEMBL184570",
          "CHEMBL184619",
          "CHEMBL185204",
          "CHEMBL185214",
          "CHEMBL186607",
          "CHEMBL186772",
          "CHEMBL187479",
          "CHEMBL187911",
          "CHEMBL187912",
          "CHEMBL188113",
          "CHEMBL190768",
          "CHEMBL1907717",
          "CHEMBL1907853",
          "CHEMBL191088",
          "CHEMBL191978",
          "CHEMBL192198",
          "CHEMBL192554",
          "CHEMBL192555",
          "CHEMBL192615",
          "CHEMBL193141",
          "CHEMBL193203",
          "CHEMBL193230",
          "CHEMBL19732",
          "CHEMBL20042",
          "CHEMBL201232",
          "CHEMBL2092869",
          "CHEMBL209821",
          "CHEMBL2112054",
          "CHEMBL265547",
          "CHEMBL267762",
          "CHEMBL268191",
          "CHEMBL268254",
          "CHEMBL273481",
          "CHEMBL275224",
          "CHEMBL275638",
          "CHEMBL276821",
          "CHEMBL277106",
          "CHEMBL278470",
          "CHEMBL28",
          "CHEMBL281098",
          "CHEMBL283019",
          "CHEMBL284327",
          "CHEMBL285783",
          "CHEMBL287631",
          "CHEMBL28902",
          "CHEMBL292622",
          "CHEMBL292757",
          "CHEMBL292868",
          "CHEMBL293097",
          "CHEMBL293556",
          "CHEMBL293776",
          "CHEMBL294170",
          "CHEMBL294873",
          "CHEMBL296335",
          "CHEMBL298561",
          "CHEMBL298805",
          "CHEMBL298837",
          "CHEMBL299030",
          "CHEMBL299060",
          "CHEMBL299250",
          "CHEMBL299256",
          "CHEMBL301605",
          "CHEMBL301692",
          "CHEMBL302056",
          "CHEMBL303932",
          "CHEMBL304273",
          "CHEMBL306310",
          "CHEMBL306370",
          "CHEMBL307783",
          "CHEMBL308096",
          "CHEMBL308760",
          "CHEMBL309517",
          "CHEMBL309854",
          "CHEMBL309871",
          "CHEMBL310109",
          "CHEMBL310564",
          "CHEMBL310589",
          "CHEMBL312486",
          "CHEMBL313267",
          "CHEMBL313887",
          "CHEMBL314046",
          "CHEMBL31541",
          "CHEMBL315810",
          "CHEMBL31714",
          "CHEMBL32364",
          "CHEMBL32503",
          "CHEMBL327215",
          "CHEMBL327383",
          "CHEMBL327476",
          "CHEMBL327650",
          "CHEMBL327668",
          "CHEMBL327707",
          "CHEMBL327802",
          "CHEMBL327930",
          "CHEMBL328137",
          "CHEMBL32823",
          "CHEMBL328284",
          "CHEMBL329174",
          "CHEMBL329175",
          "CHEMBL329222",
          "CHEMBL329379",
          "CHEMBL329405",
          "CHEMBL329804",
          "CHEMBL330076",
          "CHEMBL330092",
          "CHEMBL330116",
          "CHEMBL330456",
          "CHEMBL330539",
          "CHEMBL334805",
          "CHEMBL344344",
          "CHEMBL346379",
          "CHEMBL346677",
          "CHEMBL348367",
          "CHEMBL355202",
          "CHEMBL356272",
          "CHEMBL357164",
          "CHEMBL357844",
          "CHEMBL358147",
          "CHEMBL358763",
          "CHEMBL359769",
          "CHEMBL359971",
          "CHEMBL360215",
          "CHEMBL362308",
          "CHEMBL363671",
          "CHEMBL364148",
          "CHEMBL364173",
          "CHEMBL365218",
          "CHEMBL365495",
          "CHEMBL365808",
          "CHEMBL366062",
          "CHEMBL371834",
          "CHEMBL372281",
          "CHEMBL38465",
          "CHEMBL405206",
          "CHEMBL407",
          "CHEMBL417990",
          "CHEMBL419096",
          "CHEMBL420066",
          "CHEMBL421983",
          "CHEMBL422158",
          "CHEMBL424805",
          "CHEMBL426317",
          "CHEMBL431597",
          "CHEMBL432163",
          "CHEMBL433",
          "CHEMBL434522",
          "CHEMBL440512",
          "CHEMBL441420",
          "CHEMBL444050",
          "CHEMBL444586",
          "CHEMBL445138",
          "CHEMBL452",
          "CHEMBL458012",
          "CHEMBL485818",
          "CHEMBL51569",
          "CHEMBL52750",
          "CHEMBL52825",
          "CHEMBL53229",
          "CHEMBL53230",
          "CHEMBL536549",
          "CHEMBL53738",
          "CHEMBL539556",
          "CHEMBL540583",
          "CHEMBL54228",
          "CHEMBL54340",
          "CHEMBL54341",
          "CHEMBL543901",
          "CHEMBL544140",
          "CHEMBL54416",
          "CHEMBL544360",
          "CHEMBL545066",
          "CHEMBL54512",
          "CHEMBL54878",
          "CHEMBL54957",
          "CHEMBL55023",
          "CHEMBL55147",
          "CHEMBL55148",
          "CHEMBL55295",
          "CHEMBL552953",
          "CHEMBL55412",
          "CHEMBL55415",
          "CHEMBL55418",
          "CHEMBL554239",
          "CHEMBL55550",
          "CHEMBL555843",
          "CHEMBL55630",
          "CHEMBL557949",
          "CHEMBL55942",
          "CHEMBL56284",
          "CHEMBL56398",
          "CHEMBL56414",
          "CHEMBL56906",
          "CHEMBL57045",
          "CHEMBL57089",
          "CHEMBL57171",
          "CHEMBL57418",
          "CHEMBL57419",
          "CHEMBL57474",
          "CHEMBL57741",
          "CHEMBL57743",
          "CHEMBL58160",
          "CHEMBL58564",
          "CHEMBL58666",
          "CHEMBL59072",
          "CHEMBL59190",
          "CHEMBL59257",
          "CHEMBL59263",
          "CHEMBL59379",
          "CHEMBL59589",
          "CHEMBL603",
          "CHEMBL60932",
          "CHEMBL61683",
          "CHEMBL63354",
          "CHEMBL66273",
          "CHEMBL66274",
          "CHEMBL66487",
          "CHEMBL66841",
          "CHEMBL67421",
          "CHEMBL67772",
          "CHEMBL67774",
          "CHEMBL67951",
          "CHEMBL69006",
          "CHEMBL69282",
          "CHEMBL69336",
          "CHEMBL69488",
          "CHEMBL69719",
          "CHEMBL70086",
          "CHEMBL71079",
          "CHEMBL715",
          "CHEMBL73167",
          "CHEMBL73288",
          "CHEMBL74280",
          "CHEMBL74354",
          "CHEMBL74589",
          "CHEMBL75212",
          "CHEMBL75289",
          "CHEMBL75306",
          "CHEMBL75307",
          "CHEMBL75642",
          "CHEMBL76263",
          "CHEMBL76793",
          "CHEMBL76918",
          "CHEMBL77226",
          "CHEMBL77958",
          "CHEMBL78730",
          "CHEMBL78759",
          "CHEMBL78768",
          "CHEMBL78880",
          "CHEMBL79037",
          "CHEMBL79166",
          "CHEMBL79203",
          "CHEMBL79449",
          "CHEMBL79695",
          "CHEMBL80189",
          "CHEMBL80609",
          "CHEMBL80610",
          "CHEMBL80738",
          "CHEMBL80756",
          "CHEMBL8260",
          "CHEMBL82894",
          "CHEMBL83043",
          "CHEMBL83052",
          "CHEMBL83597",
          "CHEMBL84450",
          "CHEMBL86231",
          "CHEMBL87331",
          "CHEMBL87641",
          "CHEMBL88114",
          "CHEMBL88515",
          "CHEMBL88647",
          "CHEMBL88648",
          "CHEMBL88709",
          "CHEMBL88721",
          "CHEMBL89215",
          "CHEMBL89407",
          "CHEMBL89600",
          "CHEMBL89834",
          "CHEMBL90399",
          "CHEMBL90579",
          "CHEMBL90790",
          "CHEMBL90791",
          "CHEMBL91000",
          "CHEMBL91097",
          "CHEMBL91151",
          "CHEMBL91186",
          "CHEMBL91336",
          "CHEMBL91617",
          "CHEMBL91701",
          "CHEMBL91702",
          "CHEMBL92644",
          "CHEMBL92697",
          "CHEMBL93312",
          "CHEMBL93325",
          "CHEMBL93488",
          "CHEMBL93568",
          "CHEMBL93668",
          "CHEMBL93825",
          "CHEMBL93827",
          "CHEMBL93895",
          "CHEMBL9562",
          "CHEMBL96",
          "CHEMBL9662",
          "CHEMBL9689",
          "CHEMBL9819"
        ],
        "number_of_missing_values": "0"
      },
      {
        "data_type": "numeric",
        "index": "1",
        "is_ignore": "false",
        "is_row_identifier": "false",
        "is_target": "false",
        "name": "FCFP4_1024b900",
        "number_of_missing_values": "0"
      },
      {
        "data_type": "numeric",
        "index": "2",
        "is_ignore": "false",
        "is_row_identifier": "false",
        "is_target": "false",
        "name": "FCFP4_1024b554",
        "number_of_missing_values": "0"
      },
      {
        "data_type": "numeric",
        "index": "3",
        "is_ignore": "false",
        "is_row_identifier": "false",
        "is_target": "false",
        "name": "FCFP4_1024b921",
        "number_of_missing_values": "0"
      },
      {
        "data_type": "numeric",
        "index": "4",
        "is_ignore": "false",
        "is_row_identifier": "false",
        "is_target": "false",
        "name": "FCFP4_1024b432",
        "number_of_missing_values": "0"
      },
      {
        "data_type": "numeric",
        "index": "5",
        "is_ignore": "false",
        "is_row_identifier": "false",
        "is_target": "false",
        "name": "FCFP4_1024b53",
        "number_of_missing_values": "0"
      },
      {
        "data_type": "numeric",
        "index": "6",
        "is_ignore": "false",
        "is_row_identifier": "false",
        "is_target": "false",
        "name": "FCFP4_1024b822",
        "number_of_missing_values": "0"
      },
      {
        "data_type": "numeric",
        "index": "7",
        "is_ignore": "false",
        "is_row_identifier": "false",
        "is_target": "false",
        "name": "FCFP4_1024b472",
        "number_of_missing_values": "0"
      },
      {
        "data_type": "numeric",
        "index": "8",
        "is_ignore": "false",
        "is_row_identifier": "false",
        "is_target": "false",
        "name": "FCFP4_1024b889",
        "number_of_missing_values": "0"
      },
      {
        "data_type": "numeric",
        "index": "9",
        "is_ignore": "false",
        "is_row_identifier": "false",
        "is_target": "false",
        "name": "FCFP4_1024b1",
        "number_of_missing_values": "0"
      },
      {
        "data_type": "numeric",
        "index": "10",
        "is_ignore": "false",
        "is_row_identifier": "false",
        "is_target": "false",
        "name": "FCFP4_1024b10",
        "number_of_missing_values": "0"
      },
      {
        "data_type": "numeric",
        "index": "11",
        "is_ignore": "false",
        "is_row_identifier": "false",
        "is_target": "false",
        "name": "FCFP4_1024b100",
        "number_of_missing_values": "0"
      },
      {
        "data_type": "numeric",
        "index": "12",
        "is_ignore": "false",
        "is_row_identifier": "false",
        "is_target": "false",
        "name": "FCFP4_1024b1000",
        "number_of_missing_values": "0"
      },
      {
        "data_type": "numeric",
        "index": "13",
        "is_ignore": "false",
        "is_row_identifier": "false",
        "is_target": "false",
        "name": "FCFP4_1024b1001",
        "number_of_missing_values": "0"
      },
      {
        "data_type": "numeric",
        "index": "14",
        "is_ignore": "false",
        "is_row_identifier": "false",
        "is_target": "false",
        "name": "FCFP4_1024b1002",
        "number_of_missing_values": "0"
      },
      {
        "data_type": "numeric",
        "index": "15",
        "is_ignore": "false",
        "is_row_identifier": "false",
        "is_target": "false",
        "name": "FCFP4_1024b1003",
        "number_of_missing_values": "0"
      },
      {
        "data_type": "numeric",
        "index": "16",
        "is_ignore": "false",
        "is_row_identifier": "false",
        "is_target": "false",
        "name": "FCFP4_1024b1004",
        "number_of_missing_values": "0"
      },
      {
        "data_type": "numeric",
        "index": "17",
        "is_ignore": "false",
        "is_row_identifier": "false",
        "is_target": "false",
        "name": "FCFP4_1024b1005",
        "number_of_missing_values": "0"
      },
      {
        "data_type": "numeric",
        "index": "18",
        "is_ignore": "false",
        "is_row_identifier": "false",
        "is_target": "false",
        "name": "FCFP4_1024b1006",
        "number_of_missing_values": "0"
      },
      {
        "data_type": "numeric",
        "index": "19",
        "is_ignore": "false",
        "is_row_identifier": "false",
        "is_target": "false",
        "name": "FCFP4_1024b1007",
        "number_of_missing_values": "0"
      },
      {
        "data_type": "numeric",
        "index": "20",
        "is_ignore": "false",
        "is_row_identifier": "false",
        "is_target": "false",
        "name": "FCFP4_1024b1008",
        "number_of_missing_values": "0"
      },
      {
        "data_type": "numeric",
        "index": "21",
        "is_ignore": "false",
        "is_row_identifier": "false",
        "is_target": "false",
        "name": "FCFP4_1024b1009",
        "number_of_missing_values": "0"
      },
      {
        "data_type": "numeric",
        "index": "22",
        "is_ignore": "false",
        "is_row_identifier": "false",
        "is_target": "false",
        "name": "FCFP4_1024b101",
        "number_of_missing_values": "0"
      },
      {
        "data_type": "numeric",
        "index": "23",
        "is_ignore": "false",
        "is_row_identifier": "false",
        "is_target": "false",
        "name": "FCFP4_1024b1010",
        "number_of_missing_values": "0"
      },
      {
        "data_type": "numeric",
        "index": "24",
        "is_ignore": "false",
        "is_row_identifier": "false",
        "is_target": "false",
        "name": "FCFP4_1024b1011",
        "number_of_missing_values": "0"
      },
      {
        "data_type": "numeric",
        "index": "25",
        "is_ignore": "false",
        "is_row_identifier": "false",
        "is_target": "false",
        "name": "FCFP4_1024b1012",
        "number_of_missing_values": "0"
      },
      {
        "data_type": "numeric",
        "index": "26",
        "is_ignore": "false",
        "is_row_identifier": "false",
        "is_target": "false",
        "name": "FCFP4_1024b1013",
        "number_of_missing_values": "0"
      },
      {
        "data_type": "numeric",
        "index": "27",
        "is_ignore": "false",
        "is_row_identifier": "false",
        "is_target": "false",
        "name": "FCFP4_1024b1014",
        "number_of_missing_values": "0"
      },
      {
        "data_type": "numeric",
        "index": "28",
        "is_ignore": "false",
        "is_row_identifier": "false",
        "is_target": "false",
        "name": "FCFP4_1024b1015",
        "number_of_missing_values": "0"
      },
      {
        "data_type": "numeric",
        "index": "29",
        "is_ignore": "false",
        "is_row_identifier": "false",
        "is_target": "false",
        "name": "FCFP4_1024b1016",
        "number_of_missing_values": "0"
      },
      {
        "data_type": "numeric",
        "index": "30",
        "is_ignore": "false",
        "is_row_identifier": "false",
        "is_target": "false",
        "name": "FCFP4_1024b1017",
        "number_of_missing_values": "0"
      },
      {
        "data_type": "numeric",
        "index": "31",
        "is_ignore": "false",
        "is_row_identifier": "false",
        "is_target": "false",
        "name": "FCFP4_1024b1018",
        "number_of_missing_values": "0"
      },
      {
        "data_type": "numeric",
        "index": "32",
        "is_ignore": "false",
        "is_row_identifier": "false",
        "is_target": "false",
        "name": "FCFP4_1024b1019",
        "number_of_missing_values": "0"
      },
      {
        "data_type": "numeric",
        "index": "33",
        "is_ignore": "false",
        "is_row_identifier": "false",
        "is_target": "false",
        "name": "FCFP4_1024b102",
        "number_of_missing_values": "0"
      },
      {
        "data_type": "numeric",
        "index": "34",
        "is_ignore": "false",
        "is_row_identifier": "false",
        "is_target": "false",
        "name": "FCFP4_1024b1020",
        "number_of_missing_values": "0"
      },
      {
        "data_type": "numeric",
        "index": "35",
        "is_ignore": "false",
        "is_row_identifier": "false",
        "is_target": "false",
        "name": "FCFP4_1024b1021",
        "number_of_missing_values": "0"
      },
      {
        "data_type": "numeric",
        "index": "36",
        "is_ignore": "false",
        "is_row_identifier": "false",
        "is_target": "false",
        "name": "FCFP4_1024b1022",
        "number_of_missing_values": "0"
      },
      {
        "data_type": "numeric",
        "index": "37",
        "is_ignore": "false",
        "is_row_identifier": "false",
        "is_target": "false",
        "name": "FCFP4_1024b1023",
        "number_of_missing_values": "0"
      },
      {
        "data_type": "numeric",
        "index": "38",
        "is_ignore": "false",
        "is_row_identifier": "false",
        "is_target": "false",
        "name": "FCFP4_1024b1024",
        "number_of_missing_values": "0"
      },
      {
        "data_type": "numeric",
        "index": "39",
        "is_ignore": "false",
        "is_row_identifier": "false",
        "is_target": "false",
        "name": "FCFP4_1024b103",
        "number_of_missing_values": "0"
      },
      {
        "data_type": "numeric",
        "index": "40",
        "is_ignore": "false",
        "is_row_identifier": "false",
        "is_target": "false",
        "name": "FCFP4_1024b104",
        "number_of_missing_values": "0"
      },
      {
        "data_type": "numeric",
        "index": "41",
        "is_ignore": "false",
        "is_row_identifier": "false",
        "is_target": "false",
        "name": "FCFP4_1024b105",
        "number_of_missing_values": "0"
      },
      {
        "data_type": "numeric",
        "index": "42",
        "is_ignore": "false",
        "is_row_identifier": "false",
        "is_target": "false",
        "name": "FCFP4_1024b106",
        "number_of_missing_values": "0"
      },
      {
        "data_type": "numeric",
        "index": "43",
        "is_ignore": "false",
        "is_row_identifier": "false",
        "is_target": "false",
        "name": "FCFP4_1024b107",
        "number_of_missing_values": "0"
      },
      {
        "data_type": "numeric",
        "index": "44",
        "is_ignore": "false",
        "is_row_identifier": "false",
        "is_target": "false",
        "name": "FCFP4_1024b108",
        "number_of_missing_values": "0"
      },
      {
        "data_type": "numeric",
        "index": "45",
        "is_ignore": "false",
        "is_row_identifier": "false",
        "is_target": "false",
        "name": "FCFP4_1024b109",
        "number_of_missing_values": "0"
      },
      {
        "data_type": "numeric",
        "index": "46",
        "is_ignore": "false",
        "is_row_identifier": "false",
        "is_target": "false",
        "name": "FCFP4_1024b11",
        "number_of_missing_values": "0"
      },
      {
        "data_type": "numeric",
        "index": "47",
        "is_ignore": "false",
        "is_row_identifier": "false",
        "is_target": "false",
        "name": "FCFP4_1024b110",
        "number_of_missing_values": "0"
      },
      {
        "data_type": "numeric",
        "index": "48",
        "is_ignore": "false",
        "is_row_identifier": "false",
        "is_target": "false",
        "name": "FCFP4_1024b111",
        "number_of_missing_values": "0"
      },
      {
        "data_type": "numeric",
        "index": "49",
        "is_ignore": "false",
        "is_row_identifier": "false",
        "is_target": "false",
        "name": "FCFP4_1024b112",
        "number_of_missing_values": "0"
      },
      {
        "data_type": "numeric",
        "index": "50",
        "is_ignore": "false",
        "is_row_identifier": "false",
        "is_target": "false",
        "name": "FCFP4_1024b113",
        "number_of_missing_values": "0"
      },
      {
        "data_type": "numeric",
        "index": "51",
        "is_ignore": "false",
        "is_row_identifier": "false",
        "is_target": "false",
        "name": "FCFP4_1024b114",
        "number_of_missing_values": "0"
      },
      {
        "data_type": "numeric",
        "index": "52",
        "is_ignore": "false",
        "is_row_identifier": "false",
        "is_target": "true",
        "name": "pXC50",
        "number_of_missing_values": "0"
      }
    ]
  }
}