{
  "data_features": {
    "feature": [
      {
        "data_type": "nominal",
        "index": "0",
        "is_ignore": "false",
        "is_row_identifier": "true",
        "is_target": "false",
        "name": "molecule_id",
        "nominal_value": [
          "CHEMBL1244",
          "CHEMBL1324",
          "CHEMBL160038",
          "CHEMBL166486",
          "CHEMBL166908",
          "CHEMBL167054",
          "CHEMBL167055",
          "CHEMBL167172",
          "CHEMBL168276",
          "CHEMBL168389",
          "CHEMBL168451",
          "CHEMBL168600",
          "CHEMBL168818",
          "CHEMBL169033",
          "CHEMBL169208",
          "CHEMBL169465",
          "CHEMBL169679",
          "CHEMBL169891",
          "CHEMBL169926",
          "CHEMBL170549",
          "CHEMBL197115",
          "CHEMBL198628",
          "CHEMBL265218",
          "CHEMBL350927",
          "CHEMBL352270",
          "CHEMBL353012",
          "CHEMBL353187",
          "CHEMBL353188",
          "CHEMBL353983",
          "CHEMBL354517",
          "CHEMBL355017",
          "CHEMBL355402",
          "CHEMBL355736",
          "CHEMBL8476",
          "CHEMBL8649",
          "CHEMBL953"
        ],
        "number_of_missing_values": "0"
      },
      {
        "data_type": "numeric",
        "index": "1",
        "is_ignore": "false",
        "is_row_identifier": "false",
        "is_target": "false",
        "name": "AMW",
        "number_of_missing_values": "0"
      },
      {
        "data_type": "numeric",
        "index": "2",
        "is_ignore": "false",
        "is_row_identifier": "false",
        "is_target": "false",
        "name": "C.",
        "number_of_missing_values": "0"
      },
      {
        "data_type": "numeric",
        "index": "3",
        "is_ignore": "false",
        "is_row_identifier": "false",
        "is_target": "false",
        "name": "H.",
        "number_of_missing_values": "0"
      },
      {
        "data_type": "numeric",
        "index": "4",
        "is_ignore": "false",
        "is_row_identifier": "false",
        "is_target": "false",
        "name": "Me",
        "number_of_missing_values": "0"
      },
      {
        "data_type": "numeric",
        "index": "5",
        "is_ignore": "false",
        "is_row_identifier": "false",
        "is_target": "false",
        "name": "Mi",
        "number_of_missing_values": "0"
      },
      {
        "data_type": "numeric",
        "index": "6",
        "is_ignore": "false",
        "is_row_identifier": "false",
        "is_target": "false",
        "name": "Mp",
        "number_of_missing_values": "0"
      },
      {
        "data_type": "numeric",
        "index": "7",
        "is_ignore": "false",
        "is_row_identifier": "false",
        "is_target": "false",
        "name": "Mv",
        "number_of_missing_values": "0"
      },
      {
        "data_type": "numeric",
        "index": "8",
        "is_ignore": "false",
        "is_row_identifier": "false",
        "is_target": "false",
        "name": "MW",
        "number_of_missing_values": "0"
      },
      {
        "data_type": "numeric",
        "index": "9",
        "is_ignore": "false",
        "is_row_identifier": "false",
        "is_target": "false",
        "name": "N.",
        "number_of_missing_values": "0"
      },
      {
        "data_type": "numeric",
        "index": "10",
        "is_ignore": "false",
        "is_row_identifier": "false",
        "is_target": "false",
        "name": "nAB",
        "number_of_missing_values": "0"
      },
      {
        "data_type": "numeric",
        "index": "11",
        "is_ignore": "false",
        "is_row_identifier": "false",
        "is_target": "false",
        "name": "nAT",
        "number_of_missing_values": "0"
      },
      {
        "data_type": "numeric",
        "index": "12",
        "is_ignore": "false",
        "is_row_identifier": "false",
        "is_target": "false",
        "name": "nB",
        "number_of_missing_values": "0"
      },
      {
        "data_type": "numeric",
        "index": "13",
        "is_ignore": "false",
        "is_row_identifier": "false",
        "is_target": "false",
        "name": "nBM",
        "number_of_missing_values": "0"
      },
      {
        "data_type": "numeric",
        "index": "14",
        "is_ignore": "false",
        "is_row_identifier": "false",
        "is_target": "false",
        "name": "nBO",
        "number_of_missing_values": "0"
      },
      {
        "data_type": "numeric",
        "index": "15",
        "is_ignore": "false",
        "is_row_identifier": "false",
        "is_target": "false",
        "name": "nBR",
        "number_of_missing_values": "0"
      },
      {
        "data_type": "numeric",
        "index": "16",
        "is_ignore": "false",
        "is_row_identifier": "false",
        "is_target": "false",
        "name": "nBT",
        "number_of_missing_values": "0"
      },
      {
        "data_type": "numeric",
        "index": "17",
        "is_ignore": "false",
        "is_row_identifier": "false",
        "is_target": "false",
        "name": "nC",
        "number_of_missing_values": "0"
      },
      {
        "data_type": "numeric",
        "index": "18",
        "is_ignore": "false",
        "is_row_identifier": "false",
        "is_target": "false",
        "name": "nCL",
        "number_of_missing_values": "0"
      },
      {
        "data_type": "numeric",
        "index": "19",
        "is_ignore": "false",
        "is_row_identifier": "false",
        "is_target": "false",
        "name": "nCsp",
        "number_of_missing_values": "0"
      },
      {
        "data_type": "numeric",
        "index": "20",
        "is_ignore": "false",
        "is_row_identifier": "false",
        "is_target": "false",
        "name": "nCsp2",
        "number_of_missing_values": "0"
      },
      {
        "data_type": "numeric",
        "index": "21",
        "is_ignore": "false",
        "is_row_identifier": "false",
        "is_target": "false",
        "name": "nCsp3",
        "number_of_missing_values": "0"
      },
      {
        "data_type": "numeric",
        "index": "22",
        "is_ignore": "false",
        "is_row_identifier": "false",
        "is_target": "false",
        "name": "nDB",
        "number_of_missing_values": "0"
      },
      {
        "data_type": "numeric",
        "index": "23",
        "is_ignore": "false",
        "is_row_identifier": "false",
        "is_target": "false",
        "name": "nF",
        "number_of_missing_values": "0"
      },
      {
        "data_type": "numeric",
        "index": "24",
        "is_ignore": "false",
        "is_row_identifier": "false",
        "is_target": "false",
        "name": "nH",
        "number_of_missing_values": "0"
      },
      {
        "data_type": "numeric",
        "index": "25",
        "is_ignore": "false",
        "is_row_identifier": "false",
        "is_target": "false",
        "name": "nHet",
        "number_of_missing_values": "0"
      },
      {
        "data_type": "numeric",
        "index": "26",
        "is_ignore": "false",
        "is_row_identifier": "false",
        "is_target": "false",
        "name": "nHM",
        "number_of_missing_values": "0"
      },
      {
        "data_type": "numeric",
        "index": "27",
        "is_ignore": "false",
        "is_row_identifier": "false",
        "is_target": "false",
        "name": "nI",
        "number_of_missing_values": "0"
      },
      {
        "data_type": "numeric",
        "index": "28",
        "is_ignore": "false",
        "is_row_identifier": "false",
        "is_target": "false",
        "name": "nN",
        "number_of_missing_values": "0"
      },
      {
        "data_type": "numeric",
        "index": "29",
        "is_ignore": "false",
        "is_row_identifier": "false",
        "is_target": "false",
        "name": "nO",
        "number_of_missing_values": "0"
      },
      {
        "data_type": "numeric",
        "index": "30",
        "is_ignore": "false",
        "is_row_identifier": "false",
        "is_target": "false",
        "name": "nP",
        "number_of_missing_values": "0"
      },
      {
        "data_type": "numeric",
        "index": "31",
        "is_ignore": "false",
        "is_row_identifier": "false",
        "is_target": "false",
        "name": "nS",
        "number_of_missing_values": "0"
      },
      {
        "data_type": "numeric",
        "index": "32",
        "is_ignore": "false",
        "is_row_identifier": "false",
        "is_target": "false",
        "name": "nSK",
        "number_of_missing_values": "0"
      },
      {
        "data_type": "numeric",
        "index": "33",
        "is_ignore": "false",
        "is_row_identifier": "false",
        "is_target": "false",
        "name": "nTB",
        "number_of_missing_values": "0"
      },
      {
        "data_type": "numeric",
        "index": "34",
        "is_ignore": "false",
        "is_row_identifier": "false",
        "is_target": "false",
        "name": "nX",
        "number_of_missing_values": "0"
      },
      {
        "data_type": "numeric",
        "index": "35",
        "is_ignore": "false",
        "is_row_identifier": "false",
        "is_target": "false",
        "name": "O.",
        "number_of_missing_values": "0"
      },
      {
        "data_type": "numeric",
        "index": "36",
        "is_ignore": "false",
        "is_row_identifier": "false",
        "is_target": "false",
        "name": "RBF",
        "number_of_missing_values": "0"
      },
      {
        "data_type": "numeric",
        "index": "37",
        "is_ignore": "false",
        "is_row_identifier": "false",
        "is_target": "false",
        "name": "RBN",
        "number_of_missing_values": "0"
      },
      {
        "data_type": "numeric",
        "index": "38",
        "is_ignore": "false",
        "is_row_identifier": "false",
        "is_target": "false",
        "name": "SCBO",
        "number_of_missing_values": "0"
      },
      {
        "data_type": "numeric",
        "index": "39",
        "is_ignore": "false",
        "is_row_identifier": "false",
        "is_target": "false",
        "name": "Se",
        "number_of_missing_values": "0"
      },
      {
        "data_type": "numeric",
        "index": "40",
        "is_ignore": "false",
        "is_row_identifier": "false",
        "is_target": "false",
        "name": "Si",
        "number_of_missing_values": "0"
      },
      {
        "data_type": "numeric",
        "index": "41",
        "is_ignore": "false",
        "is_row_identifier": "false",
        "is_target": "false",
        "name": "Sp",
        "number_of_missing_values": "0"
      },
      {
        "data_type": "numeric",
        "index": "42",
        "is_ignore": "false",
        "is_row_identifier": "false",
        "is_target": "false",
        "name": "Sv",
        "number_of_missing_values": "0"
      },
      {
        "data_type": "numeric",
        "index": "43",
        "is_ignore": "false",
        "is_row_identifier": "false",
        "is_target": "false",
        "name": "X.",
        "number_of_missing_values": "0"
      },
      {
        "data_type": "numeric",
        "index": "44",
        "is_ignore": "false",
        "is_row_identifier": "false",
        "is_target": "true",
        "name": "pXC50",
        "number_of_missing_values": "0"
      }
    ]
  }
}