"molecule_id","AMW","C.","H.","Me","Mi","Mp","Mv","MW","N.","nAB","nAT","nB","nBM","nBO","nBR","nBT","nC","nCL","nCsp","nCsp2","nCsp3","nDB","nF","nH","nHet","nHM","nI","nN","nO","nP","nS","nSK","nTB","nX","O.","RBF","RBN","SCBO","Se","Si","Sp","Sv","X.","pXC50"
{1 5.741,2 38.5,3 57.7,4 0.973,5 1.131,6 0.628,7 0.566,8 149.26,9 3.8,10 6,11 26,13 6,14 11,16 26,17 10,20 6,21 4,24 15,25 1,28 1,32 11,36 0.115,37 3,38 14,39 25.287,40 29.405,41 16.335,42 14.709,44 6.036}
{0 CHEMBL1230845,1 6.301,2 37.5,3 54.2,4 0.989,5 1.133,6 0.626,7 0.579,8 151.23,9 4.2,10 6,11 24,13 6,14 11,16 24,17 9,20 6,21 3,24 13,25 2,28 1,29 1,32 11,35 4.2,36 0.083,37 2,38 14,39 23.731,40 27.199,41 15.029,42 13.897,44 5.248}
{0 CHEMBL1669632,1 7.788,2 38.9,3 46.3,4 1.013,5 1.131,6 0.658,7 0.626,8 420.55,9 3.7,10 12,11 54,13 15,14 31,16 56,17 21,20 13,21 8,22 3,23 1,24 25,25 8,26 1,28 2,29 4,31 1,32 29,34 1,35 7.4,36 0.089,37 5,38 40,39 54.705,40 61.076,41 35.551,42 33.794,43 1.9,44 8.31}
{0 CHEMBL1669633,1 7.389,2 40,3 46,4 1.009,5 1.13,6 0.649,7 0.624,8 369.46,9 6,10 12,11 50,13 15,14 29,16 52,17 20,20 13,21 7,22 3,24 23,25 7,28 3,29 4,32 27,35 8,36 0.096,37 5,38 38,39 50.451,40 56.485,41 32.449,42 31.191,44 7.222}
{0 CHEMBL1669634,1 9.872,2 46.7,3 36.7,4 1.024,5 1.11,6 0.74,7 0.709,8 296.16,9 3.3,10 12,11 30,13 13,14 20,16 31,17 14,18 2,20 13,21 1,22 1,24 11,25 5,26 2,28 1,29 2,32 19,34 2,35 6.7,36 0.097,37 3,38 27,39 30.705,40 33.296,41 22.199,42 21.267,43 6.7,44 7.602}
{0 CHEMBL1669635,1 11.56,2 50,3 30.8,4 1.031,5 1.101,6 0.802,7 0.764,8 300.57,9 3.8,10 12,11 26,13 13,14 19,16 27,17 13,18 3,20 13,22 1,24 8,25 5,26 3,28 1,29 1,32 18,34 3,35 3.8,36 0.074,37 2,38 26,39 26.818,40 28.616,41 20.841,42 19.853,43 11.5,44 7.222}
{0 CHEMBL1669636,1 10.236,2 50,3 34.6,4 1.019,5 1.103,6 0.769,7 0.732,8 266.13,9 3.8,10 12,11 26,13 13,14 18,16 27,17 13,18 2,20 13,22 1,24 9,25 4,26 2,28 1,29 1,32 17,34 2,35 3.8,36 0.074,37 2,38 25,39 26.495,40 28.672,41 19.983,42 19.025,43 7.7,44 7.268}
{0 CHEMBL1669637,1 8.45,2 41.2,3 38.2,4 1.03,5 1.13,6 0.666,7 0.663,8 287.3,9 8.8,10 12,11 34,13 15,14 22,16 35,17 14,20 13,21 1,22 3,24 13,25 7,28 3,29 4,32 21,35 11.8,36 0.114,37 4,38 31,39 35.033,40 38.409,41 22.642,42 22.557,44 5.717}
{0 CHEMBL1669638,1 7.884,2 40,3 42.5,4 1.02,5 1.131,6 0.654,7 0.64,8 315.36,9 7.5,10 12,11 40,13 15,14 24,16 41,17 16,20 13,21 3,22 3,24 17,25 7,28 3,29 4,32 23,35 10,36 0.146,37 6,38 33,39 40.8,40 45.239,41 26.165,42 25.611,44 7.373}
{0 CHEMBL1669639,1 7.66,2 39.5,3 44.2,4 1.016,5 1.131,6 0.649,7 0.631,8 329.39,9 7,10 12,11 43,13 15,14 25,16 44,17 17,20 13,21 4,22 3,24 19,25 7,28 3,29 4,32 24,35 9.3,36 0.159,37 7,38 34,39 43.683,40 48.654,41 27.926,42 27.138,44 7.886}
{0 CHEMBL1669640,1 7.66,2 39.5,3 44.2,4 1.016,5 1.131,6 0.649,7 0.631,8 329.39,9 7,10 12,11 43,13 15,14 25,16 44,17 17,20 13,21 4,22 3,24 19,25 7,28 3,29 4,32 24,35 9.3,36 0.136,37 6,38 34,39 43.683,40 48.654,41 27.926,42 27.138,44 6.848}
{0 CHEMBL1669641,1 8.03,2 44.7,3 40.4,4 1.015,5 1.12,6 0.679,7 0.663,8 377.43,9 6.4,10 18,11 47,13 21,14 30,16 49,17 21,20 19,21 2,22 3,24 19,25 7,28 3,29 4,32 28,35 8.5,36 0.143,37 7,38 42,39 47.683,40 52.654,41 31.926,42 31.138,44 7.854}
{0 CHEMBL1669642,1 8.259,2 45.5,3 38.6,4 1.018,5 1.119,6 0.686,7 0.673,8 363.4,9 6.8,10 18,11 44,13 21,14 29,16 46,17 20,20 19,21 1,22 3,24 17,25 7,28 3,29 4,32 27,35 9.1,36 0.13,37 6,38 41,39 44.8,40 49.239,41 30.165,42 29.611,44 6.757}
{0 CHEMBL1669643,1 7.985,2 41.5,3 41.5,4 1.02,5 1.128,6 0.663,7 0.649,8 327.37,9 7.3,10 12,11 41,13 15,14 26,16 43,17 17,20 13,21 4,22 3,24 17,25 7,28 3,29 4,32 24,35 9.8,36 0.116,37 5,38 35,39 41.8,40 46.239,41 27.165,42 26.611,44 6.699}
{0 CHEMBL1669644,1 7.759,2 40.9,3 43.2,4 1.016,5 1.129,6 0.657,7 0.639,8 341.4,9 6.8,10 12,11 44,13 15,14 27,16 46,17 18,20 13,21 5,22 3,24 19,25 7,28 3,29 4,32 25,35 9.1,36 0.109,37 5,38 36,39 44.683,40 49.654,41 28.926,42 28.138,44 7.828}
{0 CHEMBL1669645,1 7.562,2 40.4,3 44.7,4 1.012,5 1.129,6 0.653,7 0.631,8 355.43,9 6.4,10 12,11 47,13 15,14 28,16 49,17 19,20 13,21 6,22 3,24 21,25 7,28 3,29 4,32 26,35 8.5,36 0.102,37 5,38 37,39 47.567,40 53.069,41 30.688,42 29.665,44 7.821}
{0 CHEMBL1669646,1 7.942,2 40,3 42.2,4 1.022,5 1.13,6 0.653,7 0.641,8 357.4,9 6.7,10 12,11 45,13 15,14 28,16 47,17 18,20 13,21 5,22 3,24 19,25 8,28 3,29 5,32 26,35 11.1,36 0.106,37 5,38 37,39 46.011,40 50.864,41 29.381,42 28.853,44 6.987}
{0 CHEMBL1669647,1 7.56,2 38.8,3 44.9,4 1.014,5 1.134,6 0.647,7 0.626,8 370.45,9 8.2,10 12,11 49,13 15,14 29,16 51,17 19,20 13,21 6,22 3,24 22,25 8,28 4,29 4,32 27,35 8.2,36 0.098,37 5,38 38,39 49.669,40 55.568,41 31.693,42 30.686,44 6.785}
{0 CHEMBL1669648,1 8.509,2 43.8,3 37.5,4 1.029,5 1.122,6 0.676,7 0.673,8 272.28,9 6.3,10 12,11 32,13 15,14 21,16 33,17 14,20 13,21 1,22 3,24 12,25 6,28 2,29 4,32 20,35 12.5,36 0.121,37 4,38 30,39 32.931,40 35.91,41 21.636,42 21.536,44 6.451}
{0 CHEMBL1669649,1 9.071,2 43.8,3 34.4,4 1.045,5 1.133,6 0.674,7 0.685,8 290.27,9 6.3,10 12,11 32,13 15,14 22,16 33,17 14,20 13,21 1,22 3,23 1,24 11,25 7,28 2,29 4,32 21,34 1,35 12.5,36 0.121,37 4,38 31,39 33.444,40 36.25,41 21.574,42 21.919,43 3.1,44 7.046}
{0 CHEMBL1669650,1 9.585,2 43.8,3 34.4,4 1.039,5 1.12,6 0.703,7 0.699,8 306.72,9 6.3,10 12,11 32,13 15,14 22,16 33,17 14,18 1,20 13,21 1,22 3,24 11,25 7,26 1,28 2,29 4,32 21,34 1,35 12.5,36 0.121,37 4,38 31,39 33.255,40 35.854,41 22.494,42 22.364,43 3.1,44 7.677}
{0 CHEMBL1669651,1 10.974,2 43.8,3 34.4,4 1.036,5 1.117,6 0.718,7 0.705,8 351.17,9 6.3,10 12,11 32,13 15,14 22,15 1,16 33,17 14,20 13,21 1,22 3,24 11,25 7,26 1,28 2,29 4,32 21,34 1,35 12.5,36 0.121,37 4,38 31,39 33.16,40 35.752,41 22.989,42 22.561,43 3.1,44 7.523}
{0 CHEMBL1669652,1 8.676,2 43.6,3 35.9,4 1.029,5 1.126,6 0.683,7 0.682,8 338.35,9 10.3,10 17,11 39,13 20,14 27,16 41,17 17,20 16,21 1,22 3,24 14,25 8,28 4,29 4,32 25,35 10.3,36 0.122,37 5,38 38.5,39 40.134,40 43.907,41 26.648,42 26.579,44 6.582}
{0 CHEMBL1669653,1 9.493,2 45.5,3 33.3,4 1.06,5 1.157,6 0.667,7 0.687,8 313.27,9 3,10 12,11 33,13 13,14 23,16 34,17 15,20 13,21 2,22 1,23 4,24 11,25 7,28 1,29 2,32 22,34 4,35 6.1,36 0.088,37 3,38 30,39 34.992,40 38.182,41 21.995,42 22.672,43 12.1,44 7.523}
{0 CHEMBL1669654,1 10.805,2 46.7,3 36.7,4 1.027,5 1.12,6 0.726,7 0.701,8 324.16,9 3.3,10 12,11 30,13 13,14 20,15 1,16 31,17 14,20 13,21 1,22 1,23 1,24 11,25 5,26 1,28 1,29 2,32 19,34 2,35 6.7,36 0.097,37 3,38 27,39 30.8,40 33.59,41 21.773,42 21.02,43 6.7,44 7.252}
{0 CHEMBL1669655,1 9.324,2 46.7,3 36.7,4 1.03,5 1.123,6 0.709,7 0.694,8 279.71,9 3.3,10 12,11 30,13 13,14 20,16 31,17 14,18 1,20 13,21 1,22 1,23 1,24 11,25 5,26 1,28 1,29 2,32 19,34 2,35 6.7,36 0.097,37 3,38 27,39 30.894,40 33.692,41 21.279,42 20.823,43 6.7,44 7}
{0 CHEMBL1669656,1 9.684,2 44.1,3 32.4,4 1.068,5 1.159,6 0.66,7 0.688,8 329.27,9 2.9,10 12,11 34,13 13,14 24,16 35,17 15,20 13,21 2,22 1,23 4,24 11,25 8,28 1,29 3,32 23,34 4,35 8.8,36 0.114,37 4,38 31,39 36.32,40 39.392,41 22.449,42 23.387,43 11.8,44 6.86}
{0 CHEMBL1669657,1 8.209,2 45.7,3 40,4 1.022,5 1.125,6 0.675,7 0.664,8 287.31,9 2.9,10 12,11 35,13 14,14 22,16 36,17 16,20 14,21 2,22 2,23 1,24 14,25 5,28 1,29 3,32 21,34 1,35 8.6,36 0.111,37 4,38 30,39 35.782,40 39.373,41 23.637,42 23.237,43 2.9,44 6.857}
{0 CHEMBL1669658,1 8.719,2 48.4,3 35.5,4 1.025,5 1.124,6 0.699,7 0.693,8 270.28,9 6.5,10 12,11 31,13 14,14 21,16 32,17 15,19 1,20 13,21 1,22 1,23 1,24 11,25 5,28 2,29 2,32 20,33 1,34 1,35 6.5,36 0.094,37 3,38 30,39 31.789,40 34.831,41 21.665,42 21.49,43 3.2,44 6.827}
{0 CHEMBL1669659,1 8.775,2 46.7,3 36.7,4 1.036,5 1.136,6 0.679,7 0.679,8 263.26,9 3.3,10 12,11 30,13 13,14 20,16 31,17 14,20 13,21 1,22 1,23 2,24 11,25 5,28 1,29 2,32 19,34 2,35 6.7,36 0.097,37 3,38 27,39 31.083,40 34.088,41 20.358,42 20.378,43 6.7,44 6.64}
{0 CHEMBL1669660,1 8.177,2 39.6,3 43.8,4 1.02,5 1.13,6 0.667,7 0.64,8 392.49,9 4.2,10 12,11 48,13 15,14 29,16 50,17 19,20 13,21 6,22 3,23 1,24 21,25 8,26 1,28 2,29 4,31 1,32 27,34 1,35 8.3,36 0.1,37 5,38 38,39 48.938,40 54.246,41 32.029,42 30.74,43 2.1,44 6.159}
{0 CHEMBL1669661,1 7.858,2 45.5,3 42.4,4 1.014,5 1.126,6 0.672,7 0.652,8 259.3,9 3,10 12,11 33,13 13,14 20,16 34,17 15,20 13,21 2,22 1,23 1,24 14,25 4,28 1,29 2,32 19,34 1,35 6.1,36 0.088,37 3,38 27,39 33.454,40 37.163,41 22.182,42 21.522,43 3,44 5.801}
{0 CHEMBL1669662,1 9.267,2 40,3 37.1,4 1.04,5 1.131,6 0.685,7 0.675,8 324.36,9 5.7,10 12,11 35,13 15,14 23,16 36,17 14,20 13,21 1,22 3,23 1,24 13,25 8,26 1,28 2,29 4,31 1,32 22,34 1,35 11.4,36 0.111,37 4,38 32,39 36.404,40 39.585,41 23.983,42 23.633,43 2.9,44 5.129}
{0 CHEMBL1669663,1 8.483,2 41.7,3 41.7,4 1.019,5 1.116,6 0.689,7 0.66,8 305.38,9 2.8,10 12,11 36,13 15,14 22,16 37,17 15,20 13,21 2,22 3,24 15,25 6,26 1,28 1,29 4,31 1,32 21,35 11.1,36 0.108,37 4,38 31,39 36.673,40 40.162,41 24.801,42 23.755,44 5.222}
{0 CHEMBL1669664,1 7.918,2 43.2,3 43.2,4 1.021,5 1.145,6 0.657,7 0.64,8 348.4,9 4.5,10 12,11 44,13 13,14 27,16 46,17 19,20 13,21 6,22 1,23 3,24 19,25 6,28 2,29 1,32 25,34 3,35 2.3,36 0.065,37 3,38 34,39 44.905,40 50.377,41 28.892,42 28.176,43 6.8,44 7.476}
{0 CHEMBL1669665,1 8.098,2 42.2,3 42.2,4 1.027,5 1.146,6 0.652,7 0.642,8 364.4,9 4.4,10 12,11 45,13 13,14 28,16 47,17 19,20 13,21 6,22 1,23 3,24 19,25 7,28 2,29 2,32 26,34 3,35 4.4,36 0.085,37 4,38 35,39 46.232,40 51.587,41 29.347,42 28.89,43 6.7,44 7.174}
{0 CHEMBL1669666,1 8.897,2 42.2,3 37.8,4 1.05,5 1.161,6 0.649,7 0.659,8 400.38,9 4.4,10 12,11 45,13 13,14 30,16 47,17 19,20 13,21 6,22 1,23 5,24 17,25 9,28 2,29 2,32 28,34 5,35 4.4,36 0.085,37 4,38 37,39 47.258,40 52.266,41 29.222,42 29.657,43 11.1,44 6.728}
{0 CHEMBL1669667,1 9.297,2 42.2,3 35.6,4 1.062,5 1.169,6 0.648,7 0.668,8 418.37,9 4.4,10 12,11 45,13 13,14 31,16 47,17 19,20 13,21 6,22 1,23 6,24 16,25 10,28 2,29 2,32 29,34 6,35 4.4,36 0.085,37 4,38 38,39 47.77,40 52.606,41 29.159,42 30.04,43 13.3,44 6.996}
{0 CHEMBL1669668,1 7.711,2 42.6,3 44.7,4 1.017,5 1.145,6 0.652,7 0.632,8 362.43,9 4.3,10 12,11 47,13 13,14 28,16 49,17 20,20 13,21 7,22 1,23 3,24 21,25 6,28 2,29 1,32 26,34 3,35 2.1,36 0.082,37 4,38 35,39 47.789,40 53.792,41 30.654,42 29.702,43 6.4,44 6.328}
{0 CHEMBL1669669,1 7.884,2 41.7,3 43.8,4 1.023,5 1.146,6 0.648,7 0.634,8 378.43,9 4.2,10 12,11 48,13 13,14 29,16 50,17 20,20 13,21 7,22 1,23 3,24 21,25 7,28 2,29 2,32 27,34 3,35 4.2,36 0.1,37 5,38 36,39 49.116,40 55.002,41 31.108,42 30.417,43 6.3,44 7.553}
{0 CHEMBL1669670,1 9.383,2 41.7,3 35.4,4 1.066,5 1.174,6 0.643,7 0.666,8 450.39,9 4.2,10 12,11 48,13 13,14 33,16 50,17 20,20 13,21 7,22 1,23 7,24 17,25 11,28 2,29 2,32 31,34 7,35 4.2,36 0.1,37 5,38 40,39 51.167,40 56.361,41 30.858,42 31.95,43 14.6,44 6.439}
{0 CHEMBL1669671,1 7.529,2 42,3 46,4 1.013,5 1.144,6 0.648,7 0.625,8 376.46,9 4,10 12,11 50,13 13,14 29,16 52,17 21,20 13,21 8,22 1,23 3,24 23,25 6,28 2,29 1,32 27,34 3,35 2,36 0.077,37 4,38 36,39 50.672,40 57.208,41 32.415,42 31.229,43 6,44 7.187}
{0 CHEMBL1669672,1 7.695,2 41.2,3 45.1,4 1.02,5 1.145,6 0.645,7 0.626,8 392.46,9 3.9,10 12,11 51,13 13,14 30,16 53,17 21,20 13,21 8,22 1,23 3,24 23,25 7,28 2,29 2,32 28,34 3,35 3.9,36 0.094,37 5,38 37,39 52,40 58.417,41 32.87,42 31.944,43 5.9,44 7.569}
{0 CHEMBL1669673,1 8.201,2 46.2,3 40.4,4 1.021,5 1.135,6 0.675,7 0.662,8 426.47,9 3.8,10 18,11 52,13 19,14 34,16 55,17 24,20 19,21 5,22 1,23 3,24 21,25 7,28 2,29 2,32 31,34 3,35 3.8,36 0.091,37 5,38 44,39 53.116,40 59.002,41 35.108,42 34.417,43 5.8,44 7.086}
{0 CHEMBL1669674,1 8.183,2 43.5,3 41.3,4 1.027,5 1.143,6 0.66,7 0.65,8 376.41,9 4.3,10 12,11 46,13 14,14 29,16 48,17 20,20 14,21 6,22 2,23 3,24 19,25 7,28 2,29 2,32 27,34 3,35 4.3,36 0.083,37 4,38 37,39 47.232,40 52.587,41 30.347,42 29.89,43 6.5,44 6.921}
{0 CHEMBL1669675,1 8.594,2 43.9,3 39,4 1.037,5 1.154,6 0.66,7 0.659,8 352.36,9 4.9,10 12,11 41,13 13,14 27,16 43,17 18,20 13,21 5,22 1,23 4,24 16,25 7,28 2,29 1,32 25,34 4,35 2.4,36 0.07,37 3,38 34,39 42.534,40 47.302,41 27.069,42 27.032,43 9.8,44 7.699}
{0 CHEMBL1669676,1 8.995,2 43.9,3 39,4 1.033,5 1.144,6 0.683,7 0.67,8 368.81,9 4.9,10 12,11 41,13 13,14 27,16 43,17 18,18 1,20 13,21 5,22 1,23 3,24 16,25 7,26 1,28 2,29 1,32 25,34 4,35 2.4,36 0.07,37 3,38 34,39 42.345,40 46.906,41 27.989,42 27.476,43 9.8,44 6.611}
{0 CHEMBL1669677,1 10.08,2 43.9,3 39,4 1.031,5 1.142,6 0.695,7 0.675,8 413.26,9 4.9,10 12,11 41,13 13,14 27,15 1,16 43,17 18,20 13,21 5,22 1,23 3,24 16,25 7,26 1,28 2,29 1,32 25,34 4,35 2.4,36 0.07,37 3,38 34,39 42.251,40 46.804,41 28.483,42 27.674,43 9.8,44 6.246}
{0 CHEMBL1927024,1 6.301,2 37.5,3 54.2,4 0.989,5 1.133,6 0.626,7 0.579,8 151.23,9 4.2,10 6,11 24,13 6,14 11,16 24,17 9,20 6,21 3,24 13,25 2,28 1,29 1,32 11,35 4.2,36 0.083,37 2,38 14,39 23.731,40 27.199,41 15.029,42 13.897,44 6.553}
{0 CHEMBL1927030,1 5.741,2 38.5,3 57.7,4 0.973,5 1.131,6 0.628,7 0.566,8 149.26,9 3.8,10 6,11 26,13 6,14 11,16 26,17 10,20 6,21 4,24 15,25 1,28 1,32 11,36 0.115,37 3,38 14,39 25.287,40 29.405,41 16.335,42 14.709,44 5.613}
{0 CHEMBL19393,1 5.88,2 39.1,3 56.5,4 0.974,5 1.13,6 0.634,7 0.573,8 135.23,9 4.3,10 6,11 23,13 6,14 10,16 23,17 9,20 6,21 3,24 13,25 1,28 1,32 10,36 0.087,37 2,38 13,39 22.403,40 25.99,41 14.574,42 13.182,44 5.305}
{0 CHEMBL200088,1 6.686,2 44.1,3 50,4 0.985,5 1.119,6 0.663,7 0.616,8 227.33,9 2.9,10 12,11 34,13 12,14 18,16 35,17 15,20 12,21 3,24 17,25 2,28 1,29 1,32 17,35 2.9,36 0.143,37 5,38 24,39 33.498,40 38.029,41 22.551,42 20.951,44 6.775}
{0 CHEMBL201001,1 15.034,2 43.8,3 40.6,4 1.002,5 1.102,6 0.83,7 0.712,8 481.08,9 3.1,10 12,11 32,13 12,14 20,16 33,17 14,20 12,21 2,24 13,25 5,26 2,27 2,28 1,29 2,32 19,34 2,35 6.3,36 0.121,37 4,38 26,39 32.08,40 35.265,41 26.563,42 22.772,43 6.3,44 6}
{0 CHEMBL201002,1 11.1,2 43.8,3 43.8,4 1,5 1.111,6 0.747,7 0.67,8 355.19,9 3.1,10 12,11 32,13 12,14 19,16 33,17 14,20 12,21 2,24 14,25 4,26 1,27 1,28 1,29 2,32 18,34 1,35 6.3,36 0.121,37 4,38 25,39 32.011,40 35.544,41 23.904,42 21.455,43 3.1,44 6}
{0 CHEMBL201047,1 6.385,2 42.5,3 52.5,4 0.982,5 1.121,6 0.652,7 0.6,8 255.39,9 2.5,10 12,11 40,13 12,14 20,16 41,17 17,20 12,21 5,24 21,25 2,28 1,29 1,32 19,35 2.5,36 0.146,37 6,38 26,39 39.265,40 44.86,41 26.074,42 24.004,44 6.717}
{0 CHEMBL201623,1 22.902,2 43.8,3 34.4,4 1.007,5 1.085,6 0.996,7 0.794,8 732.86,9 3.1,10 12,11 32,13 12,14 22,16 33,17 14,20 12,21 2,24 11,25 7,26 4,27 4,28 1,29 2,32 21,34 4,35 6.3,36 0.121,37 4,38 28,39 32.218,40 34.706,41 31.881,42 25.406,43 12.5,44 6}
{0 CHEMBL201864,1 7.215,2 44.1,3 47.1,4 1,5 1.129,6 0.661,7 0.627,8 245.32,9 2.9,10 12,11 34,13 12,14 19,16 35,17 15,20 12,21 3,23 1,24 16,25 3,28 1,29 1,32 18,34 1,35 2.9,36 0.143,37 5,38 25,39 34.011,40 38.369,41 22.489,42 21.334,43 2.9,44 7.415}
{0 CHEMBL201885,1 18.968,2 43.8,3 37.5,4 1.005,5 1.093,6 0.913,7 0.753,8 606.97,9 3.1,10 12,11 32,13 12,14 21,16 33,17 14,20 12,21 2,24 12,25 6,26 3,27 3,28 1,29 2,32 20,34 3,35 6.3,36 0.121,37 4,38 27,39 32.149,40 34.985,41 29.222,42 24.089,43 9.4,44 6}
{0 CHEMBL201892,1 10.389,2 44.1,3 47.1,4 0.987,5 1.11,6 0.741,7 0.655,8 353.22,9 2.9,10 12,11 34,13 12,14 19,16 35,17 15,20 12,21 3,24 16,25 3,26 1,27 1,28 1,29 1,32 18,34 1,35 2.9,36 0.143,37 5,38 25,39 33.567,40 37.75,41 25.211,42 22.267,43 2.9,44 6.656}
{0 CHEMBL201896,1 7.166,2 43.8,3 46.9,4 0.998,5 1.119,6 0.664,7 0.629,8 229.3,9 3.1,10 12,11 32,13 12,14 18,16 33,17 14,20 12,21 2,24 15,25 3,28 1,29 2,32 17,35 6.3,36 0.121,37 4,38 24,39 31.942,40 35.824,41 21.245,42 20.139,44 6}
{0 CHEMBL201922,1 15.034,2 43.8,3 40.6,4 1.002,5 1.102,6 0.83,7 0.712,8 481.08,9 3.1,10 12,11 32,13 12,14 20,16 33,17 14,20 12,21 2,24 13,25 5,26 2,27 2,28 1,29 2,32 19,34 2,35 6.3,36 0.121,37 4,38 26,39 32.08,40 35.265,41 26.563,42 22.772,43 6.3,44 6.431}
{0 CHEMBL201965,1 6.385,2 42.5,3 52.5,4 0.982,5 1.121,6 0.652,7 0.6,8 255.39,9 2.5,10 12,11 40,13 12,14 20,16 41,17 17,20 12,21 5,24 21,25 2,28 1,29 1,32 19,35 2.5,36 0.122,37 5,38 26,39 39.265,40 44.86,41 26.074,42 24.004,44 7.009}
{0 CHEMBL201993,1 7.565,2 41.7,3 44.4,4 1.01,5 1.126,6 0.658,7 0.635,8 272.33,9 5.6,10 12,11 36,13 14,14 21,16 37,17 15,20 12,21 3,22 2,24 16,25 5,28 2,29 3,32 20,35 8.3,36 0.162,37 6,38 29,39 36.371,40 40.531,41 23.705,42 22.875,44 7.668}
{0 CHEMBL202021,1 11.384,2 43.2,3 40.5,4 1.027,5 1.14,6 0.724,7 0.674,8 421.22,9 2.7,10 12,11 37,13 12,14 23,16 38,17 16,20 12,21 4,23 3,24 15,25 6,26 1,27 1,28 1,29 1,32 22,34 4,35 2.7,36 0.132,37 5,38 29,39 37.989,40 42.184,41 26.784,42 24.944,43 10.8,44 6}
{0 CHEMBL202024,1 10.549,2 42.9,3 45.7,4 0.997,5 1.113,6 0.733,7 0.657,8 369.22,9 2.9,10 12,11 35,13 12,14 20,16 36,17 15,20 12,21 3,24 16,25 4,26 1,27 1,28 1,29 2,32 19,34 1,35 5.7,36 0.139,37 5,38 26,39 34.894,40 38.959,41 25.665,42 22.982,43 2.9,44 6.656}
{0 CHEMBL202046,1 6.162,2 41.3,3 54.3,4 0.979,5 1.124,6 0.643,7 0.588,8 283.45,9 2.2,10 12,11 46,13 12,14 22,16 47,17 19,20 12,21 7,24 25,25 2,28 1,29 1,32 21,35 2.2,36 0.191,37 9,38 28,39 45.032,40 51.69,41 29.597,42 27.058,44 6}
{0 CHEMBL202047,1 6.523,2 43.2,3 51.4,4 0.983,5 1.12,6 0.657,7 0.607,8 241.36,9 2.7,10 12,11 37,13 12,14 19,16 38,17 16,20 12,21 4,24 19,25 2,28 1,29 1,32 18,35 2.7,36 0.158,37 6,38 25,39 36.382,40 41.445,41 24.313,42 22.477,44 6.684}
{0 CHEMBL202071,1 7.982,2 43.2,3 43.2,4 1.025,5 1.148,6 0.652,7 0.639,8 295.33,9 2.7,10 12,11 37,13 12,14 22,16 38,17 16,20 12,21 4,23 3,24 16,25 5,28 1,29 1,32 21,34 3,35 2.7,36 0.132,37 5,38 28,39 37.92,40 42.464,41 24.125,42 23.627,43 8.1,44 7.695}
{0 CHEMBL202099,1 6.266,2 41.9,3 53.5,4 0.98,5 1.123,6 0.647,7 0.594,8 269.42,9 2.3,10 12,11 43,13 12,14 21,16 44,17 18,20 12,21 6,24 23,25 2,28 1,29 1,32 20,35 2.3,36 0.182,37 8,38 27,39 42.149,40 48.275,41 27.836,42 25.531,44 7.097}
{0 CHEMBL202172,1 9.332,2 44.1,3 35.3,4 1.061,5 1.168,6 0.654,7 0.673,8 317.28,9 2.9,10 12,11 34,13 12,14 23,16 35,17 15,20 12,21 3,23 5,24 12,25 7,28 1,29 1,32 22,34 5,35 2.9,36 0.143,37 5,38 29,39 36.061,40 39.728,41 22.239,42 22.867,43 14.7,44 6}
{0 CHEMBL202183,1 6.773,2 42.1,3 50,4 0.992,5 1.122,6 0.652,7 0.61,8 257.36,9 2.6,10 12,11 38,13 12,14 20,16 39,17 16,20 12,21 4,24 19,25 3,28 1,29 2,32 19,35 5.3,36 0.154,37 6,38 26,39 37.709,40 42.654,41 24.767,42 23.192,44 6.712}
{0 CHEMBL202209,1 7.093,2 44.4,3 47.2,4 0.995,5 1.118,6 0.667,7 0.63,8 255.34,9 2.8,10 12,11 36,13 13,14 20,16 37,17 16,20 13,21 3,22 1,24 17,25 3,28 1,29 2,32 19,35 5.6,36 0.162,37 6,38 27,39 35.825,40 40.239,41 24.006,42 22.665,44 7.081}
{0 CHEMBL202279,1 6.523,2 43.2,3 51.4,4 0.983,5 1.12,6 0.657,7 0.607,8 241.36,9 2.7,10 12,11 37,13 12,14 19,16 38,17 16,20 12,21 4,24 19,25 2,28 1,29 1,32 18,35 2.7,36 0.158,37 6,38 25,39 36.382,40 41.445,41 24.313,42 22.477,44 7.268}
{0 CHEMBL202330,1 6.385,2 42.5,3 52.5,4 0.982,5 1.121,6 0.652,7 0.6,8 255.39,9 2.5,10 12,11 40,13 12,14 20,16 41,17 17,20 12,21 5,24 21,25 2,28 1,29 1,32 19,35 2.5,36 0.171,37 7,38 26,39 39.265,40 44.86,41 26.074,42 24.004,44 7.149}
{0 CHEMBL202335,1 7.734,2 42.5,3 45,4 1.02,5 1.147,6 0.647,7 0.629,8 309.36,9 2.5,10 12,11 40,13 12,14 23,16 41,17 17,20 12,21 5,23 3,24 18,25 5,28 1,29 1,32 22,34 3,35 2.5,36 0.146,37 6,38 29,39 40.803,40 45.879,41 25.887,42 25.154,43 7.5,44 7.921}
{0 CHEMBL202395,1 10.086,2 42.1,3 47.4,4 0.994,5 1.115,6 0.722,7 0.645,8 383.25,9 2.6,10 12,11 38,13 12,14 21,16 39,17 16,20 12,21 4,24 18,25 4,26 1,27 1,28 1,29 2,32 20,34 1,35 5.3,36 0.154,37 6,38 27,39 37.778,40 42.375,41 27.426,42 24.509,43 2.6,44 6}
{0 CHEMBL202457,1 6.952,2 42.9,3 48.6,4 0.995,5 1.121,6 0.657,7 0.619,8 243.33,9 2.9,10 12,11 35,13 12,14 19,16 36,17 15,20 12,21 3,24 17,25 3,28 1,29 2,32 18,35 5.7,36 0.111,37 4,38 25,39 34.825,40 39.239,41 23.006,42 21.665,44 6.936}
{0 CHEMBL202548,1 6.843,2 40.5,3 50,4 0.998,5 1.126,6 0.642,7 0.606,8 287.39,9 2.4,10 12,11 42,13 12,14 22,16 43,17 17,20 12,21 5,24 21,25 4,28 1,29 3,32 21,35 7.1,36 0.163,37 7,38 28,39 41.92,40 47.279,41 26.983,42 25.434,44 6.91}
{0 CHEMBL2206371,1 7.569,2 39.4,3 48.5,4 0.994,5 1.132,6 0.673,7 0.624,8 249.77,9 9.1,10 11,11 33,13 11,14 18,16 34,17 13,18 1,20 9,21 4,24 16,25 4,26 1,28 3,32 17,34 1,36 0.118,37 4,38 23.5,39 32.814,40 37.345,41 22.205,42 20.579,43 3,44 6.301}
{0 CHEMBL2206375,1 7.569,2 39.4,3 48.5,4 0.994,5 1.132,6 0.673,7 0.624,8 249.77,9 9.1,10 11,11 33,13 11,14 18,16 34,17 13,18 1,20 9,21 4,24 16,25 4,26 1,28 3,32 17,34 1,36 0.118,37 4,38 23.5,39 32.814,40 37.345,41 22.205,42 20.579,43 3,44 7.638}
{0 CHEMBL2206381,1 6.631,2 37.8,3 51.4,4 0.992,5 1.136,6 0.637,7 0.594,8 245.36,9 8.1,10 11,11 37,13 11,14 19,16 38,17 14,20 9,21 5,24 19,25 4,28 3,29 1,32 18,35 2.7,36 0.132,37 5,38 24.5,39 36.702,40 42.026,41 23.563,42 21.993,44 7.143}
{0 CHEMBL2206388,1 6.843,2 36.1,3 50,4 0.998,5 1.142,6 0.634,7 0.597,8 246.35,9 11.1,10 11,11 36,13 11,14 19,16 37,17 13,20 8,21 5,24 18,25 5,28 4,29 1,32 18,35 2.8,36 0.135,37 5,38 24.5,39 35.92,40 41.109,41 22.807,42 21.488,44 7.009}
{0 CHEMBL2206404,1 6.525,2 39.4,3 51.5,4 0.985,5 1.133,6 0.647,7 0.599,8 215.33,9 9.1,10 11,11 33,13 11,14 17,16 34,17 13,20 9,21 4,24 17,25 3,28 3,32 16,36 0.118,37 4,38 22.5,39 32.491,40 37.401,41 21.347,42 19.752,44 7.553}
{0 CHEMBL2206890,1 7.569,2 39.4,3 48.5,4 0.994,5 1.132,6 0.673,7 0.624,8 249.77,9 9.1,10 11,11 33,13 11,14 18,16 34,17 13,18 1,20 9,21 4,24 16,25 4,26 1,28 3,32 17,34 1,36 0.118,37 4,38 23.5,39 32.814,40 37.345,41 22.205,42 20.579,43 3,44 8}
{0 CHEMBL229075,1 6.619,2 41.5,3 51.2,4 0.99,5 1.124,6 0.647,7 0.603,8 271.39,9 2.4,10 12,11 41,13 12,14 21,16 42,17 17,20 12,21 5,24 21,25 3,28 1,29 2,32 20,35 4.9,36 0.167,37 7,38 27,39 40.592,40 46.069,41 26.529,42 24.719,44 6.333}
{0 CHEMBL229126,1 6.952,2 42.9,3 48.6,4 0.995,5 1.121,6 0.657,7 0.619,8 243.33,9 2.9,10 12,11 35,13 12,14 19,16 36,17 15,20 12,21 3,24 17,25 3,28 1,29 2,32 18,35 5.7,36 0.167,37 6,38 25,39 34.825,40 39.239,41 23.006,42 21.665,44 6.053}
{0 CHEMBL229127,1 7.324,2 42.9,3 45.7,4 1.001,5 1.123,6 0.664,7 0.633,8 256.33,9 5.7,10 12,11 35,13 13,14 20,16 36,17 15,20 13,21 2,22 1,24 16,25 4,28 2,29 2,32 19,35 5.7,36 0.139,37 5,38 27,39 35.043,40 39.322,41 23.25,42 22.16,44 6}
{0 CHEMBL229182,1 7.115,2 42.1,3 47.4,4 0.998,5 1.125,6 0.658,7 0.623,8 270.36,9 5.3,10 12,11 38,13 13,14 21,16 39,17 16,20 13,21 3,22 1,24 18,25 4,28 2,29 2,32 20,35 5.3,36 0.154,37 6,38 28,39 37.927,40 42.737,41 25.012,42 23.687,44 6}
{0 CHEMBL229183,1 6.936,2 41.5,3 48.8,4 0.995,5 1.126,6 0.653,7 0.615,8 284.39,9 4.9,10 12,11 41,13 13,14 22,16 42,17 17,20 13,21 4,22 1,24 20,25 4,28 2,29 2,32 21,35 4.9,36 0.167,37 7,38 29,39 40.811,40 46.152,41 26.773,42 25.214,44 6}
{0 CHEMBL229184,1 6.782,2 40.9,3 50,4 0.993,5 1.127,6 0.649,7 0.608,8 298.42,9 4.5,10 12,11 44,13 13,14 23,16 45,17 18,20 13,21 5,22 1,24 22,25 4,28 2,29 2,32 22,35 4.5,36 0.178,37 8,38 30,39 43.694,40 49.567,41 28.534,42 26.74,44 6.043}
{0 CHEMBL229185,1 6.782,2 40.9,3 50,4 0.993,5 1.127,6 0.649,7 0.608,8 298.42,9 4.5,10 12,11 44,13 13,14 23,16 45,17 18,20 13,21 5,22 1,24 22,25 4,28 2,29 2,32 22,35 4.5,36 0.156,37 7,38 30,39 43.694,40 49.567,41 28.534,42 26.74,44 6}
{0 CHEMBL229234,1 6.648,2 40.4,3 51.1,4 0.991,5 1.127,6 0.645,7 0.601,8 312.45,9 4.3,10 12,11 47,13 13,14 24,16 48,17 19,20 13,21 6,22 1,24 24,25 4,28 2,29 2,32 23,35 4.3,36 0.167,37 8,38 31,39 46.578,40 52.983,41 30.296,42 28.267,44 6}
{0 CHEMBL229235,1 7.059,2 48.8,3 46.3,4 0.985,5 1.108,6 0.691,7 0.646,8 289.4,9 2.4,10 18,11 41,13 18,14 24,16 43,17 20,20 18,21 2,24 19,25 2,28 1,29 1,32 22,35 2.4,36 0.116,37 5,38 33,39 40.382,40 45.445,41 28.313,42 26.477,44 6}
{0 CHEMBL229236,1 7.059,2 48.8,3 46.3,4 0.985,5 1.108,6 0.691,7 0.646,8 289.4,9 2.4,10 18,11 41,13 18,14 24,16 43,17 20,20 18,21 2,24 19,25 2,28 1,29 1,32 22,35 2.4,36 0.116,37 5,38 33,39 40.382,40 45.445,41 28.313,42 26.477,44 6}
{0 CHEMBL229237,1 7.01,2 48.9,3 46.7,4 0.984,5 1.108,6 0.691,7 0.645,8 315.44,9 2.2,10 18,11 45,13 18,14 27,16 48,17 22,20 18,21 4,24 21,25 2,28 1,29 1,32 24,35 2.2,36 0.063,37 3,38 36,39 44.265,40 49.86,41 31.074,42 29.004,44 6}
{0 CHEMBL229288,1 11.1,2 43.8,3 43.8,4 1,5 1.111,6 0.747,7 0.67,8 355.19,9 3.1,10 12,11 32,13 12,14 19,16 33,17 14,20 12,21 2,24 14,25 4,26 1,27 1,28 1,29 2,32 18,34 1,35 6.3,36 0.121,37 4,38 25,39 32.011,40 35.544,41 23.904,42 21.455,43 3.1,44 6.503}
{0 CHEMBL229289,1 6.881,2 45.2,3 48.4,4 0.988,5 1.117,6 0.671,7 0.627,8 213.3,9 3.2,10 12,11 31,13 12,14 17,16 32,17 14,20 12,21 2,24 15,25 2,28 1,29 1,32 16,35 3.2,36 0.125,37 4,38 23,39 30.614,40 34.614,41 20.79,42 19.424,44 6.377}
{0 CHEMBL229295,1 6.523,2 43.2,3 51.4,4 0.983,5 1.12,6 0.657,7 0.607,8 241.36,9 2.7,10 12,11 37,13 12,14 19,16 38,17 16,20 12,21 4,24 19,25 2,28 1,29 1,32 18,35 2.7,36 0.105,37 4,38 25,39 36.382,40 41.445,41 24.313,42 22.477,44 6}
{0 CHEMBL229296,1 6.686,2 44.1,3 50,4 0.985,5 1.119,6 0.663,7 0.616,8 227.33,9 2.9,10 12,11 34,13 12,14 18,16 35,17 15,20 12,21 3,24 17,25 2,28 1,29 1,32 17,35 2.9,36 0.114,37 4,38 24,39 33.498,40 38.029,41 22.551,42 20.951,44 6}
{0 CHEMBL229636,1 6.896,2 47.7,3 47.7,4 0.983,5 1.11,6 0.684,7 0.636,8 303.43,9 2.3,10 18,11 44,13 18,14 25,16 46,17 21,20 18,21 3,24 21,25 2,28 1,29 1,32 23,35 2.3,36 0.13,37 6,38 34,39 43.265,40 48.86,41 30.074,42 28.004,44 6}
{0 CHEMBL229686,1 7.289,2 51.2,3 44.2,4 0.986,5 1.103,6 0.705,7 0.662,8 313.42,9 2.3,10 18,11 43,13 19,14 26,16 45,17 22,19 2,20 18,21 2,24 19,25 2,28 1,29 1,32 24,33 1,35 2.3,36 0.089,37 4,38 37,39 42.382,40 47.445,41 30.313,42 28.477,44 6}
{0 CHEMBL229687,1 7.118,2 48.6,3 45.9,4 0.986,5 1.109,6 0.691,7 0.647,8 263.36,9 2.7,10 17,11 37,13 17,14 22,16 39,17 18,20 16,21 2,24 17,25 2,28 1,29 1,32 20,35 2.7,36 0.103,37 4,38 30.5,39 36.498,40 41.029,41 25.551,42 23.951,44 6.996}
{0 CHEMBL229688,1 7.118,2 48.6,3 45.9,4 0.986,5 1.109,6 0.691,7 0.647,8 263.36,9 2.7,10 17,11 37,13 17,14 22,16 39,17 18,20 16,21 2,24 17,25 2,28 1,29 1,32 20,35 2.7,36 0.077,37 3,38 30.5,39 36.498,40 41.029,41 25.551,42 23.951,44 6}
{0 CHEMBL229958,1 6.935,2 47.5,3 47.5,4 0.985,5 1.111,6 0.683,7 0.637,8 277.39,9 2.5,10 17,11 40,13 17,14 23,16 42,17 19,20 16,21 3,24 19,25 2,28 1,29 1,32 21,35 2.5,36 0.095,37 4,38 31.5,39 39.382,40 44.445,41 27.313,42 25.477,44 6}
{0 CHEMBL229959,1 7.223,2 51.1,3 44.7,4 0.984,5 1.103,6 0.704,7 0.66,8 339.46,9 2.1,10 23,11 47,13 23,14 29,16 50,17 24,20 22,21 2,24 21,25 2,28 1,29 1,32 26,35 2.1,36 0.1,37 5,38 40.5,39 46.265,40 51.86,41 33.074,42 31.004,44 6}
{0 CHEMBL312689,1 6.881,2 45.2,3 48.4,4 0.988,5 1.117,6 0.671,7 0.627,8 213.3,9 3.2,10 12,11 31,13 12,14 17,16 32,17 14,20 12,21 2,24 15,25 2,28 1,29 1,32 16,35 3.2,36 0.125,37 4,38 23,39 30.614,40 34.614,41 20.79,42 19.424,44 6.529}
{0 CHEMBL371324,1 6.266,2 41.9,3 53.5,4 0.98,5 1.123,6 0.647,7 0.594,8 269.42,9 2.3,10 12,11 43,13 12,14 21,16 44,17 18,20 12,21 6,24 23,25 2,28 1,29 1,32 20,35 2.3,36 0.182,37 8,38 27,39 42.149,40 48.275,41 27.836,42 25.531,44 6}
{0 CHEMBL372534,1 11.489,2 45.2,3 41.9,4 1.008,5 1.105,6 0.753,7 0.682,8 356.17,10 12,11 31,13 12,14 19,16 32,17 14,20 12,21 2,24 13,25 4,26 1,27 1,29 3,32 18,34 1,35 9.7,36 0.125,37 4,38 25,39 31.236,40 34.255,41 23.352,42 21.149,43 3.2,44 6}
{0 CHEMBL375467,1 6.952,2 42.9,3 48.6,4 0.995,5 1.121,6 0.657,7 0.619,8 243.33,9 2.9,10 12,11 35,13 12,14 19,16 36,17 15,20 12,21 3,24 17,25 3,28 1,29 2,32 18,35 5.7,36 0.167,37 6,38 25,39 34.825,40 39.239,41 23.006,42 21.665,44 6.364}
{0 CHEMBL375468,1 6.773,2 42.1,3 50,4 0.992,5 1.122,6 0.652,7 0.61,8 257.36,9 2.6,10 12,11 38,13 12,14 20,16 39,17 16,20 12,21 4,24 19,25 3,28 1,29 2,32 19,35 5.3,36 0.179,37 7,38 26,39 37.709,40 42.654,41 24.767,42 23.192,44 7.18}
{0 CHEMBL375469,1 6.936,2 41.5,3 48.8,4 0.995,5 1.126,6 0.653,7 0.615,8 284.39,9 4.9,10 12,11 41,13 13,14 22,16 42,17 17,20 13,21 4,22 1,24 20,25 4,28 2,29 2,32 21,35 4.9,36 0.143,37 6,38 29,39 40.811,40 46.152,41 26.773,42 25.214,44 6}
{0 CHEMBL375470,1 6.53,2 40,3 52,4 0.989,5 1.128,6 0.641,7 0.596,8 326.48,9 4,10 12,11 50,13 13,14 25,16 51,17 20,20 13,21 7,22 1,24 26,25 4,28 2,29 2,32 24,35 4,36 0.176,37 9,38 32,39 49.461,40 56.398,41 32.057,42 29.794,44 6.963}
{0 CHEMBL381288,1 6.385,2 42.5,3 52.5,4 0.982,5 1.121,6 0.652,7 0.6,8 255.39,9 2.5,10 12,11 40,13 12,14 20,16 41,17 17,20 12,21 5,24 21,25 2,28 1,29 1,32 19,35 2.5,36 0.171,37 7,38 26,39 39.265,40 44.86,41 26.074,42 24.004,44 6.991}
{0 CHEMBL381531,1 18.968,2 43.8,3 37.5,4 1.005,5 1.093,6 0.913,7 0.753,8 606.97,9 3.1,10 12,11 32,13 12,14 21,16 33,17 14,20 12,21 2,24 12,25 6,26 3,27 3,28 1,29 2,32 20,34 3,35 6.3,36 0.121,37 4,38 27,39 32.149,40 34.985,41 29.222,42 24.089,43 9.4,44 6}
{0 CHEMBL382580,1 10.918,2 44.1,3 44.1,4 1.002,5 1.12,6 0.74,7 0.666,8 371.21,9 2.9,10 12,11 34,13 12,14 20,16 35,17 15,20 12,21 3,23 1,24 15,25 4,26 1,27 1,28 1,29 1,32 19,34 2,35 2.9,36 0.143,37 5,38 26,39 34.08,40 38.09,41 25.148,42 22.651,43 5.9,44 7.488}
{0 CHEMBL383495,1 15.034,2 43.8,3 40.6,4 1.002,5 1.102,6 0.83,7 0.712,8 481.08,9 3.1,10 12,11 32,13 12,14 20,16 33,17 14,20 12,21 2,24 13,25 5,26 2,27 2,28 1,29 2,32 19,34 2,35 6.3,36 0.121,37 4,38 26,39 32.08,40 35.265,41 26.563,42 22.772,43 6.3,44 6}
{0 CHEMBL388953,1 7.01,2 48.9,3 46.7,4 0.984,5 1.108,6 0.691,7 0.645,8 315.44,9 2.2,10 18,11 45,13 18,14 27,16 48,17 22,20 18,21 4,24 21,25 2,28 1,29 1,32 24,35 2.2,36 0.063,37 3,38 36,39 44.265,40 49.86,41 31.074,42 29.004,44 6}
{0 CHEMBL425035,1 10.942,2 45.2,3 45.2,4 0.99,5 1.108,6 0.756,7 0.669,8 339.19,9 3.2,10 12,11 31,13 12,14 18,16 32,17 14,20 12,21 2,24 14,25 3,26 1,27 1,28 1,29 1,32 17,34 1,35 3.2,36 0.125,37 4,38 24,39 30.683,40 34.335,41 23.449,42 20.741,43 3.2,44 7.456}
{0 CHEMBL425223,1 11.384,2 43.2,3 40.5,4 1.027,5 1.14,6 0.724,7 0.674,8 421.22,9 2.7,10 12,11 37,13 12,14 23,16 38,17 16,20 12,21 4,23 3,24 15,25 6,26 1,27 1,28 1,29 1,32 22,34 4,35 2.7,36 0.132,37 5,38 29,39 37.989,40 42.184,41 26.784,42 24.944,43 10.8,44 6.547}
{0 CHEMBL425398,1 9.926,2 43.2,3 48.6,4 0.985,5 1.113,6 0.729,7 0.643,8 367.25,9 2.7,10 12,11 37,13 12,14 20,16 38,17 16,20 12,21 4,24 18,25 3,26 1,27 1,28 1,29 1,32 19,34 1,35 2.7,36 0.158,37 6,38 26,39 36.451,40 41.165,41 26.972,42 23.794,43 2.7,44 6.975}
{0 CHEMBL425579,1 6.754,2 46.8,3 48.9,4 0.982,5 1.112,6 0.677,7 0.628,8 317.46,9 2.1,10 18,11 47,13 18,14 26,16 49,17 22,20 18,21 4,24 23,25 2,28 1,29 1,32 24,35 2.1,36 0.163,37 8,38 35,39 46.149,40 52.275,41 31.836,42 29.531,44 6}
{0 CHEMBL541905,1 7.192,2 48.5,3 45.5,4 0.988,5 1.11,6 0.691,7 0.649,8 237.32,9 3,10 12,11 33,13 13,14 19,16 34,17 16,19 2,20 12,21 2,24 15,25 2,28 1,29 1,32 18,33 1,35 3,36 0.118,37 4,38 27,39 32.614,40 36.614,41 22.79,42 21.424,44 6.032}
{0 CHEMBL612,1 5.88,2 39.1,3 56.5,4 0.974,5 1.13,6 0.634,7 0.573,8 135.23,9 4.3,10 6,11 23,13 6,14 10,16 23,17 9,20 6,21 3,24 13,25 1,28 1,32 10,36 0.087,37 2,38 13,39 22.403,40 25.99,41 14.574,42 13.182,44 6.678}
