{
  "data_features": {
    "feature": [
      {
        "data_type": "nominal",
        "index": "0",
        "is_ignore": "false",
        "is_row_identifier": "true",
        "is_target": "false",
        "name": "molecule_id",
        "nominal_value": [
          "CHEMBL104",
          "CHEMBL1093137",
          "CHEMBL1162935",
          "CHEMBL139",
          "CHEMBL1688888",
          "CHEMBL1688889",
          "CHEMBL182361",
          "CHEMBL183061",
          "CHEMBL183103",
          "CHEMBL183222",
          "CHEMBL183425",
          "CHEMBL183537",
          "CHEMBL183561",
          "CHEMBL183819",
          "CHEMBL184147",
          "CHEMBL184185",
          "CHEMBL184318",
          "CHEMBL184319",
          "CHEMBL184401",
          "CHEMBL184583",
          "CHEMBL184637",
          "CHEMBL184882",
          "CHEMBL185176",
          "CHEMBL185259",
          "CHEMBL185268",
          "CHEMBL185476",
          "CHEMBL185610",
          "CHEMBL191413",
          "CHEMBL195433",
          "CHEMBL2018969",
          "CHEMBL216602",
          "CHEMBL216603",
          "CHEMBL216981",
          "CHEMBL2178579",
          "CHEMBL218115",
          "CHEMBL218334",
          "CHEMBL218387",
          "CHEMBL218486",
          "CHEMBL218665",
          "CHEMBL218744",
          "CHEMBL218964",
          "CHEMBL220182",
          "CHEMBL220797",
          "CHEMBL220860",
          "CHEMBL221039",
          "CHEMBL221481",
          "CHEMBL222075",
          "CHEMBL22587",
          "CHEMBL231924",
          "CHEMBL2324200",
          "CHEMBL233346",
          "CHEMBL234186",
          "CHEMBL239767",
          "CHEMBL245500",
          "CHEMBL245501",
          "CHEMBL245697",
          "CHEMBL245699",
          "CHEMBL246106",
          "CHEMBL246107",
          "CHEMBL246108",
          "CHEMBL246318",
          "CHEMBL246731",
          "CHEMBL246733",
          "CHEMBL246941",
          "CHEMBL247149",
          "CHEMBL247150",
          "CHEMBL247356",
          "CHEMBL24912",
          "CHEMBL250689",
          "CHEMBL251811",
          "CHEMBL251890",
          "CHEMBL252288",
          "CHEMBL252289",
          "CHEMBL252697",
          "CHEMBL252698",
          "CHEMBL252851",
          "CHEMBL252852",
          "CHEMBL252896",
          "CHEMBL252897",
          "CHEMBL252898",
          "CHEMBL252911",
          "CHEMBL253050",
          "CHEMBL253051",
          "CHEMBL253052",
          "CHEMBL253104",
          "CHEMBL253304",
          "CHEMBL253305",
          "CHEMBL253306",
          "CHEMBL253495",
          "CHEMBL253496",
          "CHEMBL253497",
          "CHEMBL253498",
          "CHEMBL253499",
          "CHEMBL253504",
          "CHEMBL253506",
          "CHEMBL253702",
          "CHEMBL253705",
          "CHEMBL253706",
          "CHEMBL253707",
          "CHEMBL253714",
          "CHEMBL253921",
          "CHEMBL253922",
          "CHEMBL253927",
          "CHEMBL254370",
          "CHEMBL254516",
          "CHEMBL254942",
          "CHEMBL254943",
          "CHEMBL25573",
          "CHEMBL26830",
          "CHEMBL269707",
          "CHEMBL27446",
          "CHEMBL27863",
          "CHEMBL28009",
          "CHEMBL280711",
          "CHEMBL283736",
          "CHEMBL359670",
          "CHEMBL361312",
          "CHEMBL363746",
          "CHEMBL363840",
          "CHEMBL364397",
          "CHEMBL365008",
          "CHEMBL365671",
          "CHEMBL373522",
          "CHEMBL375393",
          "CHEMBL376414",
          "CHEMBL376540",
          "CHEMBL376621",
          "CHEMBL384889",
          "CHEMBL385715",
          "CHEMBL386072",
          "CHEMBL386505",
          "CHEMBL387136",
          "CHEMBL393047",
          "CHEMBL393253",
          "CHEMBL393900",
          "CHEMBL394899",
          "CHEMBL396573",
          "CHEMBL399203",
          "CHEMBL401512",
          "CHEMBL401893",
          "CHEMBL401894",
          "CHEMBL401938",
          "CHEMBL401939",
          "CHEMBL401940",
          "CHEMBL402076",
          "CHEMBL402144",
          "CHEMBL402952",
          "CHEMBL403023",
          "CHEMBL403206",
          "CHEMBL403547",
          "CHEMBL403936",
          "CHEMBL404059",
          "CHEMBL404060",
          "CHEMBL404249",
          "CHEMBL404250",
          "CHEMBL404381",
          "CHEMBL404490",
          "CHEMBL413959",
          "CHEMBL415446",
          "CHEMBL425882",
          "CHEMBL425985",
          "CHEMBL427888",
          "CHEMBL430116",
          "CHEMBL442799",
          "CHEMBL443583",
          "CHEMBL451438",
          "CHEMBL455209",
          "CHEMBL455430",
          "CHEMBL455431",
          "CHEMBL461816",
          "CHEMBL462024",
          "CHEMBL462155",
          "CHEMBL462156",
          "CHEMBL462331",
          "CHEMBL464012",
          "CHEMBL464013",
          "CHEMBL464301",
          "CHEMBL464302",
          "CHEMBL464509",
          "CHEMBL472749",
          "CHEMBL473145",
          "CHEMBL473959",
          "CHEMBL490688",
          "CHEMBL490689",
          "CHEMBL491134",
          "CHEMBL491135",
          "CHEMBL491330",
          "CHEMBL491487",
          "CHEMBL491506",
          "CHEMBL496452",
          "CHEMBL50",
          "CHEMBL501985",
          "CHEMBL508938",
          "CHEMBL510437",
          "CHEMBL514001",
          "CHEMBL515262",
          "CHEMBL516184",
          "CHEMBL517430",
          "CHEMBL518030",
          "CHEMBL518201",
          "CHEMBL518355",
          "CHEMBL518696",
          "CHEMBL518802",
          "CHEMBL518857",
          "CHEMBL518924",
          "CHEMBL522959",
          "CHEMBL523437",
          "CHEMBL523645",
          "CHEMBL523769",
          "CHEMBL523807",
          "CHEMBL523984",
          "CHEMBL535818",
          "CHEMBL550130",
          "CHEMBL550880",
          "CHEMBL550945",
          "CHEMBL556656",
          "CHEMBL556862",
          "CHEMBL561812",
          "CHEMBL562286",
          "CHEMBL562781",
          "CHEMBL562950",
          "CHEMBL563875",
          "CHEMBL569210",
          "CHEMBL570042",
          "CHEMBL570043",
          "CHEMBL571141",
          "CHEMBL576886",
          "CHEMBL577075",
          "CHEMBL578807",
          "CHEMBL585928"
        ],
        "number_of_missing_values": "0"
      },
      {
        "data_type": "numeric",
        "index": "1",
        "is_ignore": "false",
        "is_row_identifier": "false",
        "is_target": "false",
        "name": "FCFP4_1024b908",
        "number_of_missing_values": "0"
      },
      {
        "data_type": "numeric",
        "index": "2",
        "is_ignore": "false",
        "is_row_identifier": "false",
        "is_target": "false",
        "name": "FCFP4_1024b246",
        "number_of_missing_values": "0"
      },
      {
        "data_type": "numeric",
        "index": "3",
        "is_ignore": "false",
        "is_row_identifier": "false",
        "is_target": "false",
        "name": "FCFP4_1024b490",
        "number_of_missing_values": "0"
      },
      {
        "data_type": "numeric",
        "index": "4",
        "is_ignore": "false",
        "is_row_identifier": "false",
        "is_target": "false",
        "name": "FCFP4_1024b620",
        "number_of_missing_values": "0"
      },
      {
        "data_type": "numeric",
        "index": "5",
        "is_ignore": "false",
        "is_row_identifier": "false",
        "is_target": "false",
        "name": "FCFP4_1024b804",
        "number_of_missing_values": "0"
      },
      {
        "data_type": "numeric",
        "index": "6",
        "is_ignore": "false",
        "is_row_identifier": "false",
        "is_target": "false",
        "name": "FCFP4_1024b942",
        "number_of_missing_values": "0"
      },
      {
        "data_type": "numeric",
        "index": "7",
        "is_ignore": "false",
        "is_row_identifier": "false",
        "is_target": "false",
        "name": "FCFP4_1024b494",
        "number_of_missing_values": "0"
      },
      {
        "data_type": "numeric",
        "index": "8",
        "is_ignore": "false",
        "is_row_identifier": "false",
        "is_target": "false",
        "name": "FCFP4_1024b731",
        "number_of_missing_values": "0"
      },
      {
        "data_type": "numeric",
        "index": "9",
        "is_ignore": "false",
        "is_row_identifier": "false",
        "is_target": "false",
        "name": "FCFP4_1024b8",
        "number_of_missing_values": "0"
      },
      {
        "data_type": "numeric",
        "index": "10",
        "is_ignore": "false",
        "is_row_identifier": "false",
        "is_target": "false",
        "name": "FCFP4_1024b28",
        "number_of_missing_values": "0"
      },
      {
        "data_type": "numeric",
        "index": "11",
        "is_ignore": "false",
        "is_row_identifier": "false",
        "is_target": "false",
        "name": "FCFP4_1024b412",
        "number_of_missing_values": "0"
      },
      {
        "data_type": "numeric",
        "index": "12",
        "is_ignore": "false",
        "is_row_identifier": "false",
        "is_target": "false",
        "name": "FCFP4_1024b698",
        "number_of_missing_values": "0"
      },
      {
        "data_type": "numeric",
        "index": "13",
        "is_ignore": "false",
        "is_row_identifier": "false",
        "is_target": "false",
        "name": "FCFP4_1024b888",
        "number_of_missing_values": "0"
      },
      {
        "data_type": "numeric",
        "index": "14",
        "is_ignore": "false",
        "is_row_identifier": "false",
        "is_target": "false",
        "name": "FCFP4_1024b262",
        "number_of_missing_values": "0"
      },
      {
        "data_type": "numeric",
        "index": "15",
        "is_ignore": "false",
        "is_row_identifier": "false",
        "is_target": "false",
        "name": "FCFP4_1024b847",
        "number_of_missing_values": "0"
      },
      {
        "data_type": "numeric",
        "index": "16",
        "is_ignore": "false",
        "is_row_identifier": "false",
        "is_target": "false",
        "name": "FCFP4_1024b826",
        "number_of_missing_values": "0"
      },
      {
        "data_type": "numeric",
        "index": "17",
        "is_ignore": "false",
        "is_row_identifier": "false",
        "is_target": "false",
        "name": "FCFP4_1024b986",
        "number_of_missing_values": "0"
      },
      {
        "data_type": "numeric",
        "index": "18",
        "is_ignore": "false",
        "is_row_identifier": "false",
        "is_target": "false",
        "name": "FCFP4_1024b25",
        "number_of_missing_values": "0"
      },
      {
        "data_type": "numeric",
        "index": "19",
        "is_ignore": "false",
        "is_row_identifier": "false",
        "is_target": "false",
        "name": "FCFP4_1024b971",
        "number_of_missing_values": "0"
      },
      {
        "data_type": "numeric",
        "index": "20",
        "is_ignore": "false",
        "is_row_identifier": "false",
        "is_target": "false",
        "name": "FCFP4_1024b639",
        "number_of_missing_values": "0"
      },
      {
        "data_type": "numeric",
        "index": "21",
        "is_ignore": "false",
        "is_row_identifier": "false",
        "is_target": "false",
        "name": "FCFP4_1024b360",
        "number_of_missing_values": "0"
      },
      {
        "data_type": "numeric",
        "index": "22",
        "is_ignore": "false",
        "is_row_identifier": "false",
        "is_target": "false",
        "name": "FCFP4_1024b1008",
        "number_of_missing_values": "0"
      },
      {
        "data_type": "numeric",
        "index": "23",
        "is_ignore": "false",
        "is_row_identifier": "false",
        "is_target": "false",
        "name": "FCFP4_1024b486",
        "number_of_missing_values": "0"
      },
      {
        "data_type": "numeric",
        "index": "24",
        "is_ignore": "false",
        "is_row_identifier": "false",
        "is_target": "false",
        "name": "FCFP4_1024b891",
        "number_of_missing_values": "0"
      },
      {
        "data_type": "numeric",
        "index": "25",
        "is_ignore": "false",
        "is_row_identifier": "false",
        "is_target": "false",
        "name": "FCFP4_1024b6",
        "number_of_missing_values": "0"
      },
      {
        "data_type": "numeric",
        "index": "26",
        "is_ignore": "false",
        "is_row_identifier": "false",
        "is_target": "false",
        "name": "FCFP4_1024b443",
        "number_of_missing_values": "0"
      },
      {
        "data_type": "numeric",
        "index": "27",
        "is_ignore": "false",
        "is_row_identifier": "false",
        "is_target": "false",
        "name": "FCFP4_1024b271",
        "number_of_missing_values": "0"
      },
      {
        "data_type": "numeric",
        "index": "28",
        "is_ignore": "false",
        "is_row_identifier": "false",
        "is_target": "false",
        "name": "FCFP4_1024b925",
        "number_of_missing_values": "0"
      },
      {
        "data_type": "numeric",
        "index": "29",
        "is_ignore": "false",
        "is_row_identifier": "false",
        "is_target": "false",
        "name": "FCFP4_1024b139",
        "number_of_missing_values": "0"
      },
      {
        "data_type": "numeric",
        "index": "30",
        "is_ignore": "false",
        "is_row_identifier": "false",
        "is_target": "false",
        "name": "FCFP4_1024b162",
        "number_of_missing_values": "0"
      },
      {
        "data_type": "numeric",
        "index": "31",
        "is_ignore": "false",
        "is_row_identifier": "false",
        "is_target": "false",
        "name": "FCFP4_1024b330",
        "number_of_missing_values": "0"
      },
      {
        "data_type": "numeric",
        "index": "32",
        "is_ignore": "false",
        "is_row_identifier": "false",
        "is_target": "false",
        "name": "FCFP4_1024b180",
        "number_of_missing_values": "0"
      },
      {
        "data_type": "numeric",
        "index": "33",
        "is_ignore": "false",
        "is_row_identifier": "false",
        "is_target": "false",
        "name": "FCFP4_1024b649",
        "number_of_missing_values": "0"
      },
      {
        "data_type": "numeric",
        "index": "34",
        "is_ignore": "false",
        "is_row_identifier": "false",
        "is_target": "false",
        "name": "FCFP4_1024b521",
        "number_of_missing_values": "0"
      },
      {
        "data_type": "numeric",
        "index": "35",
        "is_ignore": "false",
        "is_row_identifier": "false",
        "is_target": "false",
        "name": "FCFP4_1024b887",
        "number_of_missing_values": "0"
      },
      {
        "data_type": "numeric",
        "index": "36",
        "is_ignore": "false",
        "is_row_identifier": "false",
        "is_target": "false",
        "name": "FCFP4_1024b317",
        "number_of_missing_values": "0"
      },
      {
        "data_type": "numeric",
        "index": "37",
        "is_ignore": "false",
        "is_row_identifier": "false",
        "is_target": "false",
        "name": "FCFP4_1024b889",
        "number_of_missing_values": "0"
      },
      {
        "data_type": "numeric",
        "index": "38",
        "is_ignore": "false",
        "is_row_identifier": "false",
        "is_target": "false",
        "name": "FCFP4_1024b206",
        "number_of_missing_values": "0"
      },
      {
        "data_type": "numeric",
        "index": "39",
        "is_ignore": "false",
        "is_row_identifier": "false",
        "is_target": "false",
        "name": "FCFP4_1024b635",
        "number_of_missing_values": "0"
      },
      {
        "data_type": "numeric",
        "index": "40",
        "is_ignore": "false",
        "is_row_identifier": "false",
        "is_target": "false",
        "name": "FCFP4_1024b290",
        "number_of_missing_values": "0"
      },
      {
        "data_type": "numeric",
        "index": "41",
        "is_ignore": "false",
        "is_row_identifier": "false",
        "is_target": "false",
        "name": "FCFP4_1024b790",
        "number_of_missing_values": "0"
      },
      {
        "data_type": "numeric",
        "index": "42",
        "is_ignore": "false",
        "is_row_identifier": "false",
        "is_target": "false",
        "name": "FCFP4_1024b294",
        "number_of_missing_values": "0"
      },
      {
        "data_type": "numeric",
        "index": "43",
        "is_ignore": "false",
        "is_row_identifier": "false",
        "is_target": "false",
        "name": "FCFP4_1024b787",
        "number_of_missing_values": "0"
      },
      {
        "data_type": "numeric",
        "index": "44",
        "is_ignore": "false",
        "is_row_identifier": "false",
        "is_target": "false",
        "name": "FCFP4_1024b257",
        "number_of_missing_values": "0"
      },
      {
        "data_type": "numeric",
        "index": "45",
        "is_ignore": "false",
        "is_row_identifier": "false",
        "is_target": "false",
        "name": "FCFP4_1024b462",
        "number_of_missing_values": "0"
      },
      {
        "data_type": "numeric",
        "index": "46",
        "is_ignore": "false",
        "is_row_identifier": "false",
        "is_target": "false",
        "name": "FCFP4_1024b500",
        "number_of_missing_values": "0"
      },
      {
        "data_type": "numeric",
        "index": "47",
        "is_ignore": "false",
        "is_row_identifier": "false",
        "is_target": "false",
        "name": "FCFP4_1024b604",
        "number_of_missing_values": "0"
      },
      {
        "data_type": "numeric",
        "index": "48",
        "is_ignore": "false",
        "is_row_identifier": "false",
        "is_target": "false",
        "name": "FCFP4_1024b179",
        "number_of_missing_values": "0"
      },
      {
        "data_type": "numeric",
        "index": "49",
        "is_ignore": "false",
        "is_row_identifier": "false",
        "is_target": "false",
        "name": "FCFP4_1024b553",
        "number_of_missing_values": "0"
      },
      {
        "data_type": "numeric",
        "index": "50",
        "is_ignore": "false",
        "is_row_identifier": "false",
        "is_target": "false",
        "name": "FCFP4_1024b252",
        "number_of_missing_values": "0"
      },
      {
        "data_type": "numeric",
        "index": "51",
        "is_ignore": "false",
        "is_row_identifier": "false",
        "is_target": "false",
        "name": "FCFP4_1024b203",
        "number_of_missing_values": "0"
      },
      {
        "data_type": "numeric",
        "index": "52",
        "is_ignore": "false",
        "is_row_identifier": "false",
        "is_target": "true",
        "name": "pXC50",
        "number_of_missing_values": "0"
      }
    ]
  }
}