{
  "data_qualities": {
    "quality": [
      {
        "name": "AutoCorrelation",
        "value": "-0.190333333333333"
      },
      {
        "name": "CfsSubsetEval_DecisionStumpAUC",
        "value": []
      },
      {
        "name": "CfsSubsetEval_DecisionStumpErrRate",
        "value": []
      },
      {
        "name": "CfsSubsetEval_DecisionStumpKappa",
        "value": []
      },
      {
        "name": "CfsSubsetEval_NaiveBayesAUC",
        "value": []
      },
      {
        "name": "CfsSubsetEval_NaiveBayesErrRate",
        "value": []
      },
      {
        "name": "CfsSubsetEval_NaiveBayesKappa",
        "value": []
      },
      {
        "name": "CfsSubsetEval_kNN1NAUC",
        "value": []
      },
      {
        "name": "CfsSubsetEval_kNN1NErrRate",
        "value": []
      },
      {
        "name": "CfsSubsetEval_kNN1NKappa",
        "value": []
      },
      {
        "name": "ClassEntropy",
        "value": []
      },
      {
        "name": "DecisionStumpAUC",
        "value": []
      },
      {
        "name": "DecisionStumpErrRate",
        "value": []
      },
      {
        "name": "DecisionStumpKappa",
        "value": []
      },
      {
        "name": "Dimensionality",
        "value": "46.63636363636363"
      },
      {
        "name": "EquivalentNumberOfAtts",
        "value": []
      },
      {
        "name": "J48.00001.AUC",
        "value": []
      },
      {
        "name": "J48.00001.ErrRate",
        "value": []
      },
      {
        "name": "J48.00001.Kappa",
        "value": []
      },
      {
        "name": "J48.0001.AUC",
        "value": []
      },
      {
        "name": "J48.0001.ErrRate",
        "value": []
      },
      {
        "name": "J48.0001.Kappa",
        "value": []
      },
      {
        "name": "J48.001.AUC",
        "value": []
      },
      {
        "name": "J48.001.ErrRate",
        "value": []
      },
      {
        "name": "J48.001.Kappa",
        "value": []
      },
      {
        "name": "MajorityClassPercentage",
        "value": []
      },
      {
        "name": "MajorityClassSize",
        "value": []
      },
      {
        "name": "MaxAttributeEntropy",
        "value": []
      },
      {
        "name": "MaxKurtosisOfNumericAtts",
        "value": "22.000000000000014"
      },
      {
        "name": "MaxMeansOfNumericAtts",
        "value": "7.6815454545454545"
      },
      {
        "name": "MaxMutualInformation",
        "value": []
      },
      {
        "name": "MaxNominalAttDistinctValues",
        "value": []
      },
      {
        "name": "MaxSkewnessOfNumericAtts",
        "value": "4.69041575982343"
      },
      {
        "name": "MaxStdDevOfNumericAtts",
        "value": "1.2111752154818072"
      },
      {
        "name": "MeanAttributeEntropy",
        "value": []
      },
      {
        "name": "MeanKurtosisOfNumericAtts",
        "value": "11.95055657996281"
      },
      {
        "name": "MeanMeansOfNumericAtts",
        "value": "0.05973365853658544"
      },
      {
        "name": "MeanMutualInformation",
        "value": []
      },
      {
        "name": "MeanNoiseToSignalRatio",
        "value": []
      },
      {
        "name": "MeanNominalAttDistinctValues",
        "value": []
      },
      {
        "name": "MeanSkewnessOfNumericAtts",
        "value": "2.8955116458087797"
      },
      {
        "name": "MeanStdDevOfNumericAtts",
        "value": "0.04415161950926479"
      },
      {
        "name": "MinAttributeEntropy",
        "value": []
      },
      {
        "name": "MinKurtosisOfNumericAtts",
        "value": "-2.2105263157894735"
      },
      {
        "name": "MinMeansOfNumericAtts",
        "value": "0.0"
      },
      {
        "name": "MinMutualInformation",
        "value": []
      },
      {
        "name": "MinNominalAttDistinctValues",
        "value": []
      },
      {
        "name": "MinSkewnessOfNumericAtts",
        "value": "-3.058676184233956"
      },
      {
        "name": "MinStdDevOfNumericAtts",
        "value": "0.0"
      },
      {
        "name": "MinorityClassPercentage",
        "value": []
      },
      {
        "name": "MinorityClassSize",
        "value": []
      },
      {
        "name": "NaiveBayesAUC",
        "value": []
      },
      {
        "name": "NaiveBayesErrRate",
        "value": []
      },
      {
        "name": "NaiveBayesKappa",
        "value": []
      },
      {
        "name": "NumberOfBinaryFeatures",
        "value": "0.0"
      },
      {
        "name": "NumberOfClasses",
        "value": "0.0"
      },
      {
        "name": "NumberOfFeatures",
        "value": "1026.0"
      },
      {
        "name": "NumberOfInstances",
        "value": "22.0"
      },
      {
        "name": "NumberOfInstancesWithMissingValues",
        "value": "0.0"
      },
      {
        "name": "NumberOfMissingValues",
        "value": "0.0"
      },
      {
        "name": "NumberOfNumericFeatures",
        "value": "1025.0"
      },
      {
        "name": "NumberOfSymbolicFeatures",
        "value": "1.0"
      },
      {
        "name": "PercentageOfBinaryFeatures",
        "value": "0.0"
      },
      {
        "name": "PercentageOfInstancesWithMissingValues",
        "value": "0.0"
      },
      {
        "name": "PercentageOfMissingValues",
        "value": "0.0"
      },
      {
        "name": "PercentageOfNumericFeatures",
        "value": "99.90253411306043"
      },
      {
        "name": "PercentageOfSymbolicFeatures",
        "value": "0.09746588693957114"
      },
      {
        "name": "Quartile1AttributeEntropy",
        "value": []
      },
      {
        "name": "Quartile1KurtosisOfNumericAtts",
        "value": "1.2495614035087756"
      },
      {
        "name": "Quartile1MeansOfNumericAtts",
        "value": "0.0"
      },
      {
        "name": "Quartile1MutualInformation",
        "value": []
      },
      {
        "name": "Quartile1SkewnessOfNumericAtts",
        "value": "1.6795906221075745"
      },
      {
        "name": "Quartile1StdDevOfNumericAtts",
        "value": "0.0"
      },
      {
        "name": "Quartile2AttributeEntropy",
        "value": []
      },
      {
        "name": "Quartile2KurtosisOfNumericAtts",
        "value": "8.084999999999999"
      },
      {
        "name": "Quartile2MeansOfNumericAtts",
        "value": "0.0"
      },
      {
        "name": "Quartile2MutualInformation",
        "value": []
      },
      {
        "name": "Quartile2SkewnessOfNumericAtts",
        "value": "3.0586761842339603"
      },
      {
        "name": "Quartile2StdDevOfNumericAtts",
        "value": "0.0"
      },
      {
        "name": "Quartile3AttributeEntropy",
        "value": []
      },
      {
        "name": "Quartile3KurtosisOfNumericAtts",
        "value": "22.0"
      },
      {
        "name": "Quartile3MeansOfNumericAtts",
        "value": "0.0"
      },
      {
        "name": "Quartile3MutualInformation",
        "value": []
      },
      {
        "name": "Quartile3SkewnessOfNumericAtts",
        "value": "4.690415759823421"
      },
      {
        "name": "Quartile3StdDevOfNumericAtts",
        "value": "0.0"
      },
      {
        "name": "REPTreeDepth1AUC",
        "value": []
      },
      {
        "name": "REPTreeDepth1ErrRate",
        "value": []
      },
      {
        "name": "REPTreeDepth1Kappa",
        "value": []
      },
      {
        "name": "REPTreeDepth2AUC",
        "value": []
      },
      {
        "name": "REPTreeDepth2ErrRate",
        "value": []
      },
      {
        "name": "REPTreeDepth2Kappa",
        "value": []
      },
      {
        "name": "REPTreeDepth3AUC",
        "value": []
      },
      {
        "name": "REPTreeDepth3ErrRate",
        "value": []
      },
      {
        "name": "REPTreeDepth3Kappa",
        "value": []
      },
      {
        "name": "RandomTreeDepth1AUC",
        "value": []
      },
      {
        "name": "RandomTreeDepth1ErrRate",
        "value": []
      },
      {
        "name": "RandomTreeDepth1Kappa",
        "value": []
      },
      {
        "name": "RandomTreeDepth2AUC",
        "value": []
      },
      {
        "name": "RandomTreeDepth2ErrRate",
        "value": []
      },
      {
        "name": "RandomTreeDepth2Kappa",
        "value": []
      },
      {
        "name": "RandomTreeDepth3AUC",
        "value": []
      },
      {
        "name": "RandomTreeDepth3ErrRate",
        "value": []
      },
      {
        "name": "RandomTreeDepth3Kappa",
        "value": []
      },
      {
        "name": "StdvNominalAttDistinctValues",
        "value": []
      },
      {
        "name": "kNN1NAUC",
        "value": []
      },
      {
        "name": "kNN1NErrRate",
        "value": []
      },
      {
        "name": "kNN1NKappa",
        "value": []
      }
    ]
  }
}