{
  "data_features": {
    "feature": [
      {
        "data_type": "nominal",
        "index": "0",
        "is_ignore": "false",
        "is_row_identifier": "true",
        "is_target": "false",
        "name": "molecule_id",
        "nominal_value": [
          "CHEMBL128000",
          "CHEMBL129451",
          "CHEMBL150",
          "CHEMBL151",
          "CHEMBL164",
          "CHEMBL1933858",
          "CHEMBL196818",
          "CHEMBL197111",
          "CHEMBL197274",
          "CHEMBL197322",
          "CHEMBL197474",
          "CHEMBL198781",
          "CHEMBL198782",
          "CHEMBL198831",
          "CHEMBL198886",
          "CHEMBL198887",
          "CHEMBL199081",
          "CHEMBL200308",
          "CHEMBL200322",
          "CHEMBL200379",
          "CHEMBL200450",
          "CHEMBL200492",
          "CHEMBL200514",
          "CHEMBL200533",
          "CHEMBL200585",
          "CHEMBL200609",
          "CHEMBL200658",
          "CHEMBL200871",
          "CHEMBL205054",
          "CHEMBL205096",
          "CHEMBL205554",
          "CHEMBL206178",
          "CHEMBL206263",
          "CHEMBL206315",
          "CHEMBL206531",
          "CHEMBL206664",
          "CHEMBL206712",
          "CHEMBL207048",
          "CHEMBL207152",
          "CHEMBL207640",
          "CHEMBL207817",
          "CHEMBL207818",
          "CHEMBL207819",
          "CHEMBL207884",
          "CHEMBL207902",
          "CHEMBL208218",
          "CHEMBL208377",
          "CHEMBL210276",
          "CHEMBL222215",
          "CHEMBL226052",
          "CHEMBL226156",
          "CHEMBL226157",
          "CHEMBL226187",
          "CHEMBL226812",
          "CHEMBL226813",
          "CHEMBL227191",
          "CHEMBL227243",
          "CHEMBL227299",
          "CHEMBL227300",
          "CHEMBL227534",
          "CHEMBL227535",
          "CHEMBL227536",
          "CHEMBL227563",
          "CHEMBL227591",
          "CHEMBL227592",
          "CHEMBL227593",
          "CHEMBL227618",
          "CHEMBL227619",
          "CHEMBL227620",
          "CHEMBL227647",
          "CHEMBL227675",
          "CHEMBL227820",
          "CHEMBL227873",
          "CHEMBL227874",
          "CHEMBL227929",
          "CHEMBL227930",
          "CHEMBL227981",
          "CHEMBL227982",
          "CHEMBL228039",
          "CHEMBL228040",
          "CHEMBL228041",
          "CHEMBL228097",
          "CHEMBL228098",
          "CHEMBL228099",
          "CHEMBL228100",
          "CHEMBL228154",
          "CHEMBL228189",
          "CHEMBL240808",
          "CHEMBL258523",
          "CHEMBL258569",
          "CHEMBL258736",
          "CHEMBL258737",
          "CHEMBL258772",
          "CHEMBL259403",
          "CHEMBL259734",
          "CHEMBL259880",
          "CHEMBL260061",
          "CHEMBL260168",
          "CHEMBL260375",
          "CHEMBL260585",
          "CHEMBL260600",
          "CHEMBL260753",
          "CHEMBL260978",
          "CHEMBL260979",
          "CHEMBL261144",
          "CHEMBL261521",
          "CHEMBL261708",
          "CHEMBL261709",
          "CHEMBL263896",
          "CHEMBL264899",
          "CHEMBL264938",
          "CHEMBL28",
          "CHEMBL28626",
          "CHEMBL297453",
          "CHEMBL31574",
          "CHEMBL36327",
          "CHEMBL370448",
          "CHEMBL370595",
          "CHEMBL372323",
          "CHEMBL374386",
          "CHEMBL374387",
          "CHEMBL376617",
          "CHEMBL376618",
          "CHEMBL377366",
          "CHEMBL377607",
          "CHEMBL377726",
          "CHEMBL378154",
          "CHEMBL379064",
          "CHEMBL380629",
          "CHEMBL380674",
          "CHEMBL381065",
          "CHEMBL381983",
          "CHEMBL383166",
          "CHEMBL388950",
          "CHEMBL388951",
          "CHEMBL389008",
          "CHEMBL389850",
          "CHEMBL390063",
          "CHEMBL390064",
          "CHEMBL390086",
          "CHEMBL390087",
          "CHEMBL390528",
          "CHEMBL397591",
          "CHEMBL405402",
          "CHEMBL405973",
          "CHEMBL408744",
          "CHEMBL425480",
          "CHEMBL428260",
          "CHEMBL428966",
          "CHEMBL436949",
          "CHEMBL438657",
          "CHEMBL47386",
          "CHEMBL50",
          "CHEMBL611733",
          "CHEMBL612000",
          "CHEMBL849"
        ],
        "number_of_missing_values": "0"
      },
      {
        "data_type": "numeric",
        "index": "1",
        "is_ignore": "false",
        "is_row_identifier": "false",
        "is_target": "false",
        "name": "AMW",
        "number_of_missing_values": "0"
      },
      {
        "data_type": "numeric",
        "index": "2",
        "is_ignore": "false",
        "is_row_identifier": "false",
        "is_target": "false",
        "name": "C.",
        "number_of_missing_values": "0"
      },
      {
        "data_type": "numeric",
        "index": "3",
        "is_ignore": "false",
        "is_row_identifier": "false",
        "is_target": "false",
        "name": "H.",
        "number_of_missing_values": "0"
      },
      {
        "data_type": "numeric",
        "index": "4",
        "is_ignore": "false",
        "is_row_identifier": "false",
        "is_target": "false",
        "name": "Me",
        "number_of_missing_values": "0"
      },
      {
        "data_type": "numeric",
        "index": "5",
        "is_ignore": "false",
        "is_row_identifier": "false",
        "is_target": "false",
        "name": "Mi",
        "number_of_missing_values": "0"
      },
      {
        "data_type": "numeric",
        "index": "6",
        "is_ignore": "false",
        "is_row_identifier": "false",
        "is_target": "false",
        "name": "Mp",
        "number_of_missing_values": "0"
      },
      {
        "data_type": "numeric",
        "index": "7",
        "is_ignore": "false",
        "is_row_identifier": "false",
        "is_target": "false",
        "name": "Mv",
        "number_of_missing_values": "0"
      },
      {
        "data_type": "numeric",
        "index": "8",
        "is_ignore": "false",
        "is_row_identifier": "false",
        "is_target": "false",
        "name": "MW",
        "number_of_missing_values": "0"
      },
      {
        "data_type": "numeric",
        "index": "9",
        "is_ignore": "false",
        "is_row_identifier": "false",
        "is_target": "false",
        "name": "N.",
        "number_of_missing_values": "0"
      },
      {
        "data_type": "numeric",
        "index": "10",
        "is_ignore": "false",
        "is_row_identifier": "false",
        "is_target": "false",
        "name": "nAB",
        "number_of_missing_values": "0"
      },
      {
        "data_type": "numeric",
        "index": "11",
        "is_ignore": "false",
        "is_row_identifier": "false",
        "is_target": "false",
        "name": "nAT",
        "number_of_missing_values": "0"
      },
      {
        "data_type": "numeric",
        "index": "12",
        "is_ignore": "false",
        "is_row_identifier": "false",
        "is_target": "false",
        "name": "nB",
        "number_of_missing_values": "0"
      },
      {
        "data_type": "numeric",
        "index": "13",
        "is_ignore": "false",
        "is_row_identifier": "false",
        "is_target": "false",
        "name": "nBM",
        "number_of_missing_values": "0"
      },
      {
        "data_type": "numeric",
        "index": "14",
        "is_ignore": "false",
        "is_row_identifier": "false",
        "is_target": "false",
        "name": "nBO",
        "number_of_missing_values": "0"
      },
      {
        "data_type": "numeric",
        "index": "15",
        "is_ignore": "false",
        "is_row_identifier": "false",
        "is_target": "false",
        "name": "nBR",
        "number_of_missing_values": "0"
      },
      {
        "data_type": "numeric",
        "index": "16",
        "is_ignore": "false",
        "is_row_identifier": "false",
        "is_target": "false",
        "name": "nBT",
        "number_of_missing_values": "0"
      },
      {
        "data_type": "numeric",
        "index": "17",
        "is_ignore": "false",
        "is_row_identifier": "false",
        "is_target": "false",
        "name": "nC",
        "number_of_missing_values": "0"
      },
      {
        "data_type": "numeric",
        "index": "18",
        "is_ignore": "false",
        "is_row_identifier": "false",
        "is_target": "false",
        "name": "nCL",
        "number_of_missing_values": "0"
      },
      {
        "data_type": "numeric",
        "index": "19",
        "is_ignore": "false",
        "is_row_identifier": "false",
        "is_target": "false",
        "name": "nCsp",
        "number_of_missing_values": "0"
      },
      {
        "data_type": "numeric",
        "index": "20",
        "is_ignore": "false",
        "is_row_identifier": "false",
        "is_target": "false",
        "name": "nCsp2",
        "number_of_missing_values": "0"
      },
      {
        "data_type": "numeric",
        "index": "21",
        "is_ignore": "false",
        "is_row_identifier": "false",
        "is_target": "false",
        "name": "nCsp3",
        "number_of_missing_values": "0"
      },
      {
        "data_type": "numeric",
        "index": "22",
        "is_ignore": "false",
        "is_row_identifier": "false",
        "is_target": "false",
        "name": "nDB",
        "number_of_missing_values": "0"
      },
      {
        "data_type": "numeric",
        "index": "23",
        "is_ignore": "false",
        "is_row_identifier": "false",
        "is_target": "false",
        "name": "nF",
        "number_of_missing_values": "0"
      },
      {
        "data_type": "numeric",
        "index": "24",
        "is_ignore": "false",
        "is_row_identifier": "false",
        "is_target": "false",
        "name": "nH",
        "number_of_missing_values": "0"
      },
      {
        "data_type": "numeric",
        "index": "25",
        "is_ignore": "false",
        "is_row_identifier": "false",
        "is_target": "false",
        "name": "nHet",
        "number_of_missing_values": "0"
      },
      {
        "data_type": "numeric",
        "index": "26",
        "is_ignore": "false",
        "is_row_identifier": "false",
        "is_target": "false",
        "name": "nHM",
        "number_of_missing_values": "0"
      },
      {
        "data_type": "numeric",
        "index": "27",
        "is_ignore": "false",
        "is_row_identifier": "false",
        "is_target": "false",
        "name": "nI",
        "number_of_missing_values": "0"
      },
      {
        "data_type": "numeric",
        "index": "28",
        "is_ignore": "false",
        "is_row_identifier": "false",
        "is_target": "false",
        "name": "nN",
        "number_of_missing_values": "0"
      },
      {
        "data_type": "numeric",
        "index": "29",
        "is_ignore": "false",
        "is_row_identifier": "false",
        "is_target": "false",
        "name": "nO",
        "number_of_missing_values": "0"
      },
      {
        "data_type": "numeric",
        "index": "30",
        "is_ignore": "false",
        "is_row_identifier": "false",
        "is_target": "false",
        "name": "nP",
        "number_of_missing_values": "0"
      },
      {
        "data_type": "numeric",
        "index": "31",
        "is_ignore": "false",
        "is_row_identifier": "false",
        "is_target": "false",
        "name": "nS",
        "number_of_missing_values": "0"
      },
      {
        "data_type": "numeric",
        "index": "32",
        "is_ignore": "false",
        "is_row_identifier": "false",
        "is_target": "false",
        "name": "nSK",
        "number_of_missing_values": "0"
      },
      {
        "data_type": "numeric",
        "index": "33",
        "is_ignore": "false",
        "is_row_identifier": "false",
        "is_target": "false",
        "name": "nTB",
        "number_of_missing_values": "0"
      },
      {
        "data_type": "numeric",
        "index": "34",
        "is_ignore": "false",
        "is_row_identifier": "false",
        "is_target": "false",
        "name": "nX",
        "number_of_missing_values": "0"
      },
      {
        "data_type": "numeric",
        "index": "35",
        "is_ignore": "false",
        "is_row_identifier": "false",
        "is_target": "false",
        "name": "O.",
        "number_of_missing_values": "0"
      },
      {
        "data_type": "numeric",
        "index": "36",
        "is_ignore": "false",
        "is_row_identifier": "false",
        "is_target": "false",
        "name": "RBF",
        "number_of_missing_values": "0"
      },
      {
        "data_type": "numeric",
        "index": "37",
        "is_ignore": "false",
        "is_row_identifier": "false",
        "is_target": "false",
        "name": "RBN",
        "number_of_missing_values": "0"
      },
      {
        "data_type": "numeric",
        "index": "38",
        "is_ignore": "false",
        "is_row_identifier": "false",
        "is_target": "false",
        "name": "SCBO",
        "number_of_missing_values": "0"
      },
      {
        "data_type": "numeric",
        "index": "39",
        "is_ignore": "false",
        "is_row_identifier": "false",
        "is_target": "false",
        "name": "Se",
        "number_of_missing_values": "0"
      },
      {
        "data_type": "numeric",
        "index": "40",
        "is_ignore": "false",
        "is_row_identifier": "false",
        "is_target": "false",
        "name": "Si",
        "number_of_missing_values": "0"
      },
      {
        "data_type": "numeric",
        "index": "41",
        "is_ignore": "false",
        "is_row_identifier": "false",
        "is_target": "false",
        "name": "Sp",
        "number_of_missing_values": "0"
      },
      {
        "data_type": "numeric",
        "index": "42",
        "is_ignore": "false",
        "is_row_identifier": "false",
        "is_target": "false",
        "name": "Sv",
        "number_of_missing_values": "0"
      },
      {
        "data_type": "numeric",
        "index": "43",
        "is_ignore": "false",
        "is_row_identifier": "false",
        "is_target": "false",
        "name": "X.",
        "number_of_missing_values": "0"
      },
      {
        "data_type": "numeric",
        "index": "44",
        "is_ignore": "false",
        "is_row_identifier": "false",
        "is_target": "true",
        "name": "pXC50",
        "number_of_missing_values": "0"
      }
    ]
  }
}