"molecule_id","AMW","C.","H.","Me","Mi","Mp","Mv","MW","N.","nAB","nAT","nB","nBM","nBO","nBR","nBT","nC","nCL","nCsp","nCsp2","nCsp3","nDB","nF","nH","nHet","nHM","nI","nN","nO","nP","nS","nSK","nTB","nX","O.","RBF","RBN","SCBO","Se","Si","Sp","Sv","X.","pXC50"
{1 6.607,2 45.2,3 50,4 0.979,5 1.118,6 0.672,7 0.62,8 409.62,9 4.8,10 22,11 62,13 22,14 35,16 66,17 28,20 18,21 10,24 31,25 3,28 3,32 31,36 0.091,37 6,38 46,39 60.676,40 69.308,41 41.677,42 38.439,44 6.018}
{0 CHEMBL1083434,1 6.607,2 45.2,3 50,4 0.979,5 1.118,6 0.672,7 0.62,8 409.62,9 4.8,10 22,11 62,13 22,14 35,16 66,17 28,20 18,21 10,24 31,25 3,28 3,32 31,36 0.091,37 6,38 46,39 60.676,40 69.308,41 41.677,42 38.439,44 5.578}
{0 CHEMBL1083435,1 6.427,2 43.3,3 51.7,4 0.978,5 1.122,6 0.661,7 0.607,8 385.6,9 5,10 20,11 60,13 20,14 33,16 64,17 26,20 16,21 10,24 31,25 3,28 3,32 29,36 0.094,37 6,38 43,39 58.676,40 67.308,41 39.677,42 36.439,44 4.585}
{0 CHEMBL1084838,1 6.19,2 40,3 54,4 0.978,5 1.13,6 0.643,7 0.588,8 309.5,9 6,10 12,11 50,13 12,14 25,16 52,17 20,20 10,21 10,24 27,25 3,28 3,32 23,36 0.115,37 6,38 31,39 48.909,40 56.477,41 32.154,42 29.386,44 5.256}
{0 CHEMBL1085811,1 5.914,2 42.3,3 55.8,4 0.971,5 1.121,6 0.647,7 0.585,8 307.52,9 1.9,10 12,11 52,13 12,14 25,16 54,17 22,20 12,21 10,24 29,25 1,28 1,32 23,36 0.111,37 6,38 31,39 50.472,40 58.311,41 33.665,42 30.397,44 6.013}
{0 CHEMBL1085812,1 6.19,2 40,3 54,4 0.978,5 1.13,6 0.643,7 0.588,8 309.5,9 6,10 12,11 50,13 12,14 25,16 52,17 20,20 10,21 10,24 27,25 3,28 3,32 23,36 0.115,37 6,38 31,39 48.909,40 56.477,41 32.154,42 29.386,44 4.478}
{0 CHEMBL117785,1 6.349,2 38,3 54,4 0.991,5 1.13,6 0.625,7 0.58,8 317.47,9 2,10 6,11 50,13 7,14 25,16 52,17 19,20 7,21 12,22 1,24 27,25 4,28 1,29 3,32 23,35 6,36 0.077,37 4,38 29,39 49.571,40 56.524,41 31.267,42 29.014,44 7.577}
{0 CHEMBL122270,1 6.49,2 42.3,3 51.9,4 0.985,5 1.121,6 0.65,7 0.602,8 337.5,9 1.9,10 12,11 52,13 13,14 27,16 54,17 22,20 13,21 9,22 1,24 27,25 3,28 1,29 2,32 25,35 3.8,36 0.111,37 6,38 34,39 51.243,40 58.315,41 33.813,42 31.299,44 5.381}
{0 CHEMBL122317,1 6.104,2 41.5,3 54.7,4 0.977,5 1.123,6 0.644,7 0.587,8 323.52,9 1.9,10 12,11 53,13 12,14 26,16 55,17 22,20 12,21 10,24 29,25 2,28 1,29 1,32 24,35 1.9,36 0.109,37 6,38 32,39 51.8,40 59.521,41 34.12,42 31.111,44 5.51}
{0 CHEMBL122636,1 5.943,2 42.2,3 55.6,4 0.971,5 1.122,6 0.648,7 0.585,8 267.45,9 2.2,10 12,11 45,13 12,14 21,16 46,17 19,20 12,21 7,24 25,25 1,28 1,32 20,36 0.174,37 8,38 27,39 43.705,40 50.481,41 29.143,42 26.343,44 5.513}
{0 CHEMBL124219,1 6.304,2 43.1,3 52.9,4 0.979,5 1.12,6 0.654,7 0.6,8 321.5,9 2,10 12,11 51,13 13,14 26,16 53,17 22,20 14,21 8,22 1,24 27,25 2,28 1,29 1,32 24,35 2,36 0.094,37 5,38 33,39 49.916,40 57.105,41 33.358,42 30.585,44 5.191}
{0 CHEMBL125511,1 6.104,2 41.5,3 54.7,4 0.977,5 1.123,6 0.644,7 0.587,8 323.52,9 1.9,10 12,11 53,13 12,14 26,16 55,17 22,20 12,21 10,24 29,25 2,28 1,29 1,32 24,35 1.9,36 0.109,37 6,38 32,39 51.8,40 59.521,41 34.12,42 31.111,44 5.703}
{0 CHEMBL1770801,1 6.144,2 36.5,3 55.8,4 0.99,5 1.133,6 0.616,7 0.568,8 319.49,9 1.9,10 6,11 52,13 6,14 25,16 54,17 19,20 6,21 13,24 29,25 4,28 1,29 3,32 23,35 5.8,36 0.074,37 4,38 28,39 51.454,40 58.939,41 32.029,42 29.541,44 7.873}
{0 CHEMBL1770802,1 6.144,2 36.5,3 55.8,4 0.99,5 1.133,6 0.616,7 0.568,8 319.49,9 1.9,10 6,11 52,13 6,14 25,16 54,17 19,20 6,21 13,24 29,25 4,28 1,29 3,32 23,35 5.8,36 0.074,37 4,38 28,39 51.454,40 58.939,41 32.029,42 29.541,44 5.609}
{0 CHEMBL1770803,1 6.144,2 36.5,3 55.8,4 0.99,5 1.133,6 0.616,7 0.568,8 319.49,9 1.9,10 6,11 52,13 6,14 25,16 54,17 19,20 6,21 13,24 29,25 4,28 1,29 3,32 23,35 5.8,36 0.074,37 4,38 28,39 51.454,40 58.939,41 32.029,42 29.541,44 7.148}
{0 CHEMBL1770804,1 6.144,2 36.5,3 55.8,4 0.99,5 1.133,6 0.616,7 0.568,8 319.49,9 1.9,10 6,11 52,13 6,14 25,16 54,17 19,20 6,21 13,24 29,25 4,28 1,29 3,32 23,35 5.8,36 0.074,37 4,38 28,39 51.454,40 58.939,41 32.029,42 29.541,44 5.334}
{0 CHEMBL1770805,1 6.144,2 36.5,3 55.8,4 0.99,5 1.133,6 0.616,7 0.568,8 319.49,9 1.9,10 6,11 52,13 6,14 25,16 54,17 19,20 6,21 13,24 29,25 4,28 1,29 3,32 23,35 5.8,36 0.074,37 4,38 28,39 51.454,40 58.939,41 32.029,42 29.541,44 6.227}
{0 CHEMBL1770806,1 6.144,2 36.5,3 55.8,4 0.99,5 1.133,6 0.616,7 0.568,8 319.49,9 1.9,10 6,11 52,13 6,14 25,16 54,17 19,20 6,21 13,24 29,25 4,28 1,29 3,32 23,35 5.8,36 0.074,37 4,38 28,39 51.454,40 58.939,41 32.029,42 29.541,44 5.902}
{0 CHEMBL1780004,1 6.456,2 38.3,3 53.2,4 0.993,5 1.13,6 0.628,7 0.585,8 303.44,9 2.1,10 6,11 47,13 7,14 24,16 49,17 18,20 8,21 10,22 1,24 25,25 4,28 1,29 3,32 22,35 6.4,36 0.082,37 4,38 28,39 46.687,40 53.109,41 29.506,42 27.487,44 6.597}
{0 CHEMBL1780005,1 6.349,2 38,3 54,4 0.991,5 1.13,6 0.625,7 0.58,8 317.47,9 2,10 6,11 50,13 7,14 25,16 52,17 19,20 8,21 11,22 1,24 27,25 4,28 1,29 3,32 23,35 6,36 0.077,37 4,38 29,39 49.571,40 56.524,41 31.267,42 29.014,44 8.223}
{0 CHEMBL1780006,1 6.255,2 37.7,3 54.7,4 0.99,5 1.131,6 0.623,7 0.576,8 331.5,9 1.9,10 6,11 53,13 6,14 27,16 56,17 20,20 6,21 14,24 29,25 4,28 1,29 3,32 24,35 5.7,36 0.071,37 4,38 30,39 52.454,40 59.939,41 33.029,42 30.541,44 7.57}
{0 CHEMBL1780007,1 6.17,2 37.5,3 55.4,4 0.988,5 1.131,6 0.621,7 0.573,8 345.53,9 1.8,10 6,11 56,13 6,14 28,16 59,17 21,20 6,21 15,24 31,25 4,28 1,29 3,32 25,35 5.4,36 0.068,37 4,38 31,39 55.338,40 63.355,41 34.79,42 32.068,44 6.644}
{0 CHEMBL1780008,1 6.094,2 37.3,3 55.9,4 0.987,5 1.132,6 0.62,7 0.569,8 359.56,9 1.7,10 6,11 59,13 6,14 29,16 62,17 22,20 6,21 16,24 33,25 4,28 1,29 3,32 26,35 5.1,36 0.065,37 4,38 32,39 58.221,40 66.77,41 36.552,42 33.595,44 6.863}
{0 CHEMBL1780009,1 6.594,2 37.7,3 52.8,4 0.999,5 1.137,6 0.622,7 0.583,8 349.49,9 1.9,10 6,11 53,13 7,14 27,16 55,17 20,20 8,21 12,22 1,23 1,24 28,25 5,28 1,29 3,32 25,34 1,35 5.7,36 0.091,37 5,38 31,39 52.967,40 60.279,41 32.966,42 30.924,43 1.9,44 7.65}
{0 CHEMBL1794918,1 6.432,2 46.7,3 51.1,4 0.974,5 1.113,6 0.675,7 0.618,8 289.45,9 2.2,10 12,11 45,13 14,14 24,16 47,17 21,20 16,21 5,22 2,24 23,25 1,28 1,32 22,36 0.085,37 4,38 32,39 43.821,40 50.066,41 30.381,42 27.816,44 5.285}
{0 CHEMBL187455,1 6.125,2 44.2,3 53.8,4 0.972,5 1.117,6 0.659,7 0.599,8 318.52,9 1.9,10 12,11 52,13 14,14 26,16 54,17 23,20 16,21 7,22 2,24 28,25 1,28 1,32 24,36 0.074,37 4,38 34,39 50.53,40 58.104,41 34.285,42 31.133,44 5.034}
{0 CHEMBL188912,1 5.76,2 41.1,3 57.1,4 0.97,5 1.124,6 0.639,7 0.575,8 322.56,9 1.8,10 12,11 56,13 12,14 26,16 58,17 23,20 12,21 11,24 32,25 1,28 1,32 24,36 0.103,37 6,38 32,39 54.298,40 62.934,41 35.807,42 32.187,44 4.609}
{0 CHEMBL189788,1 6.11,2 44,3 54,4 0.972,5 1.118,6 0.658,7 0.597,8 305.5,9 2,10 12,11 50,13 13,14 25,16 52,17 22,20 14,21 8,22 1,24 27,25 1,28 1,32 23,36 0.096,37 5,38 32,39 48.589,40 55.896,41 32.904,42 29.87,44 5.278}
{0 CHEMBL190113,1 5.76,2 41.1,3 57.1,4 0.97,5 1.124,6 0.639,7 0.575,8 322.56,9 1.8,10 12,11 56,13 12,14 26,16 58,17 23,20 12,21 11,24 32,25 1,28 1,32 24,36 0.103,37 6,38 32,39 54.298,40 62.934,41 35.807,42 32.187,44 4.783}
{0 CHEMBL190319,1 6.432,2 46.7,3 51.1,4 0.974,5 1.113,6 0.675,7 0.618,8 289.45,9 2.2,10 12,11 45,13 14,14 24,16 47,17 21,20 16,21 5,22 2,24 23,25 1,28 1,32 22,36 0.085,37 4,38 32,39 43.821,40 50.066,41 30.381,42 27.816,44 5.682}
{0 CHEMBL190555,1 6.11,2 44,3 54,4 0.972,5 1.118,6 0.658,7 0.597,8 305.5,9 2,10 12,11 50,13 13,14 25,16 52,17 22,20 14,21 8,22 1,24 27,25 1,28 1,32 23,36 0.096,37 5,38 32,39 48.589,40 55.896,41 32.904,42 29.87,44 4}
{0 CHEMBL190691,1 6.369,2 46.9,3 51.6,4 0.972,5 1.112,6 0.675,7 0.616,8 407.64,9 1.6,10 22,11 64,13 22,14 35,16 68,17 30,20 20,21 10,24 33,25 1,28 1,32 31,36 0.088,37 6,38 46,39 62.239,40 71.142,41 43.188,42 39.45,44 6.201}
{0 CHEMBL190725,1 6.425,2 46.3,3 51.2,4 0.974,5 1.113,6 0.674,7 0.617,8 263.41,9 2.4,10 12,11 41,13 14,14 21,16 42,17 19,20 16,21 3,22 2,24 21,25 1,28 1,32 20,36 0.143,37 6,38 29,39 39.938,40 45.65,41 27.62,42 25.289,44 5.625}
{0 CHEMBL190870,1 5.914,2 42.3,3 55.8,4 0.971,5 1.121,6 0.647,7 0.585,8 307.52,9 1.9,10 12,11 52,13 12,14 25,16 54,17 22,20 12,21 10,24 29,25 1,28 1,32 23,36 0.111,37 6,38 31,39 50.472,40 58.311,41 33.665,42 30.397,44 5.274}
{0 CHEMBL191947,1 5.914,2 42.3,3 55.8,4 0.971,5 1.121,6 0.647,7 0.585,8 307.52,9 1.9,10 12,11 52,13 12,14 25,16 54,17 22,20 12,21 10,24 29,25 1,28 1,32 23,36 0.111,37 6,38 31,39 50.472,40 58.311,41 33.665,42 30.397,44 5.274}
{0 CHEMBL192329,1 5.99,2 42.9,3 55.1,4 0.971,5 1.12,6 0.651,7 0.589,8 293.49,9 2,10 12,11 49,13 12,14 24,16 51,17 21,20 12,21 9,24 27,25 1,28 1,32 22,36 0.118,37 6,38 30,39 47.589,40 54.896,41 31.904,42 28.87,44 5.636}
{0 CHEMBL192502,1 6.453,2 47.5,3 50.8,4 0.973,5 1.11,6 0.679,7 0.622,8 393.61,9 1.6,10 22,11 61,13 22,14 34,16 65,17 29,20 20,21 9,24 31,25 1,28 1,32 30,36 0.092,37 6,38 45,39 59.356,40 67.726,41 41.427,42 37.923,44 5.33}
{0 CHEMBL192573,1 5.732,2 40.7,3 57.4,4 0.97,5 1.125,6 0.638,7 0.573,8 309.54,9 1.9,10 12,11 54,13 12,14 24,16 55,17 22,20 12,21 10,24 31,25 1,28 1,32 23,36 0.2,37 11,38 30,39 52.356,40 60.726,41 34.427,42 30.923,44 5.283}
{0 CHEMBL192574,1 5.732,2 40.7,3 57.4,4 0.97,5 1.125,6 0.638,7 0.573,8 309.54,9 1.9,10 12,11 54,13 12,14 24,16 55,17 22,20 12,21 10,24 31,25 1,28 1,32 23,36 0.2,37 11,38 30,39 52.356,40 60.726,41 34.427,42 30.923,44 5.402}
{0 CHEMBL192910,1 6.11,2 44,3 54,4 0.972,5 1.118,6 0.658,7 0.597,8 305.5,9 2,10 12,11 50,13 13,14 25,16 52,17 22,20 14,21 8,22 1,24 27,25 1,28 1,32 23,36 0.096,37 5,38 32,39 48.589,40 55.896,41 32.904,42 29.87,44 5.573}
{0 CHEMBL193079,1 6.369,2 46.9,3 51.6,4 0.972,5 1.112,6 0.675,7 0.616,8 407.64,9 1.6,10 22,11 64,13 22,14 35,16 68,17 30,20 20,21 10,24 33,25 1,28 1,32 31,36 0.088,37 6,38 46,39 62.239,40 71.142,41 43.188,42 39.45,44 5.693}
{0 CHEMBL193224,1 6.322,2 45.8,3 52.1,4 0.973,5 1.114,6 0.67,7 0.611,8 303.48,9 2.1,10 12,11 48,13 14,14 25,16 50,17 22,20 16,21 6,22 2,24 25,25 1,28 1,32 23,36 0.08,37 4,38 33,39 46.705,40 53.481,41 32.143,42 29.343,44 4.712}
{0 CHEMBL193292,1 6.125,2 44.2,3 53.8,4 0.972,5 1.117,6 0.659,7 0.599,8 318.52,9 1.9,10 12,11 52,13 14,14 26,16 54,17 23,20 16,21 7,22 2,24 28,25 1,28 1,32 24,36 0.074,37 4,38 34,39 50.53,40 58.104,41 34.285,42 31.133,44 4}
{0 CHEMBL193571,1 6.322,2 45.8,3 52.1,4 0.973,5 1.114,6 0.67,7 0.611,8 303.48,9 2.1,10 12,11 48,13 14,14 25,16 50,17 22,20 16,21 6,22 2,24 25,25 1,28 1,32 23,36 0.1,37 5,38 33,39 46.705,40 53.481,41 32.143,42 29.343,44 5.416}
{0 CHEMBL193782,1 6.11,2 44,3 54,4 0.972,5 1.118,6 0.658,7 0.597,8 305.5,9 2,10 12,11 50,13 13,14 25,16 52,17 22,20 14,21 8,22 1,24 27,25 1,28 1,32 23,36 0.115,37 6,38 32,39 48.589,40 55.896,41 32.904,42 29.87,44 5.52}
{0 CHEMBL194053,1 6.322,2 45.8,3 52.1,4 0.973,5 1.114,6 0.67,7 0.611,8 303.48,9 2.1,10 12,11 48,13 14,14 25,16 50,17 22,20 16,21 6,22 2,24 25,25 1,28 1,32 23,36 0.08,37 4,38 33,39 46.705,40 53.481,41 32.143,42 29.343,44 5.149}
{0 CHEMBL194212,1 6.303,2 41.4,3 53.4,4 0.983,5 1.123,6 0.644,7 0.592,8 365.56,9 1.7,10 12,11 58,13 12,14 30,16 61,17 24,20 12,21 12,24 31,25 3,28 1,29 2,32 27,35 3.4,36 0.098,37 6,38 36,39 57.01,40 65.145,41 37.336,42 34.353,44 4}
{0 CHEMBL197250,1 6.83,2 44,3 50,4 0.992,5 1.132,6 0.656,7 0.613,8 341.48,9 2,10 12,11 50,13 12,14 28,16 53,17 22,20 12,21 10,23 2,24 25,25 3,28 1,32 25,34 2,36 0.075,37 4,38 34,39 49.614,40 56.575,41 32.779,42 30.636,43 4,44 4}
{0 CHEMBL197710,1 6.52,2 44.9,3 51,4 0.98,5 1.116,6 0.665,7 0.613,8 319.48,9 2,10 12,11 49,13 13,14 27,16 52,17 22,20 13,21 9,22 1,24 25,25 2,28 1,29 1,32 24,35 2,36 0.077,37 4,38 34,39 48.032,40 54.69,41 32.597,42 30.058,44 4}
{0 CHEMBL198390,1 6.096,2 42.9,3 54.3,4 0.973,5 1.121,6 0.653,7 0.593,8 213.35,9 2.9,10 6,11 35,13 7,14 18,16 37,17 15,20 8,21 7,22 1,24 19,25 1,28 1,32 16,36 0.054,37 2,38 22,39 34.054,40 39.235,41 22.858,42 20.763,44 4.409}
{0 CHEMBL198391,1 5.821,2 40.5,3 56.8,4 0.971,5 1.126,6 0.638,7 0.575,8 215.37,9 2.7,10 6,11 37,13 6,14 18,16 39,17 15,20 6,21 9,24 21,25 1,28 1,32 16,36 0.051,37 2,38 21,39 35.938,40 41.65,41 23.62,42 21.289,44 4.427}
{0 CHEMBL2103769,1 6.49,2 42.3,3 51.9,4 0.985,5 1.121,6 0.65,7 0.602,8 337.5,9 1.9,10 12,11 52,13 13,14 27,16 54,17 22,20 13,21 9,22 1,24 27,25 3,28 1,29 2,32 25,35 3.8,36 0.111,37 6,38 34,39 51.243,40 58.315,41 33.813,42 31.299,44 5.411}
{0 CHEMBL213148,1 6.104,2 41.5,3 54.7,4 0.977,5 1.123,6 0.644,7 0.587,8 323.52,9 1.9,10 12,11 53,13 12,14 26,16 55,17 22,20 12,21 10,24 29,25 2,28 1,29 1,32 24,35 1.9,36 0.109,37 6,38 32,39 51.8,40 59.521,41 34.12,42 31.111,44 5.18}
{0 CHEMBL213613,1 6.304,2 43.1,3 52.9,4 0.979,5 1.12,6 0.654,7 0.6,8 321.5,9 2,10 12,11 51,13 13,14 26,16 53,17 22,20 14,21 8,22 1,24 27,25 2,28 1,29 1,32 24,35 2,36 0.094,37 5,38 33,39 49.916,40 57.105,41 33.358,42 30.585,44 5.218}
{0 CHEMBL213814,1 5.992,2 36.2,3 56.9,4 0.987,5 1.134,6 0.613,7 0.562,8 347.55,9 1.7,10 6,11 58,13 6,14 27,16 60,17 21,20 6,21 15,24 33,25 4,28 1,29 3,32 25,35 5.2,36 0.083,37 5,38 30,39 57.221,40 65.77,41 35.552,42 32.595,44 7.553}
{0 CHEMBL217815,1 6.304,2 43.1,3 52.9,4 0.979,5 1.12,6 0.654,7 0.6,8 321.5,9 2,10 12,11 51,13 13,14 26,16 53,17 22,20 14,21 8,22 1,24 27,25 2,28 1,29 1,32 24,35 2,36 0.094,37 5,38 33,39 49.916,40 57.105,41 33.358,42 30.585,44 6.229}
{0 CHEMBL303770,1 6.064,2 36.4,3 56.4,4 0.988,5 1.134,6 0.614,7 0.565,8 333.52,9 1.8,10 6,11 55,13 6,14 26,16 57,17 20,20 6,21 14,24 31,25 4,28 1,29 3,32 24,35 5.5,36 0.07,37 4,38 29,39 54.338,40 62.355,41 33.79,42 31.068,44 8.585}
{0 CHEMBL333465,1 5.914,2 42.3,3 55.8,4 0.971,5 1.121,6 0.647,7 0.585,8 307.52,9 1.9,10 12,11 52,13 12,14 25,16 54,17 22,20 12,21 10,24 29,25 1,28 1,32 23,36 0.111,37 6,38 31,39 50.472,40 58.311,41 33.665,42 30.397,44 4.827}
{0 CHEMBL363778,1 7.072,2 45.8,3 47.9,4 0.994,5 1.128,6 0.667,7 0.627,8 339.46,9 2.1,10 12,11 48,13 13,14 28,16 51,17 22,20 14,21 8,22 1,23 2,24 23,25 3,28 1,32 25,34 2,36 0.078,37 4,38 35,39 47.73,40 54.16,41 32.018,42 30.11,43 4.2,44 4}
{0 CHEMBL364264,1 5.833,2 41.9,3 56.5,4 0.97,5 1.122,6 0.644,7 0.58,8 361.62,9 1.6,10 12,11 62,13 12,14 30,16 65,17 26,20 12,21 14,24 35,25 1,28 1,32 27,36 0.123,37 8,38 36,39 60.123,40 69.557,41 39.949,42 35.977,44 4}
{0 CHEMBL370014,1 6.322,2 45.8,3 52.1,4 0.973,5 1.114,6 0.67,7 0.611,8 303.48,9 2.1,10 12,11 48,13 13,14 26,16 51,17 22,20 14,21 8,22 1,24 25,25 1,28 1,32 23,36 0.078,37 4,38 33,39 46.705,40 53.481,41 32.143,42 29.343,44 4}
{0 CHEMBL370052,1 6.492,2 42.9,3 51.8,4 0.984,5 1.12,6 0.653,7 0.604,8 363.54,9 1.8,10 12,11 56,13 13,14 30,16 59,17 24,20 14,21 10,22 1,24 29,25 3,28 1,29 2,32 27,35 3.6,36 0.102,37 6,38 37,39 55.127,40 62.73,41 36.574,42 33.826,44 4}
{0 CHEMBL371493,1 6.11,2 44,3 54,4 0.972,5 1.118,6 0.658,7 0.597,8 305.5,9 2,10 12,11 50,13 12,14 26,16 53,17 22,20 12,21 10,24 27,25 1,28 1,32 23,36 0.075,37 4,38 32,39 48.589,40 55.896,41 32.904,42 29.87,44 4}
{0 CHEMBL372435,1 6.322,2 45.8,3 52.1,4 0.973,5 1.114,6 0.67,7 0.611,8 303.48,9 2.1,10 12,11 48,13 14,14 25,16 50,17 22,20 16,21 6,22 2,24 25,25 1,28 1,32 23,36 0.08,37 4,38 33,39 46.705,40 53.481,41 32.143,42 29.343,44 5.005}
{0 CHEMBL372892,1 6.11,2 44,3 54,4 0.972,5 1.118,6 0.658,7 0.597,8 305.5,9 2,10 12,11 50,13 13,14 25,16 52,17 22,20 14,21 8,22 1,24 27,25 1,28 1,32 23,36 0.096,37 5,38 32,39 48.589,40 55.896,41 32.904,42 29.87,44 5.602}
{0 CHEMBL377539,1 6.104,2 41.5,3 54.7,4 0.977,5 1.123,6 0.644,7 0.587,8 323.52,9 1.9,10 12,11 53,13 12,14 26,16 55,17 22,20 12,21 10,24 29,25 2,28 1,29 1,32 24,35 1.9,36 0.109,37 6,38 32,39 51.8,40 59.521,41 34.12,42 31.111,44 5.521}
{0 CHEMBL382976,1 6.304,2 43.1,3 52.9,4 0.979,5 1.12,6 0.654,7 0.6,8 321.5,9 2,10 12,11 51,13 12,14 27,16 54,17 22,20 12,21 10,24 27,25 2,28 1,29 1,32 24,35 2,36 0.074,37 4,38 33,39 49.916,40 57.105,41 33.358,42 30.585,44 4}
{0 CHEMBL424816,1 6.453,2 47.5,3 50.8,4 0.973,5 1.11,6 0.679,7 0.622,8 393.61,9 1.6,10 22,11 61,13 22,14 34,16 65,17 29,20 20,21 9,24 31,25 1,28 1,32 30,36 0.092,37 6,38 45,39 59.356,40 67.726,41 41.427,42 37.923,44 4}
{0 CHEMBL425617,1 6.304,2 43.1,3 52.9,4 0.979,5 1.12,6 0.654,7 0.6,8 321.5,9 2,10 12,11 51,13 13,14 26,16 53,17 22,20 14,21 8,22 1,24 27,25 2,28 1,29 1,32 24,35 2,36 0.094,37 5,38 33,39 49.916,40 57.105,41 33.358,42 30.585,44 5.287}
{0 CHEMBL441439,1 5.992,2 36.2,3 56.9,4 0.987,5 1.134,6 0.613,7 0.562,8 347.55,9 1.7,10 6,11 58,13 6,14 27,16 60,17 21,20 6,21 15,24 33,25 4,28 1,29 3,32 25,35 5.2,36 0.083,37 5,38 30,39 57.221,40 65.77,41 35.552,42 32.595,44 7.377}
{0 CHEMBL447962,1 6.285,2 45,3 52.5,4 0.973,5 1.116,6 0.665,7 0.607,8 251.4,9 2.5,10 12,11 40,13 12,14 21,16 42,17 18,20 12,21 6,24 21,25 1,28 1,32 19,36 0.071,37 3,38 27,39 38.938,40 44.65,41 26.62,42 24.289,44 4.618}
{0 CHEMBL453650,1 5.786,2 41.4,3 56.9,4 0.97,5 1.123,6 0.641,7 0.577,8 335.58,9 1.7,10 12,11 58,13 12,14 27,16 60,17 24,20 12,21 12,24 33,25 1,28 1,32 25,36 0.133,37 8,38 33,39 56.239,40 65.142,41 37.188,42 33.45,44 6}
{0 CHEMBL453701,1 5.99,2 42.9,3 55.1,4 0.971,5 1.12,6 0.651,7 0.589,8 293.49,9 2,10 12,11 49,13 12,14 24,16 51,17 21,20 12,21 9,24 27,25 1,28 1,32 22,36 0.118,37 6,38 30,39 47.589,40 54.896,41 31.904,42 28.87,44 5.947}
{0 CHEMBL454111,1 6.075,2 43.5,3 54.3,4 0.972,5 1.119,6 0.655,7 0.594,8 279.46,9 2.2,10 12,11 46,13 12,14 23,16 48,17 20,20 12,21 8,24 25,25 1,28 1,32 21,36 0.083,37 4,38 29,39 44.705,40 51.481,41 30.143,42 27.343,44 4.979}
{0 CHEMBL454769,1 5.99,2 42.9,3 55.1,4 0.971,5 1.12,6 0.651,7 0.589,8 293.49,9 2,10 12,11 49,13 12,14 24,16 51,17 21,20 12,21 9,24 27,25 1,28 1,32 22,36 0.098,37 5,38 30,39 47.589,40 54.896,41 31.904,42 28.87,44 5.558}
{0 CHEMBL455145,1 5.99,2 42.9,3 55.1,4 0.971,5 1.12,6 0.651,7 0.589,8 293.49,9 2,10 12,11 49,13 12,14 24,16 51,17 21,20 12,21 9,24 27,25 1,28 1,32 22,36 0.098,37 5,38 30,39 47.589,40 54.896,41 31.904,42 28.87,44 4.204}
{0 CHEMBL455197,1 6.173,2 44.2,3 53.5,4 0.973,5 1.118,6 0.66,7 0.6,8 265.43,9 2.3,10 12,11 43,13 12,14 22,16 45,17 19,20 12,21 7,24 23,25 1,28 1,32 20,36 0.067,37 3,38 28,39 41.821,40 48.066,41 28.381,42 25.816,44 4.866}
{0 CHEMBL455198,1 6.075,2 43.5,3 54.3,4 0.972,5 1.119,6 0.655,7 0.594,8 279.46,9 2.2,10 12,11 46,13 12,14 23,16 48,17 20,20 12,21 8,24 25,25 1,28 1,32 21,36 0.083,37 4,38 29,39 44.705,40 51.481,41 30.143,42 27.343,44 4.793}
{0 CHEMBL455199,1 6.075,2 43.5,3 54.3,4 0.972,5 1.119,6 0.655,7 0.594,8 279.46,9 2.2,10 12,11 46,13 12,14 23,16 48,17 20,20 12,21 8,24 25,25 1,28 1,32 21,36 0.104,37 5,38 29,39 44.705,40 51.481,41 30.143,42 27.343,44 4.544}
{0 CHEMBL455200,1 6.075,2 43.5,3 54.3,4 0.972,5 1.119,6 0.655,7 0.594,8 279.46,9 2.2,10 12,11 46,13 12,14 23,16 48,17 20,20 12,21 8,24 25,25 1,28 1,32 21,36 0.104,37 5,38 29,39 44.705,40 51.481,41 30.143,42 27.343,44 4.914}
{0 CHEMBL455327,1 6.285,2 45,3 52.5,4 0.973,5 1.116,6 0.665,7 0.607,8 251.4,9 2.5,10 12,11 40,13 12,14 21,16 42,17 18,20 12,21 6,24 21,25 1,28 1,32 19,36 0.048,37 2,38 27,39 38.938,40 44.65,41 26.62,42 24.289,44 4}
{0 CHEMBL455665,1 5.914,2 42.3,3 55.8,4 0.971,5 1.121,6 0.647,7 0.585,8 307.52,9 1.9,10 12,11 52,13 12,14 25,16 54,17 22,20 12,21 10,24 29,25 1,28 1,32 23,36 0.13,37 7,38 31,39 50.472,40 58.311,41 33.665,42 30.397,44 5.337}
{0 CHEMBL455666,1 5.846,2 41.8,3 56.4,4 0.97,5 1.122,6 0.644,7 0.58,8 321.55,9 1.8,10 12,11 55,13 12,14 26,16 57,17 23,20 12,21 11,24 31,25 1,28 1,32 24,36 0.123,37 7,38 32,39 53.356,40 61.726,41 35.427,42 31.923,44 6.056}
{0 CHEMBL500510,1 6.173,2 44.2,3 53.5,4 0.973,5 1.118,6 0.66,7 0.6,8 265.43,9 2.3,10 12,11 43,13 12,14 22,16 45,17 19,20 12,21 7,24 23,25 1,28 1,32 20,36 0.089,37 4,38 28,39 41.821,40 48.066,41 28.381,42 25.816,44 4.547}
{0 CHEMBL500548,1 5.914,2 42.3,3 55.8,4 0.971,5 1.121,6 0.647,7 0.585,8 307.52,9 1.9,10 12,11 52,13 12,14 25,16 54,17 22,20 12,21 10,24 29,25 1,28 1,32 23,36 0.111,37 6,38 31,39 50.472,40 58.311,41 33.665,42 30.397,44 5.79}
{0 CHEMBL507483,1 6.144,2 36.5,3 55.8,4 0.99,5 1.133,6 0.616,7 0.568,8 319.49,9 1.9,10 6,11 52,13 6,14 25,16 54,17 19,20 6,21 13,24 29,25 4,28 1,29 3,32 23,35 5.8,36 0.074,37 4,38 28,39 51.454,40 58.939,41 32.029,42 29.541,44 4.625}
{0 CHEMBL508711,1 6.173,2 44.2,3 53.5,4 0.973,5 1.118,6 0.66,7 0.6,8 265.43,9 2.3,10 12,11 43,13 12,14 22,16 45,17 19,20 12,21 7,24 23,25 1,28 1,32 20,36 0.089,37 4,38 28,39 41.821,40 48.066,41 28.381,42 25.816,44 5.115}
{0 CHEMBL509644,1 5.846,2 41.8,3 56.4,4 0.97,5 1.122,6 0.644,7 0.58,8 321.55,9 1.8,10 12,11 55,13 12,14 26,16 57,17 23,20 12,21 11,24 31,25 1,28 1,32 24,36 0.14,37 8,38 32,39 53.356,40 61.726,41 35.427,42 31.923,44 5.341}
{0 CHEMBL519344,1 6.349,2 38,3 54,4 0.991,5 1.13,6 0.625,7 0.58,8 317.47,9 2,10 6,11 50,13 7,14 25,16 52,17 19,20 7,21 12,22 1,24 27,25 4,28 1,29 3,32 23,35 6,36 0.077,37 4,38 29,39 49.571,40 56.524,41 31.267,42 29.014,44 4.439}
{0 CHEMBL567232,1 6.01,2 35.8,3 56.6,4 0.985,5 1.136,6 0.615,7 0.563,8 318.51,9 3.8,10 6,11 53,13 6,14 25,16 55,17 19,20 6,21 13,24 30,25 4,28 2,29 2,32 23,35 3.8,36 0.073,37 4,38 28,39 52.229,40 60.228,41 32.58,42 29.848,44 6.824}
{0 CHEMBL569074,1 6.106,2 35.5,3 56.5,4 0.99,5 1.142,6 0.61,7 0.561,8 378.59,9 3.2,10 6,11 62,13 6,14 29,16 64,17 22,20 6,21 16,23 1,24 35,25 5,28 2,29 2,32 27,34 1,35 3.2,36 0.109,37 7,38 32,39 61.392,40 70.814,41 37.802,42 34.811,43 1.6,44 8.108}
{0 CHEMBL569075,1 5.938,2 35.7,3 57.1,4 0.984,5 1.136,6 0.613,7 0.56,8 332.54,9 3.6,10 6,11 56,13 6,14 26,16 58,17 20,20 6,21 14,24 32,25 4,28 2,29 2,32 24,35 3.6,36 0.086,37 5,38 29,39 55.112,40 63.643,41 34.341,42 31.374,44 6.636}
{0 CHEMBL571308,1 6.179,2 35.6,3 55.9,4 0.992,5 1.142,6 0.611,7 0.564,8 364.56,9 3.4,10 6,11 59,13 6,14 28,16 61,17 21,20 6,21 15,23 1,24 33,25 5,28 2,29 2,32 26,34 1,35 3.4,36 0.098,37 6,38 31,39 58.509,40 67.398,41 36.04,42 33.285,43 1.7,44 6.638}
{0 CHEMBL573040,1 6.075,2 43.5,3 54.3,4 0.972,5 1.119,6 0.655,7 0.594,8 279.46,9 2.2,10 12,11 46,13 12,14 23,16 48,17 20,20 12,21 8,24 25,25 1,28 1,32 21,36 0.125,37 6,38 29,39 44.705,40 51.481,41 30.143,42 27.343,44 5.876}
{0 CHEMBL573041,1 5.99,2 42.9,3 55.1,4 0.971,5 1.12,6 0.651,7 0.589,8 293.49,9 2,10 12,11 49,13 12,14 24,16 51,17 21,20 12,21 9,24 27,25 1,28 1,32 22,36 0.118,37 6,38 30,39 47.589,40 54.896,41 31.904,42 28.87,44 4.84}
{0 CHEMBL573251,1 6.343,2 44.4,3 52.4,4 0.977,5 1.117,6 0.661,7 0.606,8 399.62,9 1.6,10 18,11 63,13 18,14 33,16 66,17 28,20 18,21 10,24 33,25 2,28 1,29 1,32 30,35 1.6,36 0.136,37 9,38 42,39 61.567,40 70.351,41 41.643,42 38.165,44 5.561}
{0 CHEMBL574179,1 6.285,2 45,3 52.5,4 0.973,5 1.116,6 0.665,7 0.607,8 251.4,9 2.5,10 12,11 40,13 12,14 21,16 42,17 18,20 12,21 6,24 21,25 1,28 1,32 19,36 0.095,37 4,38 27,39 38.938,40 44.65,41 26.62,42 24.289,44 5.785}
{0 CHEMBL575467,1 5.99,2 42.9,3 55.1,4 0.971,5 1.12,6 0.651,7 0.589,8 293.49,9 2,10 12,11 49,13 12,14 24,16 51,17 21,20 12,21 9,24 27,25 1,28 1,32 22,36 0.118,37 6,38 30,39 47.589,40 54.896,41 31.904,42 28.87,44 5.056}
{0 CHEMBL575679,1 6.343,2 44.4,3 52.4,4 0.977,5 1.117,6 0.661,7 0.606,8 399.62,9 1.6,10 18,11 63,13 18,14 33,16 66,17 28,20 18,21 10,24 33,25 2,28 1,29 1,32 30,35 1.6,36 0.136,37 9,38 42,39 61.567,40 70.351,41 41.643,42 38.165,44 5.251}
{0 CHEMBL575873,1 6.343,2 44.4,3 52.4,4 0.977,5 1.117,6 0.661,7 0.606,8 399.62,9 1.6,10 18,11 63,13 18,14 33,16 66,17 28,20 18,21 10,24 33,25 2,28 1,29 1,32 30,35 1.6,36 0.136,37 9,38 42,39 61.567,40 70.351,41 41.643,42 38.165,44 5.505}
{0 CHEMBL576222,1 6.144,2 36.5,3 55.8,4 0.99,5 1.133,6 0.616,7 0.568,8 319.49,9 1.9,10 6,11 52,13 6,14 25,16 54,17 19,20 6,21 13,24 29,25 4,28 1,29 3,32 23,35 5.8,36 0.074,37 4,38 28,39 51.454,40 58.939,41 32.029,42 29.541,44 8.519}
{0 CHEMBL579217,1 6.302,2 36.2,3 55.2,4 0.995,5 1.14,6 0.612,7 0.569,8 365.54,9 1.7,10 6,11 58,13 6,14 28,16 60,17 21,20 6,21 15,23 1,24 32,25 5,28 1,29 3,32 26,34 1,35 5.2,36 0.1,37 6,38 31,39 57.734,40 66.109,41 35.489,42 32.978,43 1.7,44 9.532}
{0 CHEMBL579253,1 6.343,2 44.4,3 52.4,4 0.977,5 1.117,6 0.661,7 0.606,8 399.62,9 1.6,10 18,11 63,13 18,14 33,16 66,17 28,20 18,21 10,24 33,25 2,28 1,29 1,32 30,35 1.6,36 0.136,37 9,38 42,39 61.567,40 70.351,41 41.643,42 38.165,44 5.626}
{0 CHEMBL58121,1 5.869,2 35.9,3 57.8,4 0.984,5 1.134,6 0.611,7 0.557,8 375.61,9 1.6,10 6,11 64,13 6,14 29,16 66,17 23,20 6,21 17,24 37,25 4,28 1,29 3,32 27,35 4.7,36 0.076,37 5,38 32,39 62.989,40 72.6,41 39.074,42 35.648,44 6.866}
{0 CHEMBL582866,1 5.99,2 42.9,3 55.1,4 0.971,5 1.12,6 0.651,7 0.589,8 293.49,9 2,10 12,11 49,13 12,14 24,16 51,17 21,20 12,21 9,24 27,25 1,28 1,32 22,36 0.118,37 6,38 30,39 47.589,40 54.896,41 31.904,42 28.87,44 5.401}
{0 CHEMBL583383,1 6.075,2 43.5,3 54.3,4 0.972,5 1.119,6 0.655,7 0.594,8 279.46,9 2.2,10 12,11 46,13 12,14 23,16 48,17 20,20 12,21 8,24 25,25 1,28 1,32 21,36 0.125,37 6,38 29,39 44.705,40 51.481,41 30.143,42 27.343,44 5.514}
{0 CHEMBL583384,1 6.075,2 43.5,3 54.3,4 0.972,5 1.119,6 0.655,7 0.594,8 279.46,9 2.2,10 12,11 46,13 12,14 23,16 48,17 20,20 12,21 8,24 25,25 1,28 1,32 21,36 0.125,37 6,38 29,39 44.705,40 51.481,41 30.143,42 27.343,44 5.469}
{0 CHEMBL583692,1 5.914,2 42.3,3 55.8,4 0.971,5 1.121,6 0.647,7 0.585,8 307.52,9 1.9,10 12,11 52,13 12,14 25,16 54,17 22,20 12,21 10,24 29,25 1,28 1,32 23,36 0.148,37 8,38 31,39 50.472,40 58.311,41 33.665,42 30.397,44 6.569}
{0 CHEMBL585375,1 6.173,2 44.2,3 53.5,4 0.973,5 1.118,6 0.66,7 0.6,8 265.43,9 2.3,10 12,11 43,13 12,14 22,16 45,17 19,20 12,21 7,24 23,25 1,28 1,32 20,36 0.089,37 4,38 28,39 41.821,40 48.066,41 28.381,42 25.816,44 5.609}
{0 CHEMBL585377,1 5.846,2 41.8,3 56.4,4 0.97,5 1.122,6 0.644,7 0.58,8 321.55,9 1.8,10 12,11 55,13 12,14 26,16 57,17 23,20 12,21 11,24 31,25 1,28 1,32 24,36 0.14,37 8,38 32,39 53.356,40 61.726,41 35.427,42 31.923,44 5.556}
{0 CHEMBL59443,1 5.928,2 36.1,3 57.4,4 0.985,5 1.134,6 0.612,7 0.559,8 361.58,9 1.6,10 6,11 61,13 6,14 28,16 63,17 22,20 6,21 16,24 35,25 4,28 1,29 3,32 26,35 4.9,36 0.095,37 6,38 31,39 60.105,40 69.185,41 37.313,42 34.121,44 7.076}
{0 CHEMBL596682,1 6.47,2 41.3,3 52.4,4 0.988,5 1.123,6 0.644,7 0.597,8 407.6,9 1.6,10 12,11 63,13 14,14 32,16 65,17 26,20 14,21 12,22 2,24 33,25 4,28 1,29 3,32 30,35 4.8,36 0.138,37 9,38 40,39 62.221,40 70.77,41 40.552,42 37.595,44 5.583}
{0 CHEMBL596683,1 7.349,2 43.1,3 47.7,4 0.996,5 1.115,6 0.675,7 0.63,8 477.67,9 1.5,10 18,11 65,13 21,14 37,16 68,17 28,20 19,21 9,22 3,24 31,25 6,26 1,28 1,29 4,31 1,32 34,35 6.2,36 0.132,37 9,38 49,39 64.741,40 72.484,41 43.892,42 40.97,44 5.456}
{0 CHEMBL597067,1 6.659,2 42.1,3 50.9,4 0.99,5 1.122,6 0.65,7 0.606,8 379.54,9 1.8,10 12,11 57,13 14,14 30,16 59,17 24,20 14,21 10,22 2,24 29,25 4,28 1,29 3,32 28,35 5.3,36 0.136,37 8,38 38,39 56.454,40 63.939,41 37.029,42 34.541,44 5.094}
{0 CHEMBL597085,1 7.231,2 42.6,3 48.5,4 0.994,5 1.116,6 0.671,7 0.625,8 491.7,9 1.5,10 18,11 68,13 21,14 38,16 71,17 29,20 19,21 10,22 3,24 33,25 6,26 1,28 1,29 4,31 1,32 35,35 5.9,36 0.127,37 9,38 50,39 67.625,40 75.899,41 45.654,42 42.496,44 4.967}
{0 CHEMBL597270,1 6.559,2 41.7,3 51.7,4 0.989,5 1.123,6 0.647,7 0.601,8 393.57,9 1.7,10 12,11 60,13 14,14 31,16 62,17 25,20 14,21 11,22 2,24 31,25 4,28 1,29 3,32 29,35 5,36 0.145,37 9,38 39,39 59.338,40 67.355,41 38.79,42 36.068,44 5.323}
{0 CHEMBL597271,1 6.47,2 41.3,3 52.4,4 0.988,5 1.123,6 0.644,7 0.597,8 407.6,9 1.6,10 12,11 63,13 14,14 32,16 65,17 26,20 14,21 12,22 2,24 33,25 4,28 1,29 3,32 30,35 4.8,36 0.154,37 10,38 40,39 62.221,40 70.77,41 40.552,42 37.595,44 5.471}
{0 CHEMBL597297,1 7.879,2 43.1,3 46.2,4 1.001,5 1.114,6 0.688,7 0.643,8 512.11,9 1.5,10 18,11 65,13 21,14 38,16 68,17 28,18 1,20 19,21 9,22 3,24 30,25 7,26 2,28 1,29 4,31 1,32 35,34 1,35 6.2,36 0.132,37 9,38 50,39 65.065,40 72.428,41 44.75,42 41.797,43 1.5,44 5.489}
{0 CHEMBL597298,1 7.626,2 43.1,3 46.2,4 1.004,5 1.12,6 0.674,7 0.636,8 495.66,9 1.5,10 18,11 65,13 21,14 38,16 68,17 28,20 19,21 9,22 3,23 1,24 30,25 7,26 1,28 1,29 4,31 1,32 35,34 1,35 6.2,36 0.132,37 9,38 50,39 65.254,40 72.824,41 43.83,42 41.353,43 1.5,44 5.523}
{0 CHEMBL597299,1 7.801,2 41.8,3 44.8,4 1.009,5 1.119,6 0.672,7 0.64,8 522.67,9 3,10 18,11 67,13 23,14 40,16 70,17 28,20 19,21 9,22 5,24 30,25 9,26 1,28 2,29 6,31 1,32 37,35 9,36 0.143,37 10,38 54,39 67.614,40 74.986,41 45.046,42 42.894,44 5.374}
{0 CHEMBL599081,1 6.801,2 44.8,3 49.3,4 0.988,5 1.116,6 0.665,7 0.621,8 455.64,9 1.5,10 18,11 67,13 20,14 37,16 70,17 30,20 20,21 10,22 2,24 33,25 4,28 1,29 3,32 34,35 4.5,36 0.129,37 9,38 48,39 66.221,40 74.77,41 44.552,42 41.595,44 5.754}
{0 CHEMBL599267,1 7.433,2 45.1,3 46.5,4 0.995,5 1.111,6 0.685,7 0.641,8 527.73,9 1.4,10 23,11 71,13 26,14 42,16 75,17 32,20 23,21 9,22 3,24 33,25 6,26 1,28 1,29 4,31 1,32 38,35 5.6,36 0.12,37 9,38 56.5,39 70.625,40 78.899,41 48.654,42 45.496,44 5.606}
{0 CHEMBL599268,1 6.932,2 39.1,3 51.6,4 0.994,5 1.123,6 0.651,7 0.602,8 443.66,9 1.6,10 12,11 64,13 15,14 33,16 66,17 25,20 13,21 12,22 3,24 33,25 6,26 1,28 1,29 4,31 1,32 31,35 6.3,36 0.136,37 9,38 42,39 63.625,40 71.899,41 41.654,42 38.496,44 5.68}
{0 CHEMBL599693,1 6.9,2 45.3,3 48.4,4 0.99,5 1.115,6 0.669,7 0.626,8 441.61,9 1.6,10 18,11 64,13 20,14 36,16 67,17 29,20 20,21 9,22 2,24 31,25 4,28 1,29 3,32 33,35 4.7,36 0.134,37 9,38 47,39 63.338,40 71.355,41 42.79,42 40.068,44 5.815}
{0 CHEMBL603692,1 6.831,2 38.8,3 52.2,4 0.993,5 1.124,6 0.648,7 0.597,8 457.69,9 1.5,10 12,11 67,13 15,14 34,16 69,17 26,20 13,21 13,22 3,24 35,25 6,26 1,28 1,29 4,31 1,32 32,35 6,36 0.159,37 11,38 43,39 66.509,40 75.314,41 43.415,42 40.023,44 5.703}
{0 CHEMBL603904,1 6.936,2 44.1,3 48.5,4 0.993,5 1.117,6 0.662,7 0.622,8 471.64,9 1.5,10 18,11 68,13 20,14 38,16 71,17 30,20 20,21 10,22 2,24 33,25 5,28 1,29 4,32 35,35 5.9,36 0.141,37 10,38 49,39 67.549,40 75.979,41 45.006,42 42.309,44 5.526}
{0 CHEMBL604306,1 7.231,2 42.6,3 48.5,4 0.994,5 1.116,6 0.671,7 0.625,8 491.7,9 1.5,10 18,11 68,13 21,14 38,16 71,17 29,20 19,21 10,22 3,24 33,25 6,26 1,28 1,29 4,31 1,32 35,35 5.9,36 0.141,37 10,38 50,39 67.625,40 75.899,41 45.654,42 42.496,44 5.4}
{0 CHEMBL605420,1 7.433,2 45.1,3 46.5,4 0.995,5 1.111,6 0.685,7 0.641,8 527.73,9 1.4,10 23,11 71,13 26,14 42,16 75,17 32,20 23,21 9,22 3,24 33,25 6,26 1,28 1,29 4,31 1,32 38,35 5.6,36 0.12,37 9,38 56.5,39 70.625,40 78.899,41 48.654,42 45.496,44 5.385}
{0 CHEMBL605748,1 7.802,2 41.9,3 46.8,4 0.999,5 1.113,6 0.69,7 0.639,8 483.7,9 1.6,10 17,11 62,13 20,14 36,16 65,17 26,20 17,21 9,22 3,24 29,25 7,26 2,28 1,29 4,31 2,32 33,35 6.5,36 0.138,37 9,38 47.5,39 61.934,40 68.989,41 42.779,42 39.63,44 5.374}
{0 CHEMBL606378,1 7.338,2 44.3,3 47.5,4 0.992,5 1.112,6 0.683,7 0.635,8 447.64,9 1.6,10 17,11 61,13 19,14 35,16 64,17 27,20 18,21 9,22 2,24 29,25 5,26 1,28 1,29 3,31 1,32 32,35 4.9,36 0.141,37 9,38 45.5,39 60.531,40 67.859,41 41.676,42 38.728,44 5.196}
{0 CHEMBL61363,1 5.869,2 35.9,3 57.8,4 0.984,5 1.134,6 0.611,7 0.557,8 375.61,9 1.6,10 6,11 64,13 6,14 29,16 66,17 23,20 6,21 17,24 37,25 4,28 1,29 3,32 27,35 4.7,36 0.091,37 6,38 32,39 62.989,40 72.6,41 39.074,42 35.648,44 7.481}
{0 CHEMBL61636,1 6.349,2 38,3 54,4 0.991,5 1.13,6 0.625,7 0.58,8 317.47,9 2,10 6,11 50,13 7,14 25,16 52,17 19,20 7,21 12,22 1,24 27,25 4,28 1,29 3,32 23,35 6,36 0.077,37 4,38 29,39 49.571,40 56.524,41 31.267,42 29.014,44 8.221}
{0 CHEMBL62154,1 6.064,2 36.4,3 56.4,4 0.988,5 1.134,6 0.614,7 0.565,8 333.52,9 1.8,10 6,11 55,13 6,14 26,16 57,17 20,20 6,21 14,24 31,25 4,28 1,29 3,32 24,35 5.5,36 0.07,37 4,38 29,39 54.338,40 62.355,41 33.79,42 31.068,44 7.921}
