"molecule_id","FCFP4_1024b319","FCFP4_1024b33","FCFP4_1024b57","FCFP4_1024b453","FCFP4_1024b376","FCFP4_1024b603","FCFP4_1024b760","FCFP4_1024b107","FCFP4_1024b635","FCFP4_1024b521","FCFP4_1024b75","FCFP4_1024b884","FCFP4_1024b652","FCFP4_1024b732","FCFP4_1024b876","FCFP4_1024b187","FCFP4_1024b532","FCFP4_1024b392","FCFP4_1024b139","FCFP4_1024b54","FCFP4_1024b361","FCFP4_1024b899","FCFP4_1024b888","FCFP4_1024b69","FCFP4_1024b314","FCFP4_1024b698","FCFP4_1024b366","FCFP4_1024b300","FCFP4_1024b94","FCFP4_1024b402","FCFP4_1024b128","FCFP4_1024b936","FCFP4_1024b858","FCFP4_1024b788","FCFP4_1024b604","FCFP4_1024b764","FCFP4_1024b576","FCFP4_1024b1","FCFP4_1024b10","FCFP4_1024b100","FCFP4_1024b1000","FCFP4_1024b1001","FCFP4_1024b1002","FCFP4_1024b1003","FCFP4_1024b1004","FCFP4_1024b1005","FCFP4_1024b1006","FCFP4_1024b1007","FCFP4_1024b1008","FCFP4_1024b1009","FCFP4_1024b101","pXC50"
{1 1,2 1,3 1,10 1,19 1,38 1,52 5}
{0 CHEMBL101253,1 1,2 1,3 1,4 1,9 1,10 1,19 1,20 1,33 1,35 1,38 1,52 5}
{0 CHEMBL102858,5 1,38 1,52 5.799}
{0 CHEMBL102991,5 1,38 1,52 5.199}
{0 CHEMBL103091,5 1,38 1,52 5.372}
{0 CHEMBL103667,4 1,5 1,8 1,20 1,36 1,38 1,39 1,52 4.523}
{0 CHEMBL105442,1 1,2 1,3 1,4 1,9 1,19 1,20 1,21 1,26 1,38 1,52 5}
{0 CHEMBL1080994,4 1,9 1,10 1,18 1,20 1,29 1,38 1,39 1,52 7}
{0 CHEMBL1080995,4 1,9 1,10 1,18 1,20 1,38 1,39 1,52 6.31}
{0 CHEMBL1084411,4 1,9 1,10 1,18 1,19 1,20 1,29 1,38 1,39 1,52 6.921}
{0 CHEMBL1090360,4 1,5 1,7 1,8 1,9 1,10 1,20 1,25 1,32 1,33 1,37 1,38 1,52 6}
{0 CHEMBL1173655,1 1,2 1,3 1,4 1,5 1,8 1,9 1,10 1,15 1,19 1,20 1,22 1,33 1,35 1,36 1,38 1,39 1,52 5}
{0 CHEMBL119385,1 1,2 1,3 1,5 1,9 1,19 1,38 1,44 1,52 5}
{0 CHEMBL1214929,8 1,10 1,38 1,52 8.301}
{0 CHEMBL1214932,6 1,10 1,38 1,48 1,52 8.222}
{0 CHEMBL1230020,1 1,2 1,3 1,4 1,8 1,10 1,19 1,20 1,25 1,38 1,52 5}
{0 CHEMBL1236107,1 1,5 1,10 1,38 1,52 5}
{0 CHEMBL1240703,6 1,24 1,38 1,45 1,52 5}
{0 CHEMBL1241674,10 1,12 1,15 1,16 1,20 1,23 1,26 1,38 1,52 6.092}
{0 CHEMBL124660,4 1,5 1,8 1,10 1,15 1,20 1,22 1,31 1,36 1,38 1,39 1,52 5}
{0 CHEMBL1256416,1 1,2 1,3 1,11 1,12 1,16 1,19 1,23 1,26 1,27 1,28 1,38 1,40 1,52 9.444}
{0 CHEMBL1258117,38 1,52 7.921}
{0 CHEMBL1258348,11 1,12 1,16 1,23 1,26 1,38 1,52 8.357}
{0 CHEMBL1258349,33 1,38 1,52 6.745}
{0 CHEMBL1287853,4 1,5 1,6 1,7 1,9 1,10 1,20 1,32 1,33 1,35 1,37 1,38 1,39 1,52 5}
{0 CHEMBL1289926,5 1,6 1,10 1,16 1,38 1,41 1,52 5}
{0 CHEMBL1336,1 1,2 1,3 1,4 1,5 1,6 1,8 1,10 1,19 1,20 1,38 1,52 5}
{0 CHEMBL1421,1 1,2 1,3 1,7 1,8 1,9 1,10 1,19 1,20 1,37 1,38 1,39 1,52 5}
{0 CHEMBL146846,6 1,11 1,12 1,13 1,14 1,16 1,17 1,21 1,23 1,24 1,25 1,26 1,27 1,28 1,38 1,39 1,52 7}
{0 CHEMBL146847,6 1,11 1,12 1,13 1,14 1,16 1,17 1,23 1,24 1,25 1,26 1,38 1,52 7.301}
{0 CHEMBL14762,7 1,8 1,10 1,15 1,36 1,38 1,52 5}
{0 CHEMBL148745,11 1,12 1,13 1,14 1,16 1,17 1,21 1,23 1,24 1,25 1,26 1,28 1,38 1,52 7.699}
{0 CHEMBL149313,11 1,12 1,13 1,14 1,16 1,17 1,23 1,24 1,25 1,26 1,38 1,52 6.77}
{0 CHEMBL149604,6 1,11 1,12 1,13 1,14 1,16 1,17 1,23 1,24 1,25 1,26 1,28 1,38 1,52 6.409}
{0 CHEMBL149873,6 1,11 1,12 1,13 1,14 1,16 1,17 1,23 1,24 1,25 1,26 1,28 1,38 1,52 6.638}
{0 CHEMBL150264,5 1,6 1,11 1,12 1,13 1,14 1,16 1,17 1,23 1,24 1,25 1,26 1,28 1,38 1,52 6.301}
{0 CHEMBL150422,6 1,11 1,12 1,13 1,14 1,16 1,17 1,23 1,24 1,25 1,26 1,28 1,32 1,38 1,52 5.481}
{0 CHEMBL151731,6 1,11 1,12 1,13 1,14 1,16 1,17 1,23 1,24 1,25 1,26 1,28 1,38 1,52 5.638}
{0 CHEMBL151800,11 1,12 1,13 1,14 1,16 1,17 1,23 1,24 1,25 1,26 1,28 1,38 1,52 7.301}
{0 CHEMBL151822,6 1,11 1,12 1,13 1,14 1,16 1,17 1,23 1,24 1,25 1,26 1,28 1,38 1,52 7.699}
{0 CHEMBL151823,6 1,11 1,12 1,13 1,14 1,16 1,17 1,23 1,24 1,25 1,26 1,28 1,38 1,52 4.456}
{0 CHEMBL1614701,1 1,2 1,3 1,4 1,9 1,10 1,15 1,19 1,20 1,21 1,26 1,36 1,38 1,52 5}
{0 CHEMBL162,6 1,38 1,52 8.31}
{0 CHEMBL1721885,1 1,2 1,3 1,4 1,6 1,8 1,19 1,20 1,32 1,38 1,39 1,52 5}
{0 CHEMBL177308,6 1,11 1,12 1,13 1,14 1,16 1,17 1,21 1,23 1,24 1,25 1,26 1,28 1,38 1,52 8}
{0 CHEMBL177635,6 1,11 1,12 1,13 1,14 1,16 1,17 1,21 1,23 1,24 1,25 1,26 1,28 1,38 1,52 8.398}
{0 CHEMBL1789941,1 1,10 1,15 1,38 1,39 1,52 5}
{0 CHEMBL1794808,6 1,11 1,12 1,13 1,14 1,16 1,17 1,21 1,23 1,24 1,25 1,26 1,27 1,28 1,38 1,52 8.523}
{0 CHEMBL180022,1 1,2 1,3 1,4 1,5 1,8 1,9 1,10 1,20 1,22 1,33 1,38 1,39 1,52 5}
{0 CHEMBL1800956,3 1,5 1,6 1,38 1,39 1,44 1,50 1,52 6.194}
{0 CHEMBL1807163,5 1,6 1,20 1,38 1,52 6.444}
{0 CHEMBL1908391,4 1,7 1,8 1,9 1,10 1,19 1,20 1,32 1,37 1,38 1,39 1,52 5}
{0 CHEMBL1908392,5 1,20 1,23 1,38 1,39 1,45 1,52 5}
{0 CHEMBL1908393,1 1,2 1,3 1,4 1,5 1,6 1,8 1,10 1,20 1,22 1,31 1,38 1,39 1,52 5}
{0 CHEMBL1908394,2 1,5 1,10 1,15 1,19 1,36 1,38 1,39 1,52 5}
{0 CHEMBL1908395,3 1,4 1,8 1,10 1,20 1,38 1,39 1,52 5}
{0 CHEMBL1908396,4 1,5 1,6 1,8 1,10 1,17 1,20 1,22 1,31 1,38 1,52 5}
{0 CHEMBL1908397,6 1,24 1,38 1,41 1,52 5}
{0 CHEMBL191003,1 1,2 1,3 1,4 1,7 1,9 1,10 1,19 1,20 1,32 1,33 1,38 1,52 5}
{0 CHEMBL1929238,1 1,2 1,3 1,4 1,8 1,10 1,19 1,20 1,38 1,39 1,43 1,52 4.523}
{0 CHEMBL1996510,6 1,10 1,20 1,38 1,52 9}
{0 CHEMBL206866,5 1,6 1,38 1,52 6.848}
{0 CHEMBL208637,8 1,10 1,20 1,28 1,30 1,34 1,38 1,39 1,52 5.081}
{0 CHEMBL210032,8 1,10 1,20 1,30 1,34 1,38 1,39 1,52 5.081}
{0 CHEMBL210618,5 1,8 1,10 1,20 1,28 1,30 1,31 1,34 1,38 1,39 1,52 5.081}
{0 CHEMBL210928,1 1,2 1,3 1,5 1,8 1,10 1,11 1,20 1,28 1,30 1,31 1,34 1,38 1,52 5.081}
{0 CHEMBL210963,5 1,8 1,10 1,11 1,20 1,28 1,30 1,31 1,34 1,38 1,39 1,52 5.081}
{0 CHEMBL2147531,8 1,10 1,38 1,52 6.129}
{0 CHEMBL2147532,8 1,10 1,38 1,52 6.397}
{0 CHEMBL2147533,8 1,10 1,38 1,52 6}
{0 CHEMBL2147534,8 1,10 1,20 1,36 1,38 1,52 7.268}
{0 CHEMBL2147535,8 1,10 1,38 1,52 7.569}
{0 CHEMBL2147536,10 1,28 1,38 1,48 1,52 7.086}
{0 CHEMBL2147537,8 1,10 1,38 1,52 8.699}
{0 CHEMBL2147538,8 1,10 1,38 1,52 8.046}
{0 CHEMBL2147539,8 1,10 1,38 1,52 6.345}
{0 CHEMBL2147540,10 1,38 1,48 1,52 7.469}
{0 CHEMBL2147541,6 1,8 1,10 1,38 1,50 1,52 7.032}
{0 CHEMBL2147542,6 1,10 1,38 1,48 1,52 8.398}
{0 CHEMBL2147543,10 1,38 1,48 1,52 7.886}
{0 CHEMBL2147544,8 1,10 1,38 1,52 8}
{0 CHEMBL2147545,8 1,10 1,38 1,52 6.726}
{0 CHEMBL2147546,6 1,10 1,38 1,48 1,52 6.134}
{0 CHEMBL2147547,8 1,10 1,38 1,52 6}
{0 CHEMBL2147548,8 1,10 1,38 1,52 7.222}
{0 CHEMBL2147549,8 1,10 1,30 1,38 1,52 6.064}
{0 CHEMBL2147550,1 1,2 1,3 1,8 1,10 1,38 1,52 7.745}
{0 CHEMBL2147551,1 1,2 1,3 1,8 1,10 1,38 1,52 7.824}
{0 CHEMBL2147552,8 1,10 1,38 1,52 7.284}
{0 CHEMBL2148106,11 1,12 1,16 1,23 1,26 1,27 1,28 1,38 1,40 1,52 9.959}
{0 CHEMBL2148107,11 1,12 1,16 1,23 1,26 1,38 1,52 8.229}
{0 CHEMBL2148108,11 1,12 1,16 1,23 1,26 1,38 1,52 9.347}
{0 CHEMBL2151406,6 1,10 1,20 1,38 1,39 1,52 6.706}
{0 CHEMBL2151407,1 1,2 1,3 1,6 1,10 1,19 1,20 1,38 1,39 1,52 6.695}
{0 CHEMBL2151408,1 1,2 1,3 1,6 1,10 1,19 1,20 1,38 1,39 1,52 8.041}
{0 CHEMBL2151409,1 1,2 1,3 1,6 1,10 1,19 1,20 1,38 1,39 1,52 7.721}
{0 CHEMBL2151410,1 1,2 1,3 1,6 1,10 1,19 1,20 1,38 1,39 1,52 7.77}
{0 CHEMBL2151411,6 1,10 1,20 1,38 1,39 1,52 8.77}
{0 CHEMBL2151412,6 1,10 1,28 1,38 1,39 1,52 7.699}
{0 CHEMBL2151413,6 1,10 1,28 1,38 1,39 1,52 7.959}
{0 CHEMBL2151414,6 1,10 1,20 1,38 1,39 1,52 7.187}
{0 CHEMBL2151415,6 1,10 1,28 1,38 1,52 8.481}
{0 CHEMBL215152,1 1,2 1,3 1,4 1,5 1,8 1,9 1,10 1,15 1,19 1,20 1,22 1,36 1,38 1,39 1,41 1,52 5}
{0 CHEMBL2153747,6 1,10 1,20 1,28 1,38 1,39 1,52 6.928}
{0 CHEMBL2153748,6 1,10 1,20 1,38 1,39 1,52 8.208}
{0 CHEMBL2153749,6 1,10 1,20 1,38 1,39 1,52 8.036}
{0 CHEMBL2153750,1 1,2 1,3 1,6 1,10 1,19 1,20 1,38 1,39 1,52 8.721}
{0 CHEMBL2153751,1 1,2 1,3 1,6 1,10 1,19 1,20 1,38 1,39 1,52 8.268}
{0 CHEMBL2153752,6 1,10 1,20 1,38 1,39 1,52 7.602}
{0 CHEMBL2153753,4 1,6 1,10 1,20 1,38 1,39 1,52 6.548}
{0 CHEMBL2153754,6 1,10 1,20 1,38 1,39 1,40 1,52 6.5}
{0 CHEMBL2153755,1 1,2 1,3 1,6 1,10 1,19 1,20 1,38 1,39 1,48 1,52 8.046}
{0 CHEMBL2153756,1 1,2 1,3 1,6 1,10 1,19 1,20 1,38 1,39 1,48 1,52 6.717}
{0 CHEMBL215803,5 1,10 1,23 1,38 1,39 1,52 6}
{0 CHEMBL221959,10 1,15 1,38 1,39 1,47 1,52 5}
{0 CHEMBL223360,1 1,2 1,3 1,4 1,8 1,19 1,20 1,35 1,38 1,41 1,52 5}
{0 CHEMBL230006,3 1,38 1,44 1,52 6.602}
{0 CHEMBL230011,7 1,10 1,12 1,16 1,23 1,26 1,52 5}
{0 CHEMBL2309006,6 1,38 1,44 1,52 6.854}
{0 CHEMBL2309609,6 1,24 1,38 1,45 1,52 6.538}
{0 CHEMBL2310935,6 1,11 1,12 1,13 1,14 1,16 1,23 1,24 1,25 1,26 1,28 1,38 1,45 1,52 4.509}
{0 CHEMBL23254,1 1,2 1,3 1,4 1,7 1,8 1,9 1,10 1,15 1,20 1,22 1,28 1,33 1,35 1,36 1,38 1,52 4}
{0 CHEMBL2326002,1 1,2 1,3 1,6 1,10 1,20 1,38 1,41 1,48 1,52 8.456}
{0 CHEMBL23327,1 1,2 1,3 1,4 1,7 1,8 1,9 1,10 1,15 1,19 1,20 1,22 1,33 1,35 1,36 1,38 1,52 4}
{0 CHEMBL2333365,1 1,2 1,3 1,5 1,10 1,11 1,38 1,43 1,45 1,52 5}
{0 CHEMBL24828,1 1,2 1,3 1,4 1,5 1,9 1,10 1,15 1,19 1,20 1,22 1,31 1,35 1,36 1,38 1,39 1,52 5}
{0 CHEMBL249697,8 1,10 1,38 1,52 5}
{0 CHEMBL255863,2 1,7 1,8 1,9 1,10 1,15 1,20 1,32 1,37 1,38 1,52 5}
{0 CHEMBL259084,1 1,2 1,3 1,4 1,7 1,9 1,10 1,19 1,20 1,28 1,32 1,33 1,37 1,38 1,52 5}
{0 CHEMBL259922,8 1,9 1,10 1,15 1,20 1,35 1,38 1,52 4.398}
{0 CHEMBL261387,2 1,5 1,6 1,38 1,52 7.527}
{0 CHEMBL261849,5 1,7 1,10 1,22 1,31 1,37 1,38 1,52 5}
{0 CHEMBL262980,2 1,6 1,11 1,12 1,13 1,14 1,16 1,17 1,21 1,23 1,24 1,25 1,26 1,27 1,28 1,38 1,52 8}
{0 CHEMBL263910,6 1,11 1,12 1,13 1,14 1,16 1,17 1,21 1,23 1,24 1,25 1,26 1,28 1,38 1,52 7.301}
{0 CHEMBL265559,6 1,11 1,12 1,13 1,14 1,16 1,17 1,21 1,23 1,24 1,25 1,26 1,28 1,38 1,52 8.398}
{0 CHEMBL265998,38 1,52 7.827}
{0 CHEMBL271403,5 1,6 1,38 1,52 8.004}
{0 CHEMBL27266,5 1,6 1,8 1,20 1,38 1,52 5.424}
{0 CHEMBL27768,8 1,38 1,52 9.046}
{0 CHEMBL278041,1 1,2 1,3 1,10 1,12 1,16 1,19 1,23 1,26 1,52 5}
{0 CHEMBL28205,5 1,6 1,8 1,38 1,52 5.604}
{0 CHEMBL288441,1 1,2 1,3 1,5 1,9 1,10 1,20 1,22 1,31 1,38 1,39 1,52 5}
{0 CHEMBL291975,6 1,19 1,28 1,38 1,39 1,52 7.377}
{0 CHEMBL292495,6 1,28 1,38 1,52 6.523}
{0 CHEMBL293500,6 1,11 1,12 1,13 1,14 1,16 1,23 1,25 1,26 1,28 1,38 1,52 5.638}
{0 CHEMBL293805,6 1,28 1,38 1,52 5.097}
{0 CHEMBL294303,6 1,11 1,12 1,13 1,14 1,16 1,23 1,25 1,26 1,27 1,28 1,38 1,52 7.523}
{0 CHEMBL295806,11 1,12 1,13 1,14 1,16 1,17 1,21 1,23 1,24 1,25 1,26 1,28 1,38 1,52 8.262}
{0 CHEMBL296468,6 1,7 1,8 1,10 1,37 1,38 1,52 5}
{0 CHEMBL296682,1 1,2 1,3 1,7 1,10 1,12 1,13 1,19 1,20 1,23 1,26 1,37 1,52 5.886}
{0 CHEMBL300138,6 1,10 1,19 1,28 1,38 1,39 1,52 6.398}
{0 CHEMBL300422,6 1,11 1,12 1,13 1,14 1,16 1,17 1,21 1,23 1,24 1,25 1,26 1,28 1,38 1,52 5.367}
{0 CHEMBL300549,6 1,19 1,28 1,38 1,39 1,52 6.301}
{0 CHEMBL300936,6 1,7 1,8 1,10 1,37 1,38 1,52 4.456}
{0 CHEMBL301860,6 1,28 1,38 1,39 1,52 6.886}
{0 CHEMBL302304,6 1,11 1,12 1,13 1,14 1,16 1,17 1,21 1,23 1,24 1,25 1,26 1,38 1,52 7.301}
{0 CHEMBL302998,6 1,11 1,12 1,13 1,14 1,16 1,17 1,21 1,23 1,24 1,25 1,26 1,27 1,28 1,38 1,52 7.222}
{0 CHEMBL303205,6 1,11 1,12 1,13 1,14 1,16 1,17 1,21 1,23 1,24 1,25 1,26 1,27 1,28 1,38 1,52 6.081}
{0 CHEMBL304175,6 1,11 1,12 1,13 1,14 1,16 1,17 1,21 1,23 1,24 1,25 1,26 1,38 1,52 8.398}
{0 CHEMBL304549,6 1,11 1,12 1,13 1,14 1,16 1,17 1,21 1,23 1,24 1,25 1,26 1,27 1,28 1,38 1,52 7.222}
{0 CHEMBL304626,6 1,11 1,12 1,13 1,14 1,16 1,17 1,21 1,23 1,24 1,25 1,26 1,38 1,52 7.796}
{0 CHEMBL305667,6 1,11 1,12 1,13 1,14 1,16 1,17 1,21 1,23 1,24 1,25 1,26 1,28 1,38 1,52 5.347}
{0 CHEMBL305718,6 1,11 1,12 1,13 1,14 1,16 1,17 1,21 1,23 1,24 1,25 1,26 1,27 1,28 1,38 1,52 6.097}
{0 CHEMBL306170,6 1,11 1,12 1,13 1,14 1,16 1,17 1,21 1,23 1,24 1,25 1,26 1,28 1,38 1,52 6.509}
{0 CHEMBL306373,6 1,11 1,12 1,13 1,14 1,16 1,17 1,21 1,23 1,24 1,25 1,26 1,27 1,28 1,38 1,52 8}
{0 CHEMBL306427,6 1,11 1,12 1,13 1,14 1,16 1,17 1,21 1,23 1,24 1,25 1,26 1,27 1,28 1,38 1,52 8.699}
{0 CHEMBL306580,6 1,11 1,12 1,13 1,14 1,16 1,17 1,21 1,23 1,24 1,25 1,26 1,27 1,28 1,38 1,52 8.523}
{0 CHEMBL306623,6 1,11 1,12 1,13 1,14 1,16 1,17 1,21 1,23 1,24 1,25 1,26 1,27 1,28 1,38 1,52 7.208}
{0 CHEMBL306883,6 1,11 1,12 1,13 1,14 1,16 1,17 1,21 1,23 1,24 1,25 1,26 1,27 1,28 1,38 1,39 1,52 5.578}
{0 CHEMBL306884,6 1,11 1,12 1,13 1,14 1,16 1,17 1,21 1,23 1,24 1,25 1,26 1,28 1,38 1,39 1,52 6.31}
{0 CHEMBL307543,6 1,11 1,12 1,13 1,14 1,16 1,17 1,21 1,23 1,24 1,25 1,26 1,38 1,52 7.699}
{0 CHEMBL307708,6 1,11 1,12 1,13 1,14 1,16 1,17 1,21 1,23 1,24 1,25 1,26 1,27 1,28 1,38 1,52 8.523}
{0 CHEMBL307747,6 1,11 1,12 1,13 1,14 1,16 1,17 1,21 1,23 1,24 1,25 1,26 1,27 1,28 1,38 1,52 7.658}
{0 CHEMBL308263,6 1,11 1,12 1,13 1,14 1,16 1,17 1,21 1,23 1,24 1,25 1,26 1,27 1,28 1,38 1,52 8.523}
{0 CHEMBL309034,6 1,11 1,12 1,13 1,14 1,16 1,17 1,21 1,23 1,24 1,25 1,26 1,27 1,28 1,38 1,52 8.398}
{0 CHEMBL309078,6 1,11 1,12 1,13 1,14 1,16 1,17 1,21 1,23 1,24 1,25 1,26 1,28 1,38 1,52 6.509}
{0 CHEMBL311399,6 1,11 1,12 1,13 1,14 1,16 1,17 1,21 1,23 1,24 1,25 1,26 1,27 1,28 1,38 1,52 7.658}
{0 CHEMBL311543,6 1,28 1,38 1,52 7.509}
{0 CHEMBL312067,6 1,11 1,12 1,13 1,14 1,16 1,17 1,21 1,23 1,24 1,25 1,26 1,27 1,28 1,38 1,52 6.886}
{0 CHEMBL315357,6 1,28 1,38 1,39 1,52 5.77}
{0 CHEMBL315389,6 1,28 1,38 1,52 5.721}
{0 CHEMBL316239,6 1,28 1,38 1,52 6.62}
{0 CHEMBL318971,5 1,38 1,52 5}
{0 CHEMBL31965,1 1,2 1,3 1,4 1,5 1,8 1,9 1,10 1,15 1,19 1,20 1,22 1,33 1,35 1,36 1,38 1,39 1,52 5}
{0 CHEMBL328229,6 1,28 1,38 1,52 5.602}
{0 CHEMBL343362,6 1,11 1,12 1,13 1,14 1,16 1,17 1,23 1,24 1,25 1,26 1,28 1,38 1,52 4.745}
{0 CHEMBL345767,6 1,11 1,12 1,13 1,14 1,16 1,17 1,23 1,24 1,25 1,26 1,28 1,38 1,52 8.523}
{0 CHEMBL358264,6 1,11 1,12 1,13 1,14 1,16 1,17 1,23 1,24 1,25 1,26 1,28 1,38 1,52 7.699}
{0 CHEMBL367127,6 1,11 1,12 1,13 1,14 1,16 1,17 1,21 1,23 1,24 1,25 1,26 1,28 1,38 1,52 7.301}
{0 CHEMBL367162,6 1,11 1,12 1,13 1,14 1,16 1,17 1,23 1,24 1,25 1,26 1,28 1,38 1,52 7.602}
{0 CHEMBL367488,6 1,11 1,12 1,13 1,14 1,16 1,17 1,21 1,23 1,24 1,25 1,26 1,27 1,28 1,38 1,52 6.585}
{0 CHEMBL377300,1 1,2 1,3 1,5 1,10 1,11 1,15 1,20 1,38 1,52 5}
{0 CHEMBL377734,1 1,2 1,3 1,6 1,7 1,8 1,9 1,10 1,20 1,37 1,38 1,40 1,52 4.398}
{0 CHEMBL378627,5 1,8 1,10 1,11 1,20 1,30 1,31 1,34 1,38 1,39 1,52 5.081}
{0 CHEMBL379218,5 1,10 1,38 1,41 1,52 8.022}
{0 CHEMBL384304,1 1,2 1,3 1,5 1,7 1,8 1,10 1,19 1,25 1,31 1,37 1,38 1,39 1,52 5}
{0 CHEMBL386051,1 1,2 1,3 1,4 1,5 1,7 1,9 1,10 1,19 1,20 1,31 1,32 1,33 1,37 1,38 1,52 5}
{0 CHEMBL399981,5 1,6 1,8 1,38 1,52 9.469}
{0 CHEMBL401369,5 1,6 1,38 1,52 7.602}
{0 CHEMBL402818,4 1,9 1,10 1,20 1,38 1,39 1,43 1,52 7.208}
{0 CHEMBL417051,6 1,11 1,12 1,13 1,14 1,16 1,17 1,21 1,23 1,24 1,25 1,26 1,27 1,28 1,38 1,52 8.699}
{0 CHEMBL419866,6 1,28 1,38 1,39 1,52 6.456}
{0 CHEMBL421790,11 1,12 1,13 1,14 1,16 1,17 1,23 1,24 1,25 1,26 1,28 1,38 1,39 1,52 5.854}
{0 CHEMBL421866,6 1,11 1,12 1,13 1,14 1,16 1,17 1,21 1,23 1,24 1,25 1,26 1,27 1,28 1,38 1,52 8.523}
{0 CHEMBL422056,6 1,11 1,12 1,13 1,14 1,16 1,17 1,21 1,23 1,24 1,25 1,26 1,28 1,38 1,52 8.398}
{0 CHEMBL427118,6 1,11 1,12 1,13 1,14 1,16 1,17 1,21 1,23 1,24 1,25 1,26 1,27 1,28 1,38 1,52 9.222}
{0 CHEMBL428690,1 1,2 1,3 1,5 1,19 1,23 1,26 1,38 1,39 1,52 4.347}
{0 CHEMBL431568,6 1,11 1,12 1,13 1,14 1,16 1,17 1,21 1,23 1,24 1,25 1,26 1,27 1,38 1,52 6.585}
{0 CHEMBL431955,6 1,11 1,12 1,13 1,14 1,16 1,17 1,21 1,23 1,24 1,25 1,26 1,27 1,28 1,38 1,52 7.699}
{0 CHEMBL432130,6 1,28 1,38 1,39 1,52 7.284}
{0 CHEMBL432168,6 1,11 1,12 1,13 1,14 1,16 1,17 1,21 1,23 1,24 1,25 1,26 1,27 1,28 1,38 1,52 8.523}
{0 CHEMBL433101,6 1,11 1,12 1,13 1,14 1,16 1,17 1,23 1,24 1,25 1,26 1,28 1,38 1,52 7.699}
{0 CHEMBL439996,11 1,12 1,13 1,14 1,16 1,17 1,23 1,24 1,25 1,26 1,28 1,38 1,52 6.602}
{0 CHEMBL440084,5 1,10 1,22 1,38 1,52 5}
{0 CHEMBL441802,6 1,11 1,12 1,13 1,14 1,16 1,17 1,21 1,23 1,24 1,25 1,26 1,27 1,28 1,38 1,52 7.523}
{0 CHEMBL441897,5 1,6 1,38 1,52 6.652}
{0 CHEMBL444877,6 1,11 1,12 1,13 1,14 1,16 1,17 1,21 1,23 1,24 1,25 1,26 1,28 1,38 1,52 4.456}
{0 CHEMBL445813,1 1,2 1,3 1,6 1,8 1,19 1,20 1,38 1,41 1,52 5}
{0 CHEMBL45053,27 1,38 1,52 7.154}
{0 CHEMBL450786,1 1,2 1,3 1,4 1,8 1,19 1,20 1,32 1,38 1,39 1,52 5}
{0 CHEMBL46053,27 1,38 1,52 6.301}
{0 CHEMBL46252,27 1,38 1,52 7.629}
{0 CHEMBL464552,1 1,2 1,3 1,4 1,5 1,6 1,7 1,9 1,10 1,19 1,20 1,31 1,32 1,35 1,38 1,39 1,52 5}
{0 CHEMBL467069,4 1,5 1,9 1,10 1,20 1,38 1,39 1,52 6.347}
{0 CHEMBL467321,4 1,5 1,9 1,10 1,20 1,38 1,39 1,52 6.027}
{0 CHEMBL475251,1 1,2 1,3 1,5 1,7 1,8 1,9 1,10 1,20 1,22 1,31 1,32 1,33 1,34 1,37 1,38 1,52 5}
{0 CHEMBL477772,4 1,5 1,7 1,9 1,10 1,14 1,20 1,32 1,33 1,37 1,38 1,52 5}
{0 CHEMBL477817,4 1,7 1,9 1,10 1,20 1,38 1,39 1,52 4.292}
{0 CHEMBL483321,4 1,5 1,6 1,9 1,10 1,15 1,20 1,33 1,35 1,36 1,38 1,52 5}
{0 CHEMBL48546,6 1,11 1,12 1,13 1,14 1,16 1,17 1,21 1,23 1,24 1,25 1,26 1,38 1,52 6.301}
{0 CHEMBL48636,6 1,11 1,12 1,13 1,14 1,16 1,17 1,21 1,23 1,24 1,25 1,26 1,27 1,28 1,38 1,52 9.111}
{0 CHEMBL48665,11 1,12 1,13 1,14 1,16 1,17 1,21 1,23 1,24 1,25 1,26 1,38 1,52 7.398}
{0 CHEMBL48988,5 1,11 1,12 1,13 1,14 1,16 1,17 1,21 1,23 1,24 1,25 1,26 1,28 1,38 1,52 8}
{0 CHEMBL491473,1 1,2 1,3 1,5 1,10 1,15 1,20 1,22 1,31 1,36 1,38 1,39 1,52 5}
{0 CHEMBL492251,4 1,5 1,9 1,10 1,20 1,22 1,31 1,33 1,38 1,39 1,52 4.786}
{0 CHEMBL49354,6 1,11 1,12 1,13 1,14 1,16 1,17 1,21 1,23 1,24 1,25 1,26 1,27 1,28 1,38 1,52 7.35}
{0 CHEMBL494089,5 1,6 1,10 1,38 1,52 8.66}
{0 CHEMBL509032,1 1,2 1,3 1,4 1,5 1,7 1,9 1,10 1,20 1,31 1,32 1,35 1,37 1,38 1,39 1,52 5}
{0 CHEMBL513909,4 1,5 1,6 1,7 1,9 1,10 1,20 1,31 1,32 1,37 1,38 1,39 1,52 5}
{0 CHEMBL521851,10 1,19 1,20 1,38 1,39 1,41 1,52 5}
{0 CHEMBL522892,1 1,2 1,3 1,4 1,5 1,8 1,10 1,19 1,20 1,32 1,38 1,39 1,52 5}
{0 CHEMBL525191,10 1,38 1,43 1,52 5}
{0 CHEMBL52529,6 1,11 1,12 1,13 1,14 1,16 1,17 1,21 1,23 1,24 1,25 1,26 1,27 1,28 1,38 1,52 9.111}
{0 CHEMBL52654,6 1,20 1,28 1,38 1,39 1,52 7.398}
{0 CHEMBL535,1 1,2 1,3 1,4 1,6 1,8 1,19 1,20 1,32 1,38 1,39 1,52 5}
{0 CHEMBL53596,6 1,28 1,38 1,39 1,52 7.301}
{0 CHEMBL54382,6 1,28 1,38 1,39 1,52 7.398}
{0 CHEMBL553,4 1,5 1,9 1,10 1,15 1,20 1,22 1,33 1,35 1,36 1,38 1,45 1,52 5}
{0 CHEMBL55394,6 1,28 1,38 1,39 1,52 7.301}
{0 CHEMBL554,1 1,2 1,3 1,4 1,5 1,6 1,9 1,10 1,15 1,19 1,20 1,22 1,33 1,35 1,36 1,38 1,52 5}
{0 CHEMBL55788,6 1,28 1,38 1,52 6.699}
{0 CHEMBL558752,2 1,4 1,5 1,7 1,8 1,9 1,10 1,20 1,32 1,33 1,38 1,52 5}
{0 CHEMBL565612,6 1,10 1,20 1,38 1,39 1,52 8.215}
{0 CHEMBL565632,5 1,6 1,20 1,38 1,39 1,52 7.959}
{0 CHEMBL566424,6 1,10 1,28 1,38 1,39 1,52 6.533}
{0 CHEMBL566853,5 1,6 1,20 1,38 1,39 1,52 7.328}
{0 CHEMBL567124,4 1,5 1,9 1,10 1,18 1,20 1,29 1,38 1,39 1,52 6.481}
{0 CHEMBL568580,5 1,6 1,20 1,38 1,39 1,52 7.602}
{0 CHEMBL570865,10 1,19 1,38 1,39 1,44 1,52 6.854}
{0 CHEMBL571581,4 1,9 1,10 1,19 1,20 1,38 1,39 1,52 7.481}
{0 CHEMBL572878,4 1,5 1,8 1,9 1,10 1,19 1,20 1,38 1,39 1,41 1,52 5}
{0 CHEMBL572881,4 1,8 1,10 1,20 1,38 1,52 5}
{0 CHEMBL573339,10 1,12 1,16 1,23 1,26 1,38 1,52 5}
{0 CHEMBL574738,2 1,4 1,5 1,8 1,10 1,15 1,19 1,20 1,30 1,38 1,39 1,52 5}
{0 CHEMBL576982,4 1,5 1,8 1,10 1,20 1,25 1,38 1,39 1,52 5}
{0 CHEMBL584483,6 1,28 1,38 1,39 1,52 6.457}
{0 CHEMBL584817,6 1,10 1,20 1,38 1,52 5.594}
{0 CHEMBL585281,6 1,28 1,38 1,39 1,41 1,52 6.502}
{0 CHEMBL585500,5 1,6 1,20 1,38 1,39 1,52 7.444}
{0 CHEMBL590109,7 1,10 1,18 1,20 1,37 1,38 1,41 1,52 7.009}
{0 CHEMBL593619,4 1,6 1,9 1,10 1,18 1,20 1,29 1,38 1,39 1,52 6.26}
{0 CHEMBL593883,4 1,9 1,10 1,18 1,20 1,29 1,38 1,39 1,52 7}
{0 CHEMBL595048,4 1,6 1,9 1,10 1,18 1,20 1,29 1,38 1,39 1,52 7.056}
{0 CHEMBL59677,6 1,11 1,12 1,13 1,14 1,16 1,23 1,25 1,26 1,28 1,38 1,52 8.523}
{0 CHEMBL59687,6 1,11 1,12 1,13 1,14 1,16 1,23 1,25 1,26 1,28 1,38 1,52 7.301}
{0 CHEMBL59828,6 1,11 1,12 1,13 1,14 1,16 1,17 1,21 1,23 1,24 1,25 1,26 1,28 1,38 1,52 8.398}
{0 CHEMBL601719,1 1,2 1,3 1,5 1,6 1,10 1,19 1,38 1,52 5}
{0 CHEMBL60254,6 1,11 1,12 1,13 1,14 1,16 1,17 1,21 1,23 1,24 1,25 1,26 1,27 1,28 1,38 1,52 7.679}
{0 CHEMBL603418,4 1,6 1,9 1,10 1,18 1,20 1,29 1,38 1,39 1,52 6.721}
{0 CHEMBL60455,6 1,11 1,12 1,13 1,14 1,16 1,17 1,23 1,24 1,25 1,26 1,28 1,38 1,52 7.699}
{0 CHEMBL606245,4 1,9 1,10 1,18 1,20 1,29 1,38 1,39 1,52 6.456}
{0 CHEMBL607707,1 1,2 1,3 1,4 1,5 1,8 1,9 1,10 1,19 1,20 1,22 1,33 1,38 1,39 1,52 5}
{0 CHEMBL608154,1 1,2 1,3 1,5 1,8 1,10 1,20 1,31 1,38 1,52 5}
{0 CHEMBL63262,5 1,20 1,38 1,52 5.666}
{0 CHEMBL66452,6 1,11 1,12 1,13 1,14 1,16 1,17 1,21 1,23 1,24 1,25 1,26 1,27 1,38 1,52 7.284}
{0 CHEMBL66750,6 1,11 1,12 1,13 1,14 1,16 1,17 1,21 1,23 1,24 1,25 1,26 1,38 1,52 7.398}
{0 CHEMBL66923,6 1,11 1,12 1,13 1,14 1,16 1,17 1,21 1,23 1,24 1,25 1,26 1,27 1,38 1,52 6.398}
{0 CHEMBL67290,6 1,11 1,12 1,13 1,14 1,16 1,17 1,21 1,23 1,24 1,25 1,26 1,27 1,28 1,38 1,52 8.523}
{0 CHEMBL67442,6 1,11 1,12 1,13 1,14 1,16 1,17 1,21 1,23 1,24 1,25 1,26 1,27 1,28 1,38 1,52 7.072}
{0 CHEMBL67528,6 1,11 1,12 1,13 1,14 1,16 1,17 1,21 1,23 1,24 1,25 1,26 1,38 1,52 7.854}
{0 CHEMBL67716,6 1,11 1,12 1,13 1,14 1,16 1,17 1,21 1,23 1,24 1,25 1,26 1,27 1,28 1,38 1,52 8.398}
{0 CHEMBL67788,6 1,11 1,12 1,13 1,14 1,16 1,17 1,21 1,23 1,24 1,25 1,26 1,27 1,28 1,38 1,52 7}
{0 CHEMBL68418,6 1,11 1,12 1,13 1,14 1,16 1,17 1,21 1,23 1,24 1,25 1,26 1,38 1,52 7.301}
{0 CHEMBL70078,6 1,11 1,12 1,13 1,14 1,16 1,17 1,21 1,23 1,24 1,25 1,26 1,27 1,28 1,38 1,52 8}
{0 CHEMBL71331,6 1,11 1,12 1,13 1,14 1,16 1,17 1,21 1,23 1,24 1,25 1,26 1,27 1,28 1,38 1,52 9}
{0 CHEMBL72480,6 1,11 1,12 1,13 1,14 1,16 1,17 1,21 1,23 1,24 1,25 1,26 1,28 1,38 1,52 5.721}
{0 CHEMBL7463,6 1,20 1,28 1,38 1,39 1,52 8}
{0 CHEMBL75004,6 1,11 1,12 1,13 1,14 1,16 1,17 1,21 1,23 1,24 1,25 1,26 1,27 1,28 1,38 1,52 7.699}
{0 CHEMBL75661,6 1,11 1,12 1,13 1,14 1,16 1,17 1,21 1,23 1,24 1,25 1,26 1,27 1,28 1,38 1,52 8.699}
{0 CHEMBL76537,6 1,11 1,12 1,13 1,14 1,16 1,17 1,21 1,23 1,24 1,25 1,26 1,27 1,28 1,38 1,52 7}
{0 CHEMBL76920,6 1,11 1,12 1,13 1,14 1,16 1,17 1,21 1,23 1,24 1,25 1,26 1,27 1,28 1,38 1,52 8.398}
{0 CHEMBL77399,6 1,11 1,12 1,13 1,14 1,16 1,17 1,21 1,23 1,24 1,25 1,26 1,27 1,28 1,38 1,52 7.046}
{0 CHEMBL77970,6 1,11 1,12 1,13 1,14 1,16 1,17 1,21 1,23 1,24 1,25 1,26 1,27 1,28 1,38 1,52 6.585}
{0 CHEMBL78129,6 1,11 1,12 1,13 1,14 1,16 1,17 1,21 1,23 1,24 1,25 1,26 1,28 1,38 1,39 1,52 7.585}
{0 CHEMBL80525,6 1,11 1,12 1,13 1,14 1,16 1,17 1,21 1,23 1,24 1,25 1,26 1,28 1,38 1,52 7.699}
{0 CHEMBL91829,6 1,28 1,38 1,39 1,52 5.745}
{0 CHEMBL91959,6 1,28 1,38 1,39 1,52 5.699}
{0 CHEMBL939,1 1,2 1,3 1,4 1,5 1,9 1,10 1,15 1,19 1,20 1,22 1,31 1,33 1,35 1,36 1,38 1,39 1,52 5}
{0 CHEMBL941,4 1,7 1,8 1,9 1,10 1,19 1,20 1,32 1,37 1,38 1,39 1,52 5}
