"molecule_id","FCFP4_1024b702","FCFP4_1024b445","FCFP4_1024b496","FCFP4_1024b640","FCFP4_1024b679","FCFP4_1024b938","FCFP4_1024b847","FCFP4_1024b214","FCFP4_1024b44","FCFP4_1024b492","FCFP4_1024b676","FCFP4_1024b483","FCFP4_1024b859","FCFP4_1024b350","FCFP4_1024b908","FCFP4_1024b381","FCFP4_1024b652","FCFP4_1024b804","FCFP4_1024b603","FCFP4_1024b185","FCFP4_1024b574","FCFP4_1024b1015","FCFP4_1024b986","FCFP4_1024b1","FCFP4_1024b10","FCFP4_1024b100","FCFP4_1024b1000","FCFP4_1024b1001","FCFP4_1024b1002","FCFP4_1024b1003","FCFP4_1024b1004","FCFP4_1024b1005","FCFP4_1024b1006","FCFP4_1024b1007","FCFP4_1024b1008","FCFP4_1024b1009","FCFP4_1024b101","FCFP4_1024b1010","FCFP4_1024b1011","FCFP4_1024b1012","FCFP4_1024b1013","FCFP4_1024b1014","FCFP4_1024b1016","FCFP4_1024b1017","FCFP4_1024b1018","FCFP4_1024b1019","FCFP4_1024b102","FCFP4_1024b1020","FCFP4_1024b1021","FCFP4_1024b1022","FCFP4_1024b1023","pXC50"
{10 1,24 1,52 4}
{0 CHEMBL118502,1 1,2 1,3 1,4 1,5 1,6 1,7 1,8 1,9 1,11 1,12 1,13 1,18 1,19 1,21 1,24 1,52 8.046}
{0 CHEMBL120003,1 1,2 1,3 1,4 1,5 1,6 1,7 1,8 1,9 1,11 1,12 1,13 1,18 1,19 1,21 1,24 1,52 8.569}
{0 CHEMBL120288,1 1,2 1,3 1,4 1,5 1,6 1,7 1,8 1,9 1,11 1,12 1,13 1,18 1,19 1,21 1,24 1,52 8.444}
{0 CHEMBL120450,1 1,2 1,3 1,4 1,5 1,6 1,7 1,8 1,9 1,11 1,12 1,13 1,18 1,19 1,21 1,24 1,52 8.319}
{0 CHEMBL120753,1 1,2 1,3 1,4 1,5 1,6 1,7 1,8 1,9 1,11 1,12 1,13 1,18 1,19 1,21 1,24 1,52 8.444}
{0 CHEMBL120785,1 1,2 1,3 1,4 1,5 1,6 1,7 1,8 1,9 1,11 1,12 1,13 1,18 1,19 1,21 1,24 1,46 1,52 8.721}
{0 CHEMBL121113,1 1,2 1,3 1,4 1,5 1,6 1,7 1,8 1,9 1,11 1,12 1,13 1,18 1,19 1,21 1,24 1,29 1,52 8.678}
{0 CHEMBL121194,1 1,2 1,3 1,4 1,5 1,6 1,7 1,8 1,9 1,11 1,12 1,13 1,18 1,19 1,21 1,24 1,52 6.638}
{0 CHEMBL121311,1 1,2 1,3 1,4 1,5 1,6 1,7 1,8 1,9 1,11 1,12 1,13 1,18 1,19 1,21 1,24 1,52 5.523}
{0 CHEMBL121388,10 1,14 1,15 1,16 1,17 1,19 1,24 1,52 4}
{0 CHEMBL121461,1 1,2 1,3 1,4 1,5 1,6 1,7 1,8 1,9 1,11 1,12 1,13 1,19 1,21 1,24 1,46 1,52 8.022}
{0 CHEMBL121741,1 1,2 1,3 1,4 1,5 1,6 1,7 1,8 1,9 1,11 1,12 1,13 1,18 1,19 1,21 1,24 1,52 8.796}
{0 CHEMBL121915,10 1,14 1,15 1,16 1,17 1,19 1,24 1,52 4}
{0 CHEMBL122507,1 1,2 1,3 1,4 1,5 1,6 1,7 1,8 1,9 1,11 1,12 1,13 1,18 1,19 1,21 1,24 1,52 8.553}
{0 CHEMBL123132,10 1,14 1,15 1,16 1,17 1,19 1,24 1,52 4}
{0 CHEMBL13378,10 1,24 1,52 6}
{0 CHEMBL154535,13 1,19 1,24 1,52 4}
{0 CHEMBL1738726,10 1,11 1,14 1,15 1,20 1,24 1,52 4.005}
{0 CHEMBL177627,1 1,2 1,3 1,4 1,5 1,6 1,7 1,8 1,9 1,11 1,12 1,13 1,18 1,19 1,21 1,24 1,52 6.9}
{0 CHEMBL1812596,10 1,11 1,14 1,19 1,24 1,52 4}
{0 CHEMBL1812599,10 1,11 1,14 1,15 1,20 1,24 1,52 4}
{0 CHEMBL193087,7 1,10 1,24 1,52 7}
{0 CHEMBL198632,10 1,14 1,15 1,16 1,17 1,20 1,22 1,23 1,24 1,52 4}
{0 CHEMBL199233,10 1,14 1,15 1,16 1,17 1,20 1,22 1,23 1,24 1,52 4}
{0 CHEMBL200309,10 1,14 1,15 1,16 1,17 1,18 1,20 1,22 1,23 1,24 1,38 1,52 4}
{0 CHEMBL200337,10 1,14 1,15 1,16 1,17 1,18 1,20 1,22 1,23 1,24 1,38 1,52 4}
{0 CHEMBL200737,10 1,12 1,14 1,15 1,16 1,17 1,20 1,21 1,22 1,23 1,24 1,52 4}
{0 CHEMBL206407,10 1,14 1,15 1,16 1,17 1,20 1,22 1,23 1,24 1,52 4}
{0 CHEMBL207046,10 1,14 1,15 1,16 1,17 1,20 1,22 1,23 1,24 1,52 4}
{0 CHEMBL208483,10 1,14 1,15 1,16 1,17 1,20 1,22 1,23 1,24 1,52 4}
{0 CHEMBL2092841,19 1,24 1,52 4}
{0 CHEMBL2312396,10 1,13 1,19 1,21 1,24 1,52 4.848}
{0 CHEMBL2312397,10 1,21 1,24 1,52 4.461}
{0 CHEMBL2312398,10 1,15 1,21 1,23 1,24 1,45 1,52 4}
{0 CHEMBL2312399,7 1,10 1,15 1,21 1,23 1,24 1,45 1,52 5.063}
{0 CHEMBL2312400,10 1,15 1,21 1,23 1,24 1,45 1,52 4.51}
{0 CHEMBL2312401,7 1,10 1,21 1,24 1,52 4}
{0 CHEMBL2312402,10 1,18 1,21 1,24 1,52 4.547}
{0 CHEMBL2312403,10 1,21 1,23 1,24 1,45 1,52 6.155}
{0 CHEMBL2312680,10 1,21 1,24 1,52 4}
{0 CHEMBL2312681,10 1,13 1,18 1,19 1,21 1,24 1,52 5.517}
{0 CHEMBL2312682,10 1,21 1,24 1,25 1,52 6.252}
{0 CHEMBL2312683,10 1,21 1,24 1,52 5.485}
{0 CHEMBL2312684,10 1,13 1,21 1,24 1,52 4.963}
{0 CHEMBL2312685,10 1,13 1,21 1,24 1,52 4.08}
{0 CHEMBL2312686,11 1,13 1,19 1,21 1,24 1,52 4.662}
{0 CHEMBL260328,10 1,21 1,24 1,52 4.088}
{0 CHEMBL275040,1 1,2 1,3 1,4 1,7 1,8 1,11 1,12 1,13 1,19 1,21 1,24 1,49 1,52 7.896}
{0 CHEMBL279561,2 1,3 1,4 1,7 1,8 1,11 1,12 1,13 1,19 1,21 1,24 1,52 4.92}
{0 CHEMBL279956,10 1,14 1,19 1,24 1,30 1,48 1,52 6.877}
{0 CHEMBL28472,8 1,9 1,10 1,13 1,21 1,23 1,24 1,52 4}
{0 CHEMBL288166,7 1,10 1,21 1,24 1,52 7.8}
{0 CHEMBL30285,10 1,24 1,44 1,52 5.491}
{0 CHEMBL330771,1 1,2 1,3 1,4 1,5 1,6 1,7 1,8 1,9 1,11 1,12 1,13 1,18 1,19 1,21 1,24 1,52 6.677}
{0 CHEMBL331339,1 1,2 1,3 1,4 1,5 1,6 1,7 1,8 1,9 1,11 1,12 1,13 1,18 1,19 1,21 1,24 1,26 1,52 7.733}
{0 CHEMBL332114,1 1,2 1,3 1,4 1,5 1,6 1,7 1,8 1,9 1,11 1,12 1,13 1,18 1,19 1,21 1,24 1,52 8.208}
{0 CHEMBL332126,1 1,2 1,3 1,4 1,5 1,6 1,7 1,8 1,9 1,11 1,12 1,13 1,18 1,19 1,21 1,24 1,52 5.268}
{0 CHEMBL332168,1 1,2 1,3 1,4 1,5 1,6 1,7 1,8 1,9 1,11 1,12 1,13 1,18 1,19 1,21 1,24 1,52 8.456}
{0 CHEMBL332334,1 1,2 1,3 1,4 1,5 1,6 1,7 1,8 1,9 1,11 1,12 1,13 1,18 1,19 1,21 1,24 1,52 8.585}
{0 CHEMBL332467,1 1,2 1,3 1,4 1,5 1,6 1,7 1,8 1,9 1,11 1,12 1,13 1,18 1,19 1,21 1,24 1,52 8.114}
{0 CHEMBL332818,1 1,2 1,3 1,4 1,5 1,6 1,7 1,8 1,9 1,11 1,12 1,13 1,18 1,19 1,21 1,24 1,46 1,52 8.658}
{0 CHEMBL333015,1 1,2 1,3 1,4 1,5 1,6 1,7 1,8 1,9 1,11 1,12 1,13 1,18 1,19 1,21 1,24 1,52 8.409}
{0 CHEMBL333790,1 1,2 1,3 1,4 1,5 1,6 1,7 1,8 1,9 1,11 1,12 1,13 1,18 1,19 1,21 1,24 1,52 8.041}
{0 CHEMBL334024,1 1,2 1,3 1,4 1,5 1,6 1,7 1,8 1,9 1,11 1,12 1,13 1,18 1,19 1,21 1,24 1,52 7.796}
{0 CHEMBL334119,1 1,2 1,3 1,4 1,5 1,6 1,7 1,8 1,9 1,11 1,12 1,13 1,18 1,19 1,21 1,24 1,46 1,52 8.638}
{0 CHEMBL368275,1 1,2 1,3 1,4 1,5 1,6 1,7 1,8 1,9 1,11 1,12 1,13 1,18 1,19 1,21 1,24 1,52 7.924}
{0 CHEMBL370038,10 1,24 1,52 7.721}
{0 CHEMBL370941,7 1,10 1,24 1,52 7}
{0 CHEMBL372643,7 1,10 1,21 1,24 1,52 7}
{0 CHEMBL379442,10 1,14 1,15 1,16 1,17 1,20 1,22 1,23 1,24 1,52 4}
{0 CHEMBL380804,10 1,12 1,14 1,15 1,16 1,17 1,20 1,21 1,22 1,23 1,24 1,52 4}
{0 CHEMBL380805,10 1,12 1,14 1,15 1,16 1,17 1,18 1,20 1,21 1,22 1,23 1,24 1,52 4}
{0 CHEMBL381221,10 1,12 1,14 1,15 1,16 1,17 1,20 1,21 1,22 1,23 1,24 1,52 4}
{0 CHEMBL388746,10 1,18 1,24 1,52 7.409}
{0 CHEMBL427186,10 1,14 1,15 1,16 1,17 1,18 1,20 1,22 1,23 1,24 1,38 1,52 4}
{0 CHEMBL431657,1 1,2 1,3 1,4 1,5 1,6 1,7 1,8 1,9 1,11 1,12 1,13 1,18 1,19 1,21 1,24 1,52 7.633}
{0 CHEMBL431839,1 1,2 1,3 1,4 1,5 1,6 1,7 1,8 1,9 1,11 1,12 1,13 1,18 1,19 1,21 1,24 1,52 8.409}
{0 CHEMBL446188,10 1,14 1,15 1,16 1,17 1,18 1,20 1,22 1,23 1,24 1,52 4}
{0 CHEMBL449296,10 1,14 1,15 1,16 1,17 1,19 1,24 1,52 4}
{0 CHEMBL479804,10 1,21 1,24 1,52 5.018}
{0 CHEMBL479805,7 1,10 1,13 1,19 1,21 1,24 1,52 4.983}
{0 CHEMBL480169,10 1,13 1,18 1,19 1,21 1,24 1,52 4}
{0 CHEMBL482080,10 1,21 1,23 1,24 1,45 1,52 5.193}
{0 CHEMBL482097,1 1,2 1,3 1,4 1,7 1,8 1,11 1,12 1,13 1,19 1,21 1,24 1,49 1,52 8.23}
{0 CHEMBL492628,10 1,15 1,20 1,21 1,23 1,24 1,52 4}
{0 CHEMBL500042,10 1,19 1,21 1,24 1,52 6.915}
{0 CHEMBL518313,10 1,18 1,19 1,21 1,24 1,52 4}
{0 CHEMBL553028,7 1,8 1,9 1,10 1,21 1,23 1,24 1,52 4}
{0 CHEMBL575060,10 1,12 1,21 1,24 1,52 4.18}
{0 CHEMBL72366,10 1,24 1,52 4}
{0 CHEMBL76232,10 1,12 1,21 1,24 1,52 5.484}
{0 CHEMBL9790,15 1,18 1,23 1,24 1,25 1,40 1,52 5.979}
