{
  "data_qualities": {
    "quality": [
      {
        "name": "AutoCorrelation",
        "value": "0.04614735805710665"
      },
      {
        "name": "ClassEntropy",
        "value": []
      },
      {
        "name": "Dimensionality",
        "value": "0.4573490813648294"
      },
      {
        "name": "EquivalentNumberOfAtts",
        "value": []
      },
      {
        "name": "MajorityClassPercentage",
        "value": []
      },
      {
        "name": "MajorityClassSize",
        "value": []
      },
      {
        "name": "MaxAttributeEntropy",
        "value": []
      },
      {
        "name": "MaxKurtosisOfNumericAtts",
        "value": "3048.0000000000055"
      },
      {
        "name": "MaxMeansOfNumericAtts",
        "value": "51403.421916010375"
      },
      {
        "name": "MaxMutualInformation",
        "value": []
      },
      {
        "name": "MaxNominalAttDistinctValues",
        "value": []
      },
      {
        "name": "MaxSkewnessOfNumericAtts",
        "value": "55.208694967369546"
      },
      {
        "name": "MaxStdDevOfNumericAtts",
        "value": "61515.837922888335"
      },
      {
        "name": "MeanAttributeEntropy",
        "value": []
      },
      {
        "name": "MeanKurtosisOfNumericAtts",
        "value": "171.98906540506036"
      },
      {
        "name": "MeanMeansOfNumericAtts",
        "value": "166.15005759157617"
      },
      {
        "name": "MeanMutualInformation",
        "value": []
      },
      {
        "name": "MeanNoiseToSignalRatio",
        "value": []
      },
      {
        "name": "MeanNominalAttDistinctValues",
        "value": []
      },
      {
        "name": "MeanSkewnessOfNumericAtts",
        "value": "4.620488477573252"
      },
      {
        "name": "MeanStdDevOfNumericAtts",
        "value": "178.5415154202838"
      },
      {
        "name": "MinAttributeEntropy",
        "value": []
      },
      {
        "name": "MinKurtosisOfNumericAtts",
        "value": "-1.855060380578185"
      },
      {
        "name": "MinMeansOfNumericAtts",
        "value": "-4.969258530183727"
      },
      {
        "name": "MinMutualInformation",
        "value": []
      },
      {
        "name": "MinNominalAttDistinctValues",
        "value": []
      },
      {
        "name": "MinSkewnessOfNumericAtts",
        "value": "-55.20869496737793"
      },
      {
        "name": "MinStdDevOfNumericAtts",
        "value": "4.050741469444678E-5"
      },
      {
        "name": "MinorityClassPercentage",
        "value": []
      },
      {
        "name": "MinorityClassSize",
        "value": []
      },
      {
        "name": "NumberOfBinaryFeatures",
        "value": "0.0"
      },
      {
        "name": "NumberOfClasses",
        "value": "0.0"
      },
      {
        "name": "NumberOfFeatures",
        "value": "1394.0"
      },
      {
        "name": "NumberOfInstances",
        "value": "3048.0"
      },
      {
        "name": "NumberOfInstancesWithMissingValues",
        "value": "0.0"
      },
      {
        "name": "NumberOfMissingValues",
        "value": "0.0"
      },
      {
        "name": "NumberOfNumericFeatures",
        "value": "1393.0"
      },
      {
        "name": "NumberOfSymbolicFeatures",
        "value": "1.0"
      },
      {
        "name": "PercentageOfBinaryFeatures",
        "value": "0.0"
      },
      {
        "name": "PercentageOfInstancesWithMissingValues",
        "value": "0.0"
      },
      {
        "name": "PercentageOfMissingValues",
        "value": "0.0"
      },
      {
        "name": "PercentageOfNumericFeatures",
        "value": "99.92826398852223"
      },
      {
        "name": "PercentageOfSymbolicFeatures",
        "value": "0.07173601147776185"
      },
      {
        "name": "Quartile1AttributeEntropy",
        "value": []
      },
      {
        "name": "Quartile1KurtosisOfNumericAtts",
        "value": "0.9505140021761889"
      },
      {
        "name": "Quartile1MeansOfNumericAtts",
        "value": "0.1564960629921268"
      },
      {
        "name": "Quartile1MutualInformation",
        "value": []
      },
      {
        "name": "Quartile1SkewnessOfNumericAtts",
        "value": "-0.35775632761291"
      },
      {
        "name": "Quartile1StdDevOfNumericAtts",
        "value": "0.1303700970739186"
      },
      {
        "name": "Quartile2AttributeEntropy",
        "value": []
      },
      {
        "name": "Quartile2KurtosisOfNumericAtts",
        "value": "4.881020804177094"
      },
      {
        "name": "Quartile2MeansOfNumericAtts",
        "value": "1.8859547244094483"
      },
      {
        "name": "Quartile2MutualInformation",
        "value": []
      },
      {
        "name": "Quartile2SkewnessOfNumericAtts",
        "value": "0.842911900984607"
      },
      {
        "name": "Quartile2StdDevOfNumericAtts",
        "value": "0.3215247834664493"
      },
      {
        "name": "Quartile3AttributeEntropy",
        "value": []
      },
      {
        "name": "Quartile3KurtosisOfNumericAtts",
        "value": "53.452053298627966"
      },
      {
        "name": "Quartile3MeansOfNumericAtts",
        "value": "6.697257874015747"
      },
      {
        "name": "Quartile3MutualInformation",
        "value": []
      },
      {
        "name": "Quartile3SkewnessOfNumericAtts",
        "value": "3.6915233795445244"
      },
      {
        "name": "Quartile3StdDevOfNumericAtts",
        "value": "1.2272847476844357"
      },
      {
        "name": "StdvNominalAttDistinctValues",
        "value": []
      }
    ]
  }
}