"molecule_id","AMW","C.","H.","Me","Mi","Mp","Mv","MW","N.","nAB","nAT","nB","nBM","nBO","nBR","nBT","nC","nCL","nCsp","nCsp2","nCsp3","nDB","nF","nH","nHet","nHM","nI","nN","nO","nP","nS","nSK","nTB","nX","O.","RBF","RBN","SCBO","Se","Si","Sp","Sv","X.","pXC50"
{1 11.726,2 57.1,3 19,4 1.051,5 1.116,6 0.812,7 0.812,8 246.25,9 9.5,10 11,11 21,13 13,14 18,16 22,17 12,19 3,20 9,23 2,24 4,25 5,26 1,28 2,31 1,32 17,33 2,34 2,38 27.5,39 22.073,40 23.426,41 17.057,42 17.05,43 9.5,44 5}
{0 CHEMBL1688377,1 6.907,2 37.5,3 52.1,4 0.988,5 1.129,6 0.656,7 0.599,8 331.53,9 6.3,10 5,11 48,13 6,14 27,16 52,17 18,20 4,21 14,22 1,24 25,25 5,26 1,28 3,29 1,31 1,32 23,35 2.1,36 0.038,37 2,38 30.5,39 47.429,40 54.192,41 31.495,42 28.761,44 4.523}
{0 CHEMBL1783985,1 5.605,2 35.7,3 59.5,4 0.977,5 1.135,6 0.609,7 0.549,8 235.41,9 2.4,11 42,13 1,14 19,16 44,17 15,20 1,21 14,22 1,24 25,25 2,28 1,29 1,32 17,35 2.4,36 0.023,37 1,38 20,39 41.032,40 47.69,41 25.597,42 23.058,44 4.523}
{0 CHEMBL180822,1 7.883,2 29.2,3 45.8,4 1.048,5 1.151,6 0.587,7 0.593,8 189.19,9 4.2,11 24,13 2,14 13,16 24,17 7,20 2,21 5,22 2,24 11,25 6,28 1,29 5,32 13,35 20.8,36 0.167,37 4,38 15,39 25.156,40 27.621,41 14.085,42 14.229,44 8.201}
{0 CHEMBL2063423,1 8.438,2 45.7,3 37.1,4 1.02,5 1.12,6 0.691,7 0.681,8 295.32,9 8.6,10 12,11 35,13 14,14 25,16 38,17 16,20 13,21 3,22 2,24 13,25 6,28 3,29 3,32 22,35 8.6,36 0.053,37 2,38 33,39 35.705,40 39.199,41 24.188,42 23.843,44 4.523}
{0 CHEMBL2151817,1 7.031,2 40.4,3 48.9,4 1.002,5 1.135,6 0.643,7 0.61,8 330.44,9 4.3,10 12,11 47,13 13,14 25,16 48,17 19,20 12,21 7,22 1,23 1,24 23,25 5,28 2,29 2,32 24,34 1,35 4.3,36 0.125,37 6,38 32,39 47.091,40 53.322,41 30.233,42 28.651,43 2.1,44 5}
{0 CHEMBL218710,1 9.532,2 30.4,3 39.1,4 1.059,5 1.136,6 0.651,7 0.647,8 219.24,9 4.3,11 23,13 3,14 15,16 24,17 7,20 2,21 5,22 3,24 9,25 7,26 1,28 1,29 5,31 1,32 14,35 21.7,36 0.083,37 2,38 18,39 24.349,40 26.126,41 14.971,42 14.89,44 4}
{0 CHEMBL227288,1 8.87,2 22.7,3 45.5,4 1.051,5 1.152,6 0.626,7 0.598,8 195.13,9 4.5,11 22,13 2,14 12,16 22,17 5,20 1,21 4,22 2,24 10,25 7,26 1,28 1,29 5,30 1,32 12,35 22.7,36 0.136,37 3,38 14,39 23.131,40 25.345,41 13.767,42 13.153,44 5.668}
{0 CHEMBL229429,1 10.845,2 54.2,3 25,4 1.04,5 1.118,6 0.784,7 0.774,8 260.28,9 8.3,10 11,11 24,13 13,14 19,16 25,17 13,19 3,20 9,21 1,23 2,24 6,25 5,26 1,28 2,31 1,32 18,33 2,34 2,38 28.5,39 24.956,40 26.842,41 18.818,42 18.577,43 8.3,44 5}
{0 CHEMBL229697,1 8.87,2 22.7,3 45.5,4 1.051,5 1.152,6 0.626,7 0.598,8 195.13,9 4.5,11 22,13 2,14 12,16 22,17 5,20 1,21 4,22 2,24 10,25 7,26 1,28 1,29 5,30 1,32 12,35 22.7,36 0.136,37 3,38 14,39 23.131,40 25.345,41 13.767,42 13.153,44 6.469}
{0 CHEMBL275079,1 8.508,2 31.8,3 40.9,4 1.058,5 1.146,6 0.606,7 0.623,8 187.17,9 4.5,11 22,13 2,14 14,16 23,17 7,20 2,21 5,22 2,24 9,25 6,28 1,29 5,32 13,35 22.7,36 0.087,37 2,38 16,39 23.273,40 25.206,41 13.324,42 13.703,44 5.772}
{0 CHEMBL277475,1 9.246,2 32,3 40,4 1.045,5 1.134,6 0.671,7 0.646,8 231.16,9 4,10 6,11 25,13 8,14 15,16 25,17 8,20 7,21 1,22 2,24 10,25 7,26 1,28 1,29 5,30 1,32 15,35 20,36 0.12,37 3,38 20,39 26.131,40 28.345,41 16.767,42 16.153,44 6.678}
{0 CHEMBL280563,1 7.958,2 30,3 45,4 1.047,5 1.15,6 0.593,7 0.599,8 159.16,9 5,11 20,13 2,14 11,16 20,17 6,20 2,21 4,22 2,24 9,25 5,28 1,29 4,32 11,35 20,36 0.15,37 3,38 13,39 20.945,40 22.997,41 11.869,42 11.988,44 5.469}
{0 CHEMBL285843,1 8.72,2 19,3 47.6,4 1.054,5 1.159,6 0.608,7 0.579,8 183.12,9 4.8,11 21,13 2,14 10,16 20,17 4,20 1,21 3,22 2,24 10,25 7,26 1,28 1,29 5,30 1,32 11,35 23.8,36 0.2,37 4,38 12,39 22.131,40 24.345,41 12.767,42 12.153,44 8.292}
{0 CHEMBL319279,1 7.501,2 45.9,3 44.3,4 1.004,5 1.114,6 0.675,7 0.647,8 457.56,9 1.6,10 18,11 61,13 20,14 38,16 65,17 28,20 20,21 8,22 2,24 27,25 6,28 1,29 5,32 34,35 8.2,36 0.123,37 8,38 49,39 61.225,40 67.943,41 41.176,42 39.444,44 6.004}
{0 CHEMBL319732,1 6.946,2 41.3,3 49.2,4 1,5 1.123,6 0.646,7 0.611,8 437.58,9 1.6,10 12,11 63,13 14,14 35,16 66,17 26,20 14,21 12,22 2,24 31,25 6,28 1,29 5,32 32,35 7.9,36 0.152,37 10,38 43,39 62.992,40 70.773,41 40.699,42 38.497,44 6.125}
{0 CHEMBL327783,1 7.976,2 41.9,3 41.9,4 1.023,5 1.123,6 0.658,7 0.646,8 247.27,9 3.2,10 6,11 31,13 8,14 20,16 33,17 13,20 8,21 5,22 2,24 13,25 5,28 1,29 4,32 18,35 12.9,36 0.091,37 3,38 25,39 31.713,40 34.827,41 20.392,42 20.041,44 4}
{0 CHEMBL329920,1 7.059,2 41.7,3 48.3,4 1.002,5 1.123,6 0.649,7 0.616,8 423.55,9 1.7,10 12,11 60,13 14,14 34,16 63,17 25,20 14,21 11,22 2,24 29,25 6,28 1,29 5,32 31,35 8.3,36 0.143,37 9,38 42,39 60.109,40 67.358,41 38.938,42 36.971,44 6.469}
{0 CHEMBL330097,1 8.048,2 32,3 44,4 1.046,5 1.145,6 0.603,7 0.609,8 201.2,9 4,11 25,13 2,14 15,16 26,17 8,20 2,21 6,22 2,24 11,25 6,28 1,29 5,32 14,35 20,36 0.077,37 2,38 17,39 26.156,40 28.621,41 15.085,42 15.229,44 4.824}
{0 CHEMBL33567,1 8.72,2 19,3 47.6,4 1.054,5 1.159,6 0.608,7 0.579,8 183.12,9 4.8,11 21,13 2,14 10,16 20,17 4,20 1,21 3,22 2,24 10,25 7,26 1,28 1,29 5,30 1,32 11,35 23.8,36 0.2,37 4,38 12,39 22.131,40 24.345,41 12.767,42 12.153,44 6.252}
{0 CHEMBL34453,1 7.53,2 30.4,3 47.8,4 1.036,5 1.148,6 0.593,7 0.588,8 173.19,9 4.3,11 23,13 2,14 12,16 23,17 7,20 2,21 5,22 2,24 11,25 5,28 1,29 4,32 12,35 17.4,36 0.087,37 2,38 14,39 23.829,40 26.412,41 13.631,42 13.515,44 4.347}
{0 CHEMBL34880,1 8.87,2 22.7,3 45.5,4 1.051,5 1.152,6 0.626,7 0.598,8 195.13,9 4.5,11 22,13 2,14 12,16 22,17 5,20 1,21 4,22 2,24 10,25 7,26 1,28 1,29 5,30 1,32 12,35 22.7,36 0.136,37 3,38 14,39 23.131,40 25.345,41 13.767,42 13.153,44 5.186}
{0 CHEMBL375611,1 9.802,2 29.2,3 37.5,4 1.07,5 1.139,6 0.643,7 0.65,8 235.24,9 4.2,11 24,13 4,14 16,16 25,17 7,20 2,21 5,22 4,24 9,25 8,26 1,28 1,29 6,31 1,32 15,35 25,36 0.08,37 2,38 20,39 25.676,40 27.336,41 15.426,42 15.605,44 4.321}
{0 CHEMBL40086,1 7.917,2 27.3,3 45.5,4 1.048,5 1.159,6 0.585,7 0.591,8 174.18,9 9.1,11 22,13 2,14 12,16 22,17 6,20 2,21 4,22 2,24 10,25 6,28 2,29 4,32 12,35 18.2,36 0.091,37 2,38 14,39 23.047,40 25.495,41 12.875,42 13.009,44 4}
{0 CHEMBL420262,1 6.662,2 40.3,3 51.4,4 0.995,5 1.125,6 0.639,7 0.598,8 479.67,9 1.4,10 12,11 72,13 14,14 38,16 75,17 29,20 14,21 15,22 2,24 37,25 6,28 1,29 5,32 35,35 6.9,36 0.173,37 13,38 46,39 71.643,40 81.019,41 45.983,42 43.078,44 5.286}
{0 CHEMBL432038,1 7.853,2 44.4,3 42.2,4 1.015,5 1.117,6 0.67,7 0.652,8 353.4,9 2.2,10 12,11 45,13 14,14 29,16 48,17 20,20 14,21 6,22 2,24 19,25 6,28 1,29 5,32 26,35 11.1,36 0.104,37 5,38 37,39 45.691,40 50.282,41 30.131,42 29.337,44 6.77}
{0 CHEMBL439775,1 7.48,2 43.1,3 45.1,4 1.009,5 1.12,6 0.66,7 0.635,8 381.46,9 2,10 12,11 51,13 14,14 31,16 54,17 22,20 14,21 8,22 2,24 23,25 6,28 1,29 5,32 28,35 9.8,36 0.111,37 6,38 39,39 51.458,40 57.113,41 33.654,42 32.39,44 5.599}
{0 CHEMBL496882,1 7.77,2 52,3 40,4 0.99,5 1.106,6 0.722,7 0.686,8 194.25,9 8,10 12,11 25,13 13,14 16,16 26,17 13,19 2,20 10,21 1,24 10,25 2,28 2,32 15,33 1,38 24,39 24.738,40 27.657,41 18.057,42 17.15,44 5}
{0 CHEMBL505105,1 7.751,2 48.1,3 40.7,4 0.994,5 1.117,6 0.706,7 0.673,8 209.27,9 11.1,10 12,11 27,13 13,14 17,16 28,17 13,19 2,20 10,21 1,24 11,25 3,28 3,32 16,33 1,36 0.036,37 1,38 25,39 26.84,40 30.156,41 19.063,42 18.171,44 5}
{0 CHEMBL566581,1 8.443,2 40.9,3 40.9,4 1.014,5 1.133,6 0.691,7 0.661,8 371.48,9 11.4,10 17,11 44,13 18,14 28,16 46,17 18,20 14,21 4,22 1,23 1,24 18,25 8,26 1,28 5,29 1,31 1,32 26,34 1,35 2.3,36 0.109,37 5,38 37.5,39 44.611,40 49.867,41 30.398,42 29.08,43 2.3,44 5}
{0 CHEMBL575060,1 7.745,2 26.3,3 47.4,4 1.05,5 1.158,6 0.572,7 0.578,8 147.15,9 5.3,11 19,13 2,14 9,16 18,17 5,20 2,21 3,22 2,24 9,25 5,28 1,29 4,32 10,35 21.1,36 0.222,37 4,38 11,39 19.945,40 21.997,41 10.869,42 10.988,44 5.022}
{0 CHEMBL579062,1 8.187,2 44.4,3 40,4 1.018,5 1.138,6 0.677,7 0.662,8 368.42,9 8.9,10 17,11 45,13 18,14 30,16 48,17 20,20 15,21 5,22 1,23 2,24 18,25 7,28 4,29 1,32 27,34 2,35 2.2,36 0.063,37 3,38 39.5,39 45.829,40 51.204,41 30.444,42 29.781,43 4.4,44 5}
{0 CHEMBL66654,1 7.433,2 53.8,3 42.3,4 0.982,5 1.099,6 0.724,7 0.679,8 193.26,9 3.8,10 12,11 26,13 13,14 16,16 27,17 14,19 2,20 11,21 1,24 11,25 1,28 1,32 15,33 1,38 24,39 25.52,40 28.574,41 18.813,42 17.655,44 4}
{0 CHEMBL8759,1 7.717,2 33.3,3 45.8,4 1.035,5 1.142,6 0.61,7 0.605,8 185.2,9 4.2,11 24,13 2,14 14,16 25,17 8,20 2,21 6,22 2,24 11,25 5,28 1,29 4,32 13,35 16.7,36 0.08,37 2,38 16,39 24.829,40 27.412,41 14.631,42 14.515,44 4.939}
{0 CHEMBL8839,1 9.238,2 31.8,3 40.9,4 1.046,5 1.133,6 0.66,7 0.644,8 203.24,9 4.5,11 22,13 2,14 14,16 23,17 7,20 2,21 5,22 2,24 9,25 6,26 1,28 1,29 4,31 1,32 13,35 18.2,36 0.087,37 2,38 16,39 23.022,40 24.917,41 14.517,42 14.175,44 5.134}
{0 CHEMBL88553,1 7.899,2 44.4,3 40.7,4 1.006,5 1.125,6 0.686,7 0.662,8 213.26,9 11.1,10 12,11 27,13 13,14 17,16 28,17 12,20 11,21 1,22 1,24 11,25 4,28 3,29 1,32 16,35 3.7,36 0.071,37 2,38 24,39 27.167,40 30.365,41 18.517,42 17.886,44 4}
{0 CHEMBL88612,1 6.974,2 50,3 46.4,4 0.979,5 1.107,6 0.699,7 0.649,8 195.28,9 3.6,10 12,11 28,13 13,14 16,16 29,17 14,20 13,21 1,22 1,24 13,25 1,28 1,32 15,36 0.069,37 2,38 23,39 27.403,40 30.99,41 19.574,42 18.182,44 4}
{0 CHEMBL88999,1 9.238,2 31.8,3 40.9,4 1.046,5 1.133,6 0.66,7 0.644,8 203.24,9 4.5,11 22,13 2,14 14,16 23,17 7,20 2,21 5,22 2,24 9,25 6,26 1,28 1,29 4,31 1,32 13,35 18.2,36 0.087,37 2,38 16,39 23.022,40 24.917,41 14.517,42 14.175,44 5.137}
{0 CHEMBL89000,1 8.508,2 31.8,3 40.9,4 1.058,5 1.146,6 0.606,7 0.623,8 187.17,9 4.5,11 22,13 2,14 14,16 23,17 7,20 2,21 5,22 2,24 9,25 6,28 1,29 5,32 13,35 22.7,36 0.087,37 2,38 16,39 23.273,40 25.206,41 13.324,42 13.703,44 5.77}
{0 CHEMBL95868,1 7.185,2 42.1,3 47.4,4 1.004,5 1.122,6 0.652,7 0.622,8 409.52,9 1.8,10 12,11 57,13 14,14 33,16 60,17 24,20 14,21 10,22 2,24 27,25 6,28 1,29 5,32 30,35 8.8,36 0.133,37 8,38 41,39 57.225,40 63.943,41 37.176,42 35.444,44 6.31}
{0 CHEMBL97200,1 7.185,2 42.1,3 47.4,4 1.004,5 1.122,6 0.652,7 0.622,8 409.52,9 1.8,10 12,11 57,13 14,14 33,16 60,17 24,20 14,21 10,22 2,24 27,25 6,28 1,29 5,32 30,35 8.8,36 0.117,37 7,38 41,39 57.225,40 63.943,41 37.176,42 35.444,44 6.42}
{0 CHEMBL97574,1 7.655,2 43.8,3 43.8,4 1.012,5 1.119,6 0.664,7 0.643,8 367.43,9 2.1,10 12,11 48,13 14,14 30,16 51,17 21,20 14,21 7,22 2,24 21,25 6,28 1,29 5,32 27,35 10.4,36 0.098,37 5,38 38,39 48.574,40 53.697,41 31.892,42 30.863,44 5.91}
{0 CHEMBL99462,1 7.324,2 42.6,3 46.3,4 1.006,5 1.121,6 0.656,7 0.628,8 395.49,9 1.9,10 12,11 54,13 14,14 32,16 57,17 23,20 14,21 9,22 2,24 25,25 6,28 1,29 5,32 29,35 9.3,36 0.123,37 7,38 40,39 54.342,40 60.528,41 35.415,42 33.917,44 5.648}
