"molecule_id","FCFP4_1024b692","FCFP4_1024b787","FCFP4_1024b254","FCFP4_1024b425","FCFP4_1024b553","FCFP4_1024b1","FCFP4_1024b10","FCFP4_1024b100","FCFP4_1024b1000","FCFP4_1024b1001","FCFP4_1024b1002","FCFP4_1024b1003","FCFP4_1024b1004","FCFP4_1024b1005","FCFP4_1024b1006","FCFP4_1024b1007","FCFP4_1024b1008","FCFP4_1024b1009","FCFP4_1024b101","FCFP4_1024b1010","FCFP4_1024b1011","FCFP4_1024b1012","FCFP4_1024b1013","FCFP4_1024b1014","FCFP4_1024b1015","FCFP4_1024b1016","FCFP4_1024b1017","FCFP4_1024b1018","FCFP4_1024b1019","FCFP4_1024b102","FCFP4_1024b1020","FCFP4_1024b1021","FCFP4_1024b1022","FCFP4_1024b1023","FCFP4_1024b1024","FCFP4_1024b103","FCFP4_1024b104","FCFP4_1024b105","FCFP4_1024b106","FCFP4_1024b107","FCFP4_1024b108","FCFP4_1024b109","FCFP4_1024b11","FCFP4_1024b110","FCFP4_1024b111","FCFP4_1024b112","FCFP4_1024b113","FCFP4_1024b114","FCFP4_1024b115","FCFP4_1024b116","FCFP4_1024b117","pXC50"
{6 1,31 1,52 6.404}
{0 CHEMBL118202,6 1,31 1,52 6.266}
{0 CHEMBL118425,6 1,31 1,52 6.774}
{0 CHEMBL118581,6 1,31 1,52 6.412}
{0 CHEMBL118602,6 1,31 1,52 5.296}
{0 CHEMBL118652,6 1,31 1,52 6.593}
{0 CHEMBL118668,6 1,31 1,52 5.516}
{0 CHEMBL118870,6 1,31 1,52 6.268}
{0 CHEMBL119086,6 1,25 1,31 1,52 6.486}
{0 CHEMBL119188,6 1,31 1,52 6.446}
{0 CHEMBL119189,6 1,31 1,52 5.935}
{0 CHEMBL119224,6 1,31 1,52 5.454}
{0 CHEMBL119568,6 1,31 1,52 6.549}
{0 CHEMBL119669,6 1,31 1,52 6.598}
{0 CHEMBL120123,6 1,31 1,52 7.178}
{0 CHEMBL129788,6 1,12 1,31 1,52 8.959}
{0 CHEMBL13636,6 1,52 7.845}
{0 CHEMBL158054,6 1,52 5.353}
{0 CHEMBL158570,6 1,52 5.509}
{0 CHEMBL158639,6 1,52 6.553}
{0 CHEMBL158691,6 1,52 6.672}
{0 CHEMBL159032,6 1,52 6.751}
{0 CHEMBL159040,1 1,2 1,3 1,4 1,5 1,6 1,31 1,52 6.589}
{0 CHEMBL159052,6 1,52 5.284}
{0 CHEMBL161009,6 1,52 6.315}
{0 CHEMBL161034,6 1,52 5.407}
{0 CHEMBL161117,6 1,52 5.469}
{0 CHEMBL161451,6 1,52 5.481}
{0 CHEMBL161673,6 1,52 5.481}
{0 CHEMBL161757,6 1,52 5.409}
{0 CHEMBL162126,1 1,2 1,3 1,4 1,5 1,6 1,31 1,52 8.519}
{0 CHEMBL185800,6 1,44 1,52 6.745}
{0 CHEMBL186838,6 1,52 5.499}
{0 CHEMBL19023,6 1,31 1,52 4.688}
{0 CHEMBL19633,6 1,31 1,52 4.858}
{0 CHEMBL213053,6 1,15 1,31 1,32 1,34 1,52 7.839}
{0 CHEMBL21357,1 1,2 1,3 1,4 1,5 1,6 1,31 1,52 6.916}
{0 CHEMBL21395,6 1,31 1,52 6.365}
{0 CHEMBL21407,1 1,2 1,3 1,4 1,5 1,6 1,28 1,31 1,52 8.371}
{0 CHEMBL21408,1 1,2 1,3 1,4 1,5 1,6 1,31 1,52 7.592}
{0 CHEMBL21414,1 1,2 1,3 1,5 1,31 1,52 7.5}
{0 CHEMBL21494,1 1,2 1,3 1,4 1,5 1,6 1,28 1,31 1,52 8.745}
{0 CHEMBL21690,1 1,2 1,3 1,5 1,31 1,52 7.105}
{0 CHEMBL21691,1 1,2 1,3 1,4 1,5 1,6 1,31 1,52 7.727}
{0 CHEMBL21778,1 1,2 1,3 1,4 1,5 1,6 1,31 1,52 7.833}
{0 CHEMBL21799,1 1,2 1,3 1,4 1,5 1,6 1,31 1,52 7.387}
{0 CHEMBL21885,1 1,2 1,3 1,4 1,5 1,6 1,8 1,31 1,52 9.168}
{0 CHEMBL21921,1 1,2 1,3 1,4 1,5 1,6 1,31 1,52 8.679}
{0 CHEMBL22,6 1,25 1,31 1,52 5.211}
{0 CHEMBL22039,1 1,2 1,3 1,4 1,5 1,6 1,31 1,52 8.495}
{0 CHEMBL22129,1 1,2 1,3 1,4 1,5 1,6 1,31 1,52 7.527}
{0 CHEMBL22137,6 1,31 1,52 5.447}
{0 CHEMBL22138,6 1,31 1,52 5.339}
{0 CHEMBL22139,6 1,25 1,31 1,52 5.241}
{0 CHEMBL22146,6 1,31 1,52 6.417}
{0 CHEMBL22148,1 1,2 1,3 1,4 1,5 1,6 1,31 1,52 8.435}
{0 CHEMBL22271,1 1,3 1,4 1,5 1,6 1,31 1,52 6.327}
{0 CHEMBL22327,6 1,31 1,52 5.73}
{0 CHEMBL22357,2 1,3 1,4 1,5 1,6 1,31 1,52 5.937}
{0 CHEMBL22403,1 1,2 1,3 1,4 1,5 1,6 1,31 1,52 5.414}
{0 CHEMBL22405,1 1,2 1,3 1,4 1,5 1,6 1,28 1,31 1,52 7.562}
{0 CHEMBL22693,1 1,2 1,3 1,4 1,5 1,6 1,31 1,52 5.569}
{0 CHEMBL22811,6 1,25 1,31 1,52 6.886}
{0 CHEMBL22901,6 1,25 1,31 1,52 7.277}
{0 CHEMBL243185,6 1,29 1,44 1,52 4.519}
{0 CHEMBL25112,6 1,31 1,52 7.519}
{0 CHEMBL264392,6 1,52 5.813}
{0 CHEMBL274031,6 1,31 1,52 5.478}
{0 CHEMBL278813,1 1,2 1,3 1,4 1,5 1,6 1,31 1,52 8.598}
{0 CHEMBL278847,1 1,2 1,3 1,4 1,5 1,6 1,31 1,52 8.62}
{0 CHEMBL279492,1 1,2 1,3 1,5 1,31 1,52 6.344}
{0 CHEMBL279509,6 1,25 1,31 1,52 7.176}
{0 CHEMBL279948,6 1,31 1,52 5.359}
{0 CHEMBL279986,1 1,2 1,3 1,4 1,5 1,6 1,31 1,52 6.375}
{0 CHEMBL280410,6 1,25 1,31 1,52 6.523}
{0 CHEMBL281412,1 1,2 1,3 1,4 1,5 1,6 1,31 1,52 7.238}
{0 CHEMBL282275,1 1,2 1,3 1,4 1,5 1,6 1,31 1,52 7.428}
{0 CHEMBL291931,6 1,31 1,52 5.5}
{0 CHEMBL29773,1 1,2 1,3 1,4 1,5 1,6 1,31 1,52 7.649}
{0 CHEMBL30937,6 1,31 1,52 5.758}
{0 CHEMBL323554,6 1,41 1,52 4.866}
{0 CHEMBL324775,6 1,31 1,52 6.534}
{0 CHEMBL325533,6 1,25 1,31 1,52 4.021}
{0 CHEMBL326989,6 1,31 1,52 5.891}
{0 CHEMBL329687,6 1,52 6.556}
{0 CHEMBL332013,6 1,31 1,52 4.927}
{0 CHEMBL333779,6 1,31 1,52 6.354}
{0 CHEMBL345146,6 1,52 5.335}
{0 CHEMBL346932,1 1,2 1,3 1,4 1,5 1,6 1,31 1,52 5.689}
{0 CHEMBL346963,6 1,52 6.585}
{0 CHEMBL346982,6 1,52 8.481}
{0 CHEMBL347190,1 1,2 1,3 1,4 1,5 1,6 1,31 1,52 7.86}
{0 CHEMBL348151,6 1,52 5.495}
{0 CHEMBL351099,6 1,52 6.195}
{0 CHEMBL352195,6 1,52 5.42}
{0 CHEMBL352441,1 1,2 1,3 1,4 1,5 1,6 1,31 1,52 5.554}
{0 CHEMBL354011,6 1,52 5.31}
{0 CHEMBL36,1 1,2 1,3 1,4 1,5 1,6 1,31 1,52 7.173}
{0 CHEMBL365481,6 1,31 1,52 5.638}
{0 CHEMBL365894,6 1,52 4.613}
{0 CHEMBL416373,6 1,25 1,31 1,52 6.737}
{0 CHEMBL416376,6 1,25 1,31 1,52 6.77}
{0 CHEMBL416552,1 1,2 1,3 1,4 1,5 1,6 1,31 1,52 5.581}
{0 CHEMBL419055,6 1,25 1,31 1,52 6.432}
{0 CHEMBL419231,6 1,31 1,52 6.438}
{0 CHEMBL422005,1 1,2 1,3 1,4 1,5 1,6 1,31 1,52 5.534}
{0 CHEMBL433204,6 1,52 4.082}
{0 CHEMBL434771,1 1,2 1,3 1,4 1,5 1,6 1,31 1,52 7.461}
{0 CHEMBL443013,6 1,52 6.726}
{0 CHEMBL444605,1 1,2 1,3 1,4 1,5 1,6 1,31 1,52 5.712}
{0 CHEMBL56146,6 1,31 1,52 6.886}
{0 CHEMBL6741,6 1,52 8.94}
{0 CHEMBL6742,6 1,52 5.862}
{0 CHEMBL7004,6 1,52 8.771}
{0 CHEMBL7005,6 1,52 5.787}
{0 CHEMBL7130,6 1,52 6.496}
{0 CHEMBL747,6 1,52 5.646}
{0 CHEMBL89959,6 1,52 6.893}
{0 CHEMBL90018,6 1,52 6.19}
{0 CHEMBL90292,6 1,52 6.777}
{0 CHEMBL90358,6 1,52 5.836}
{0 CHEMBL90461,6 1,52 6.695}
{0 CHEMBL90703,6 1,52 6.971}
{0 CHEMBL91345,6 1,52 6.77}
{0 CHEMBL92047,6 1,52 6.724}
{0 CHEMBL92182,6 1,52 6.733}
{0 CHEMBL92583,6 1,52 6.884}
{0 CHEMBL92846,6 1,52 6.358}
{0 CHEMBL93001,6 1,52 6.449}
{0 CHEMBL93153,6 1,52 7.75}
{0 CHEMBL93484,6 1,52 5.708}
{0 CHEMBL93748,6 1,52 6.695}
{0 CHEMBL93888,6 1,52 6.896}
{0 CHEMBL93889,6 1,52 5.671}
{0 CHEMBL93893,6 1,52 7.046}
{0 CHEMBL93974,6 1,52 7.959}
{0 CHEMBL94281,6 1,52 5.923}
{0 CHEMBL94470,6 1,29 1,44 1,52 5.167}
{0 CHEMBL95274,6 1,52 4.241}
{0 CHEMBL95567,52 5.444}
{0 CHEMBL95609,6 1,29 1,52 4.462}
{0 CHEMBL95615,6 1,52 4.852}
{0 CHEMBL95725,5 1,6 1,21 1,32 1,52 4.751}
{0 CHEMBL95783,6 1,40 1,52 4.812}
{0 CHEMBL97598,6 1,52 6.101}
