"molecule_id","AMW","C.","H.","Me","Mi","Mp","Mv","MW","N.","nAB","nAT","nB","nBM","nBO","nBR","nBT","nC","nCL","nCsp","nCsp2","nCsp3","nDB","nF","nH","nHet","nHM","nI","nN","nO","nP","nS","nSK","nTB","nX","O.","RBF","RBN","SCBO","Se","Si","Sp","Sv","X.","pXC50"
{1 8.866,2 51,3 34.7,4 1.028,5 1.126,6 0.706,7 0.701,8 434.44,9 4.1,10 24,11 49,13 25,14 35,16 52,17 25,20 23,21 2,22 1,23 3,24 17,25 7,28 2,29 2,32 32,34 3,35 4.1,36 0.115,37 6,38 48,39 50.349,40 55.171,41 34.586,42 34.363,43 6.1,44 5.229}
{0 CHEMBL1813115,1 7.714,2 45.9,3 42.6,4 1.007,5 1.115,6 0.679,7 0.655,8 470.56,9 3.3,10 22,11 61,13 24,14 39,16 65,17 28,20 22,21 6,22 2,24 26,25 7,28 2,29 5,32 35,35 8.2,36 0.092,37 6,38 52,39 61.443,40 68.026,41 41.421,42 39.938,44 8.114}
{0 CHEMBL1813116,1 7.572,2 45.3,3 43.8,4 1.005,5 1.116,6 0.675,7 0.648,8 484.59,9 3.1,10 22,11 64,13 24,14 40,16 68,17 29,20 22,21 7,22 2,24 28,25 7,28 2,29 5,32 36,35 7.8,36 0.088,37 6,38 53,39 64.327,40 71.441,41 43.182,42 41.465,44 7.553}
{0 CHEMBL1813117,1 8.279,2 45.9,3 41,4 1.013,5 1.114,6 0.693,7 0.668,8 505,9 3.3,10 22,11 61,13 24,14 40,16 65,17 28,18 1,20 22,21 6,22 2,24 25,25 8,26 1,28 2,29 5,32 36,34 1,35 8.2,36 0.092,37 6,38 53,39 61.767,40 67.97,41 42.279,42 40.766,43 1.6,44 7.538}
{0 CHEMBL1813118,1 8.009,2 45.9,3 41,4 1.016,5 1.121,6 0.678,7 0.661,8 488.55,9 3.3,10 22,11 61,13 24,14 40,16 65,17 28,20 22,21 6,22 2,23 1,24 25,25 8,28 2,29 5,32 36,34 1,35 8.2,36 0.092,37 6,38 53,39 61.956,40 68.366,41 41.358,42 40.322,43 1.6,44 8.495}
{0 CHEMBL1813119,1 7.701,2 44.6,3 43.1,4 1.01,5 1.118,6 0.671,7 0.649,8 500.59,9 3.1,10 22,11 65,13 24,14 41,16 69,17 29,20 22,21 7,22 2,24 28,25 8,28 2,29 6,32 37,35 9.2,36 0.101,37 7,38 54,39 65.654,40 72.651,41 43.637,42 42.18,44 8.004}
{0 CHEMBL1813120,1 7.572,2 45.3,3 43.8,4 1.005,5 1.116,6 0.675,7 0.648,8 484.59,9 3.1,10 22,11 64,13 24,14 40,16 68,17 29,20 22,21 7,22 2,24 28,25 7,28 2,29 5,32 36,35 7.8,36 0.088,37 6,38 53,39 64.327,40 71.441,41 43.182,42 41.465,44 8.708}
{0 CHEMBL1813121,1 8.279,2 45.9,3 41,4 1.013,5 1.114,6 0.693,7 0.668,8 505,9 3.3,10 22,11 61,13 24,14 40,16 65,17 28,18 1,20 22,21 6,22 2,24 25,25 8,26 1,28 2,29 5,32 36,34 1,35 8.2,36 0.092,37 6,38 53,39 61.767,40 67.97,41 42.279,42 40.766,43 1.6,44 8.508}
{0 CHEMBL1813122,1 8.009,2 45.9,3 41,4 1.016,5 1.121,6 0.678,7 0.661,8 488.55,9 3.3,10 22,11 61,13 24,14 40,16 65,17 28,20 22,21 6,22 2,23 1,24 25,25 8,28 2,29 5,32 36,34 1,35 8.2,36 0.092,37 6,38 53,39 61.956,40 68.366,41 41.358,42 40.322,43 1.6,44 8.511}
{0 CHEMBL1813123,1 7.572,2 45.3,3 43.8,4 1.005,5 1.116,6 0.675,7 0.648,8 484.59,9 3.1,10 22,11 64,13 24,14 40,16 68,17 29,20 22,21 7,22 2,24 28,25 7,28 2,29 5,32 36,35 7.8,36 0.088,37 6,38 53,39 64.327,40 71.441,41 43.182,42 41.465,44 6.854}
{0 CHEMBL1813124,1 8.279,2 45.9,3 41,4 1.013,5 1.114,6 0.693,7 0.668,8 505,9 3.3,10 22,11 61,13 24,14 40,16 65,17 28,18 1,20 22,21 6,22 2,24 25,25 8,26 1,28 2,29 5,32 36,34 1,35 8.2,36 0.092,37 6,38 53,39 61.767,40 67.97,41 42.279,42 40.766,43 1.6,44 6.42}
{0 CHEMBL1813125,1 8.009,2 45.9,3 41,4 1.016,5 1.121,6 0.678,7 0.661,8 488.55,9 3.3,10 22,11 61,13 24,14 40,16 65,17 28,20 22,21 6,22 2,23 1,24 25,25 8,28 2,29 5,32 36,34 1,35 8.2,36 0.092,37 6,38 53,39 61.956,40 68.366,41 41.358,42 40.322,43 1.6,44 6.62}
{0 CHEMBL1813272,1 7.701,2 44.6,3 43.1,4 1.01,5 1.118,6 0.671,7 0.649,8 500.59,9 3.1,10 22,11 65,13 24,14 41,16 69,17 29,20 22,21 7,22 2,24 28,25 8,28 2,29 6,32 37,35 9.2,36 0.101,37 7,38 54,39 65.654,40 72.651,41 43.637,42 42.18,44 6.469}
{0 CHEMBL1813273,1 7.442,2 44.8,3 44.8,4 1.003,5 1.117,6 0.671,7 0.642,8 498.62,9 3,10 22,11 67,13 24,14 41,16 71,17 30,20 22,21 8,22 2,24 30,25 7,28 2,29 5,32 37,35 7.5,36 0.085,37 6,38 54,39 67.211,40 74.856,41 44.943,42 42.992,44 6.42}
{0 CHEMBL1813274,1 7.442,2 44.8,3 44.8,4 1.003,5 1.117,6 0.671,7 0.642,8 498.62,9 3,10 22,11 67,13 24,14 41,16 71,17 30,20 22,21 8,22 2,24 30,25 7,28 2,29 5,32 37,35 7.5,36 0.085,37 6,38 54,39 67.211,40 74.856,41 44.943,42 42.992,44 6.444}
{0 CHEMBL1813275,1 7.853,2 45.3,3 42.2,4 1.013,5 1.122,6 0.674,7 0.654,8 502.58,9 3.1,10 22,11 64,13 24,14 41,16 68,17 29,20 22,21 7,22 2,23 1,24 27,25 8,28 2,29 5,32 37,34 1,35 7.8,36 0.088,37 6,38 54,39 64.84,40 71.781,41 43.12,42 41.848,43 1.6,44 8.532}
{0 CHEMBL1813276,1 8.574,2 45.9,3 39.3,4 1.021,5 1.12,6 0.692,7 0.675,8 522.99,9 3.3,10 22,11 61,13 24,14 41,16 65,17 28,18 1,20 22,21 6,22 2,23 1,24 24,25 9,26 1,28 2,29 5,32 37,34 2,35 8.2,36 0.092,37 6,38 54,39 62.28,40 68.31,41 42.216,42 41.149,43 3.3,44 8.54}
{0 CHEMBL1813277,1 8.304,2 45.9,3 39.3,4 1.024,5 1.126,6 0.677,7 0.667,8 506.54,9 3.3,10 22,11 61,13 24,14 41,16 65,17 28,20 22,21 6,22 2,23 2,24 24,25 9,28 2,29 5,32 37,34 2,35 8.2,36 0.092,37 6,38 54,39 62.469,40 68.705,41 41.296,42 40.705,43 3.3,44 8.42}
{0 CHEMBL1813278,1 7.853,2 45.3,3 42.2,4 1.013,5 1.122,6 0.674,7 0.654,8 502.58,9 3.1,10 22,11 64,13 24,14 41,16 68,17 29,20 22,21 7,22 2,23 1,24 27,25 8,28 2,29 5,32 37,34 1,35 7.8,36 0.088,37 6,38 54,39 64.84,40 71.781,41 43.12,42 41.848,43 1.6,44 7.303}
{0 CHEMBL1813279,1 7.978,2 44.6,3 41.5,4 1.018,5 1.123,6 0.67,7 0.655,8 518.58,9 3.1,10 22,11 65,13 24,14 42,16 69,17 29,20 22,21 7,22 2,23 1,24 27,25 9,28 2,29 6,32 38,34 1,35 9.2,36 0.101,37 7,38 55,39 66.167,40 72.99,41 43.574,42 42.563,43 1.5,44 7.167}
{0 CHEMBL1813280,1 7.711,2 44.8,3 43.3,4 1.011,5 1.122,6 0.67,7 0.647,8 516.61,9 3,10 22,11 67,13 24,14 42,16 71,17 30,20 22,21 8,22 2,23 1,24 29,25 8,28 2,29 5,32 38,34 1,35 7.5,36 0.085,37 6,38 55,39 67.723,40 75.196,41 44.881,42 43.375,43 1.5,44 7.495}
{0 CHEMBL1813281,1 7.711,2 44.8,3 43.3,4 1.011,5 1.122,6 0.67,7 0.647,8 516.61,9 3,10 22,11 67,13 24,14 42,16 71,17 30,20 22,21 8,22 2,23 1,24 29,25 8,28 2,29 5,32 38,34 1,35 7.5,36 0.085,37 6,38 55,39 67.723,40 75.196,41 44.881,42 43.375,43 1.5,44 7.854}
{0 CHEMBL1813282,1 7.859,2 46.7,3 41.7,4 1.011,5 1.112,6 0.681,7 0.661,8 471.54,9 1.7,10 22,11 60,13 24,14 39,16 64,17 28,20 22,21 6,22 2,24 25,25 7,28 1,29 6,32 35,35 10,36 0.094,37 6,38 52,39 60.669,40 66.737,41 40.869,42 39.632,44 7.658}
{0 CHEMBL1813283,1 7.721,2 47.5,3 42.4,4 1.006,5 1.111,6 0.685,7 0.66,8 455.54,9 1.7,10 22,11 59,13 24,14 38,16 63,17 28,20 22,21 6,22 2,24 25,25 6,28 1,29 5,32 34,35 8.5,36 0.095,37 6,38 51,39 59.342,40 65.528,41 40.415,42 38.917,44 7.255}
{0 CHEMBL1813284,1 7.721,2 47.5,3 42.4,4 1.006,5 1.111,6 0.685,7 0.66,8 455.54,9 1.7,10 22,11 59,13 24,14 38,16 63,17 28,20 22,21 6,22 2,24 25,25 6,28 1,29 5,32 34,35 8.5,36 0.095,37 6,38 51,39 59.342,40 65.528,41 40.415,42 38.917,44 8.152}
{0 CHEMBL1813285,1 8.026,2 47.4,3 40.4,4 1.014,5 1.111,6 0.686,7 0.669,8 457.51,9 1.8,10 22,11 57,13 24,14 38,16 61,17 27,20 22,21 5,22 2,24 23,25 7,28 1,29 6,32 34,35 10.5,36 0.098,37 6,38 51,39 57.785,40 63.322,41 39.108,42 38.105,44 7.367}
{0 CHEMBL1813286,1 7.438,2 46,3 44.4,4 1,5 1.115,6 0.678,7 0.647,8 468.59,9 3.2,10 22,11 63,13 24,14 39,16 67,17 29,20 22,21 7,22 2,24 28,25 6,28 2,29 4,32 35,35 6.3,36 0.09,37 6,38 52,39 63,40 70.232,41 42.728,42 40.75,44 8.208}
{0 CHEMBL1813287,1 7.312,2 45.5,3 45.5,4 0.998,5 1.116,6 0.674,7 0.641,8 482.62,9 3,10 22,11 66,13 24,14 40,16 70,17 30,20 22,21 8,22 2,24 30,25 6,28 2,29 4,32 36,35 6.1,36 0.1,37 7,38 53,39 65.883,40 73.647,41 44.489,42 42.277,44 8.489}
{0 CHEMBL1813288,1 7.312,2 45.5,3 45.5,4 0.998,5 1.116,6 0.674,7 0.641,8 482.62,9 3,10 22,11 66,13 24,14 40,16 70,17 30,20 22,21 8,22 2,24 30,25 6,28 2,29 4,32 36,35 6.1,36 0.1,37 7,38 53,39 65.883,40 73.647,41 44.489,42 42.277,44 7.658}
{0 CHEMBL1813289,1 8.026,2 47.5,3 40.7,4 1.014,5 1.116,6 0.684,7 0.666,8 473.53,9 1.7,10 22,11 59,13 24,14 39,16 63,17 28,20 22,21 6,22 2,23 1,24 24,25 7,28 1,29 5,32 35,34 1,35 8.5,36 0.095,37 6,38 52,39 59.854,40 65.867,41 40.352,42 39.3,43 1.7,44 8.507}
{0 CHEMBL1819603,1 7.723,2 44.6,3 42.9,4 1.01,5 1.118,6 0.672,7 0.65,8 432.51,9 3.6,10 18,11 56,13 20,14 35,16 59,17 25,20 20,21 5,22 2,24 24,25 7,28 2,29 5,32 32,35 8.9,36 0.119,37 7,38 46,39 56.56,40 62.611,41 37.659,42 36.412,44 6.584}
{0 CHEMBL1819604,1 8.221,2 42.1,3 42.1,4 1.017,5 1.118,6 0.68,7 0.655,8 468.57,9 3.5,10 18,11 57,13 21,14 36,16 60,17 24,20 19,21 5,22 3,24 24,25 9,26 1,28 2,29 6,31 1,32 33,35 10.5,36 0.133,37 8,38 48,39 57.963,40 63.74,41 38.761,42 37.313,44 6.367}
{0 CHEMBL1819605,1 7.723,2 44.6,3 42.9,4 1.01,5 1.118,6 0.672,7 0.65,8 432.51,9 3.6,10 18,11 56,13 20,14 35,16 59,17 25,20 20,21 5,22 2,24 24,25 7,28 2,29 5,32 32,35 8.9,36 0.119,37 7,38 46,39 56.56,40 62.611,41 37.659,42 36.412,44 5.276}
{0 CHEMBL1819606,1 7.568,2 44.1,3 44.1,4 1.008,5 1.119,6 0.668,7 0.643,8 446.54,9 3.4,10 18,11 59,13 20,14 36,16 62,17 26,20 20,21 6,22 2,24 26,25 7,28 2,29 5,32 33,35 8.5,36 0.113,37 7,38 47,39 59.443,40 66.026,41 39.421,42 37.938,44 6.119}
{0 CHEMBL1819607,1 7.429,2 43.5,3 45.2,4 1.005,5 1.12,6 0.664,7 0.637,8 460.57,9 3.2,10 18,11 62,13 20,14 37,16 65,17 27,20 20,21 7,22 2,24 28,25 7,28 2,29 5,32 34,35 8.1,36 0.123,37 8,38 48,39 62.327,40 69.441,41 41.182,42 39.465,44 6.114}
{0 CHEMBL1819608,1 7.568,2 44.1,3 44.1,4 1.008,5 1.119,6 0.668,7 0.643,8 446.54,9 3.4,10 18,11 59,13 20,14 36,16 62,17 26,20 20,21 6,22 2,24 26,25 7,28 2,29 5,32 33,35 8.5,36 0.113,37 7,38 47,39 59.443,40 66.026,41 39.421,42 37.938,44 7.745}
{0 CHEMBL1819609,1 8.338,2 44.6,3 41.1,4 1.016,5 1.117,6 0.688,7 0.665,8 466.95,9 3.6,10 18,11 56,13 20,14 36,16 59,17 25,18 1,20 20,21 5,22 2,24 23,25 8,26 1,28 2,29 5,32 33,34 1,35 8.9,36 0.119,37 7,38 47,39 56.883,40 62.555,41 38.517,42 37.239,43 1.8,44 7.748}
{0 CHEMBL1819610,1 7.429,2 43.5,3 45.2,4 1.005,5 1.12,6 0.664,7 0.637,8 460.57,9 3.2,10 18,11 62,13 20,14 37,16 65,17 27,20 20,21 7,22 2,24 28,25 7,28 2,29 5,32 34,35 8.1,36 0.108,37 7,38 48,39 62.327,40 69.441,41 41.182,42 39.465,44 7.391}
{0 CHEMBL1819611,1 7.429,2 43.5,3 45.2,4 1.005,5 1.12,6 0.664,7 0.637,8 460.57,9 3.2,10 18,11 62,13 20,14 37,16 65,17 27,20 20,21 7,22 2,24 28,25 7,28 2,29 5,32 34,35 8.1,36 0.108,37 7,38 48,39 62.327,40 69.441,41 41.182,42 39.465,44 7.509}
{0 CHEMBL1819612,1 7.429,2 43.5,3 45.2,4 1.005,5 1.12,6 0.664,7 0.637,8 460.57,9 3.2,10 18,11 62,13 20,14 37,16 65,17 27,20 20,21 7,22 2,24 28,25 7,28 2,29 5,32 34,35 8.1,36 0.108,37 7,38 48,39 62.327,40 69.441,41 41.182,42 39.465,44 8.273}
{0 CHEMBL1819613,1 7.429,2 43.5,3 45.2,4 1.005,5 1.12,6 0.664,7 0.637,8 460.57,9 3.2,10 18,11 62,13 20,14 37,16 65,17 27,20 20,21 7,22 2,24 28,25 7,28 2,29 5,32 34,35 8.1,36 0.108,37 7,38 48,39 62.327,40 69.441,41 41.182,42 39.465,44 7.959}
{0 CHEMBL1819614,1 8.152,2 44.1,3 42.4,4 1.013,5 1.118,6 0.683,7 0.657,8 480.98,9 3.4,10 18,11 59,13 20,14 37,16 62,17 26,18 1,20 20,21 6,22 2,24 25,25 8,26 1,28 2,29 5,32 34,34 1,35 8.5,36 0.113,37 7,38 48,39 59.767,40 65.97,41 40.279,42 38.766,43 1.7,44 8.114}
{0 CHEMBL1819615,1 7.873,2 44.1,3 42.4,4 1.016,5 1.125,6 0.667,7 0.65,8 464.53,9 3.4,10 18,11 59,13 20,14 37,16 62,17 26,20 20,21 6,22 2,23 1,24 25,25 8,28 2,29 5,32 34,34 1,35 8.5,36 0.113,37 7,38 48,39 59.956,40 66.366,41 39.358,42 38.322,43 1.7,44 7.721}
{0 CHEMBL1819616,1 7.873,2 44.1,3 42.4,4 1.016,5 1.125,6 0.667,7 0.65,8 464.53,9 3.4,10 18,11 59,13 20,14 37,16 62,17 26,20 20,21 6,22 2,23 1,24 25,25 8,28 2,29 5,32 34,34 1,35 8.5,36 0.113,37 7,38 48,39 59.956,40 66.366,41 39.358,42 38.322,43 1.7,44 8.192}
{0 CHEMBL1819617,1 7.873,2 44.1,3 42.4,4 1.016,5 1.125,6 0.667,7 0.65,8 464.53,9 3.4,10 18,11 59,13 20,14 37,16 62,17 26,20 20,21 6,22 2,23 1,24 25,25 8,28 2,29 5,32 34,34 1,35 8.5,36 0.113,37 7,38 48,39 59.956,40 66.366,41 39.358,42 38.322,43 1.7,44 7.824}
{0 CHEMBL1819618,1 7.565,2 42.9,3 44.4,4 1.01,5 1.121,6 0.661,7 0.638,8 476.57,9 3.2,10 18,11 63,13 20,14 38,16 66,17 27,20 20,21 7,22 2,24 28,25 8,28 2,29 6,32 35,35 9.5,36 0.121,37 8,38 49,39 63.654,40 70.651,41 41.637,42 40.18,44 7.66}
{0 CHEMBL1819619,1 8.152,2 44.1,3 42.4,4 1.013,5 1.118,6 0.683,7 0.657,8 480.98,9 3.4,10 18,11 59,13 20,14 37,16 62,17 26,18 1,20 20,21 6,22 2,24 25,25 8,26 1,28 2,29 5,32 34,34 1,35 8.5,36 0.113,37 7,38 48,39 59.767,40 65.97,41 40.279,42 38.766,43 1.7,44 7.585}
{0 CHEMBL1819620,1 8.152,2 44.1,3 42.4,4 1.013,5 1.118,6 0.683,7 0.657,8 480.98,9 3.4,10 18,11 59,13 20,14 37,16 62,17 26,18 1,20 20,21 6,22 2,24 25,25 8,26 1,28 2,29 5,32 34,34 1,35 8.5,36 0.113,37 7,38 48,39 59.767,40 65.97,41 40.279,42 38.766,43 1.7,44 7.921}
{0 CHEMBL1819621,1 8.152,2 44.1,3 42.4,4 1.013,5 1.118,6 0.683,7 0.657,8 480.98,9 3.4,10 18,11 59,13 20,14 37,16 62,17 26,18 1,20 20,21 6,22 2,24 25,25 8,26 1,28 2,29 5,32 34,34 1,35 8.5,36 0.113,37 7,38 48,39 59.767,40 65.97,41 40.279,42 38.766,43 1.7,44 7.77}
{0 CHEMBL1819622,1 8.953,2 44.6,3 39.3,4 1.022,5 1.116,6 0.703,7 0.68,8 501.39,9 3.6,10 18,11 56,13 20,14 37,16 59,17 25,18 2,20 20,21 5,22 2,24 22,25 9,26 2,28 2,29 5,32 34,34 2,35 8.9,36 0.119,37 7,38 48,39 57.207,40 62.499,41 39.375,42 38.067,43 3.6,44 7.886}
{0 CHEMBL1819623,1 8.66,2 44.6,3 39.3,4 1.025,5 1.123,6 0.687,7 0.672,8 484.94,9 3.6,10 18,11 56,13 20,14 37,16 59,17 25,18 1,20 20,21 5,22 2,23 1,24 22,25 9,26 1,28 2,29 5,32 34,34 2,35 8.9,36 0.119,37 7,38 48,39 57.396,40 62.895,41 38.455,42 37.622,43 3.6,44 7.77}
{0 CHEMBL1819624,1 8.66,2 44.6,3 39.3,4 1.025,5 1.123,6 0.687,7 0.672,8 484.94,9 3.6,10 18,11 56,13 20,14 37,16 59,17 25,18 1,20 20,21 5,22 2,23 1,24 22,25 9,26 1,28 2,29 5,32 34,34 2,35 8.9,36 0.119,37 7,38 48,39 57.396,40 62.895,41 38.455,42 37.622,43 3.6,44 7.452}
{0 CHEMBL1819625,1 8.283,2 43.3,3 41.7,4 1.018,5 1.12,6 0.679,7 0.658,8 496.98,9 3.3,10 18,11 60,13 20,14 38,16 63,17 26,18 1,20 20,21 6,22 2,24 25,25 9,26 1,28 2,29 6,32 35,34 1,35 10,36 0.127,37 8,38 49,39 61.094,40 67.179,41 40.733,42 39.481,43 1.7,44 7.416}
{0 CHEMBL182555,1 7.309,2 44,3 46,4 1.003,5 1.118,6 0.664,7 0.634,8 365.46,9 2,10 16,11 50,13 18,14 29,16 52,17 22,20 16,21 6,22 2,24 23,25 5,28 1,29 4,32 27,35 8,36 0.135,37 7,38 39,39 50.131,40 55.903,41 33.199,42 31.675,44 6.523}
{0 CHEMBL182572,1 7.309,2 44,3 46,4 1.003,5 1.118,6 0.664,7 0.634,8 365.46,9 2,10 16,11 50,13 18,14 29,16 52,17 22,20 16,21 6,22 2,24 23,25 5,28 1,29 4,32 27,35 8,36 0.135,37 7,38 39,39 50.131,40 55.903,41 33.199,42 31.675,44 6.741}
{0 CHEMBL183933,1 7.16,2 43.4,3 47.2,4 1,5 1.119,6 0.66,7 0.626,8 379.49,9 1.9,10 16,11 53,13 18,14 30,16 55,17 23,20 16,21 7,22 2,24 25,25 5,28 1,29 4,32 28,35 7.5,36 0.127,37 7,38 40,39 53.014,40 59.318,41 34.961,42 33.202,44 5.538}
{0 CHEMBL183983,1 7.48,2 43.1,3 45.1,4 1.009,5 1.12,6 0.66,7 0.635,8 381.46,9 2,10 16,11 51,13 18,14 30,16 53,17 22,20 16,21 6,22 2,24 23,25 6,28 1,29 5,32 28,35 9.8,36 0.132,37 7,38 40,39 51.458,40 57.113,41 33.654,42 32.39,44 5.361}
{0 CHEMBL184684,1 8.213,2 48.1,3 38.9,4 1.017,5 1.109,6 0.692,7 0.677,8 443.48,9 1.9,10 22,11 54,13 24,14 37,16 58,17 26,20 22,21 4,22 2,24 21,25 7,28 1,29 6,32 33,35 11.1,36 0.103,37 6,38 50,39 54.902,40 59.907,41 37.347,42 36.578,44 8.027}
{0 CHEMBL185087,1 7.655,2 43.8,3 43.8,4 1.012,5 1.119,6 0.664,7 0.643,8 367.43,9 2.1,10 16,11 48,13 18,14 29,16 50,17 21,20 16,21 5,22 2,24 21,25 6,28 1,29 5,32 27,35 10.4,36 0.14,37 7,38 39,39 48.574,40 53.697,41 31.892,42 30.863,44 5.658}
{0 CHEMBL185251,1 8.009,2 45.9,3 41,4 1.016,5 1.121,6 0.678,7 0.661,8 488.55,9 3.3,10 22,11 61,13 24,14 40,16 65,17 28,20 22,21 6,22 2,23 1,24 25,25 8,28 2,29 5,32 36,34 1,35 8.2,36 0.092,37 6,38 53,39 61.956,40 68.366,41 41.358,42 40.322,43 1.6,44 6.638}
{0 CHEMBL185277,1 6.946,2 41.3,3 49.2,4 1,5 1.123,6 0.646,7 0.611,8 437.58,9 1.6,10 16,11 63,13 18,14 34,16 65,17 26,20 16,21 10,22 2,24 31,25 6,28 1,29 5,32 32,35 7.9,36 0.169,37 11,38 44,39 62.992,40 70.773,41 40.699,42 38.497,44 5.347}
{0 CHEMBL185369,1 7.059,2 41.7,3 48.3,4 1.002,5 1.123,6 0.649,7 0.616,8 423.55,9 1.7,10 16,11 60,13 18,14 33,16 62,17 25,20 16,21 9,22 2,24 29,25 6,28 1,29 5,32 31,35 8.3,36 0.161,37 10,38 43,39 60.109,40 67.358,41 38.938,42 36.971,44 6.381}
{0 CHEMBL186244,1 7.185,2 42.1,3 47.4,4 1.004,5 1.122,6 0.652,7 0.622,8 409.52,9 1.8,10 16,11 57,13 18,14 32,16 59,17 24,20 16,21 8,22 2,24 27,25 6,28 1,29 5,32 30,35 8.8,36 0.153,37 9,38 42,39 57.225,40 63.943,41 37.176,42 35.444,44 5.824}
{0 CHEMBL186735,1 7.809,2 47.3,3 41.8,4 1.008,5 1.111,6 0.685,7 0.662,8 429.5,9 1.8,10 22,11 55,13 24,14 35,16 58,17 26,20 22,21 4,22 2,24 23,25 6,28 1,29 5,32 32,35 9.1,36 0.138,37 8,38 48,39 55.458,40 61.113,41 37.654,42 36.39,44 7.301}
{0 CHEMBL186925,1 7.501,2 47.4,3 43.9,4 1,5 1.111,6 0.684,7 0.653,8 427.53,9 1.8,10 22,11 57,13 24,14 35,16 60,17 27,20 22,21 5,22 2,24 25,25 5,28 1,29 4,32 32,35 7,36 0.133,37 8,38 48,39 57.014,40 63.318,41 38.96,42 37.202,44 6.77}
{0 CHEMBL1915669,1 7.871,2 46.6,3 41.4,4 1.01,5 1.114,6 0.684,7 0.662,8 456.53,9 3.4,10 22,11 58,13 24,14 38,16 62,17 27,20 22,21 5,22 2,24 24,25 7,28 2,29 5,32 34,35 8.6,36 0.097,37 6,38 51,39 58.56,40 64.611,41 39.659,42 38.412,44 5.77}
{0 CHEMBL1915670,1 7.429,2 43.5,3 45.2,4 1.005,5 1.12,6 0.664,7 0.637,8 460.57,9 3.2,10 18,11 62,13 20,14 37,16 65,17 27,20 20,21 7,22 2,24 28,25 7,28 2,29 5,32 34,35 8.1,36 0.108,37 7,38 48,39 62.327,40 69.441,41 41.182,42 39.465,44 7.658}
{0 CHEMBL1915671,1 7.429,2 43.5,3 45.2,4 1.005,5 1.12,6 0.664,7 0.637,8 460.57,9 3.2,10 18,11 62,13 20,14 37,16 65,17 27,20 20,21 7,22 2,24 28,25 7,28 2,29 5,32 34,35 8.1,36 0.108,37 7,38 48,39 62.327,40 69.441,41 41.182,42 39.465,44 7.553}
{0 CHEMBL1915672,1 7.429,2 43.5,3 45.2,4 1.005,5 1.12,6 0.664,7 0.637,8 460.57,9 3.2,10 18,11 62,13 20,14 37,16 65,17 27,20 20,21 7,22 2,24 28,25 7,28 2,29 5,32 34,35 8.1,36 0.108,37 7,38 48,39 62.327,40 69.441,41 41.182,42 39.465,44 8.456}
{0 CHEMBL1915673,1 7.302,2 43.1,3 46.2,4 1.003,5 1.121,6 0.661,7 0.631,8 474.6,9 3.1,10 18,11 65,13 20,14 38,16 68,17 28,20 20,21 8,22 2,24 30,25 7,28 2,29 5,32 35,35 7.7,36 0.103,37 7,38 49,39 65.211,40 72.856,41 42.943,42 40.992,44 7.921}
{0 CHEMBL1915674,1 7.302,2 43.1,3 46.2,4 1.003,5 1.121,6 0.661,7 0.631,8 474.6,9 3.1,10 18,11 65,13 20,14 38,16 68,17 28,20 20,21 8,22 2,24 30,25 7,28 2,29 5,32 35,35 7.7,36 0.103,37 7,38 49,39 65.211,40 72.856,41 42.943,42 40.992,44 8.244}
{0 CHEMBL1915675,1 7.302,2 43.1,3 46.2,4 1.003,5 1.121,6 0.661,7 0.631,8 474.6,9 3.1,10 18,11 65,13 20,14 38,16 68,17 28,20 20,21 8,22 2,24 30,25 7,28 2,29 5,32 35,35 7.7,36 0.103,37 7,38 49,39 65.211,40 72.856,41 42.943,42 40.992,44 8.319}
{0 CHEMBL1915676,1 7.984,2 43.5,3 43.5,4 1.01,5 1.119,6 0.678,7 0.65,8 495.01,9 3.2,10 18,11 62,13 20,14 38,16 65,17 27,18 1,20 20,21 7,22 2,24 27,25 8,26 1,28 2,29 5,32 35,34 1,35 8.1,36 0.108,37 7,38 49,39 62.651,40 69.385,41 42.04,42 40.293,43 1.6,44 7.411}
{0 CHEMBL1915677,1 7.984,2 43.5,3 43.5,4 1.01,5 1.119,6 0.678,7 0.65,8 495.01,9 3.2,10 18,11 62,13 20,14 38,16 65,17 27,18 1,20 20,21 7,22 2,24 27,25 8,26 1,28 2,29 5,32 35,34 1,35 8.1,36 0.108,37 7,38 49,39 62.651,40 69.385,41 42.04,42 40.293,43 1.6,44 8.292}
{0 CHEMBL1915856,1 7.984,2 43.5,3 43.5,4 1.01,5 1.119,6 0.678,7 0.65,8 495.01,9 3.2,10 18,11 62,13 20,14 38,16 65,17 27,18 1,20 20,21 7,22 2,24 27,25 8,26 1,28 2,29 5,32 35,34 1,35 8.1,36 0.108,37 7,38 49,39 62.651,40 69.385,41 42.04,42 40.293,43 1.6,44 8.157}
{0 CHEMBL1915857,1 8.31,2 44.8,3 41.4,4 1.017,5 1.115,6 0.685,7 0.663,8 481.96,9 1.7,10 18,11 58,13 20,14 37,16 61,17 26,18 1,20 20,21 6,22 2,24 24,25 8,26 1,28 1,29 6,32 34,34 1,35 10.3,36 0.115,37 7,38 48,39 58.993,40 64.681,41 39.727,42 38.459,43 1.7,44 8.367}
{0 CHEMBL1915858,1 8.175,2 45.6,3 42.1,4 1.012,5 1.114,6 0.689,7 0.662,8 465.96,9 1.8,10 18,11 57,13 20,14 36,16 60,17 26,18 1,20 20,21 6,22 2,24 24,25 7,26 1,28 1,29 5,32 33,34 1,35 8.8,36 0.117,37 7,38 47,39 57.665,40 63.472,41 39.273,42 37.744,43 1.8,44 8.824}
{0 CHEMBL1915859,1 8.175,2 45.6,3 42.1,4 1.012,5 1.114,6 0.689,7 0.662,8 465.96,9 1.8,10 18,11 57,13 20,14 36,16 60,17 26,18 1,20 20,21 6,22 2,24 24,25 7,26 1,28 1,29 5,32 33,34 1,35 8.8,36 0.117,37 7,38 47,39 57.665,40 63.472,41 39.273,42 37.744,43 1.8,44 7.854}
{0 CHEMBL1915860,1 8.508,2 45.5,3 40,4 1.02,5 1.114,6 0.69,7 0.671,8 467.93,9 1.8,10 18,11 55,13 20,14 36,16 58,17 25,18 1,20 20,21 5,22 2,24 22,25 8,26 1,28 1,29 6,32 33,34 1,35 10.9,36 0.121,37 7,38 47,39 56.109,40 61.266,41 37.966,42 36.932,43 1.8,44 7.569}
{0 CHEMBL1915861,1 8.54,2 43.5,3 41.9,4 1.016,5 1.118,6 0.692,7 0.663,8 529.45,9 3.2,10 18,11 62,13 20,14 39,16 65,17 27,18 2,20 20,21 7,22 2,24 26,25 9,26 2,28 2,29 5,32 36,34 2,35 8.1,36 0.108,37 7,38 50,39 62.974,40 69.329,41 42.898,42 41.12,43 3.2,44 8.155}
{0 CHEMBL1915862,1 7.692,2 42.6,3 45.6,4 1.006,5 1.121,6 0.67,7 0.637,8 523.07,9 2.9,10 18,11 68,13 20,14 40,16 71,17 29,18 1,20 20,21 9,22 2,24 31,25 8,26 1,28 2,29 5,32 37,34 1,35 7.4,36 0.099,37 7,38 51,39 68.418,40 76.216,41 45.563,42 43.346,43 1.5,44 7.367}
{0 CHEMBL1915863,1 7.692,2 42.6,3 45.6,4 1.006,5 1.121,6 0.67,7 0.637,8 523.07,9 2.9,10 18,11 68,13 20,14 40,16 71,17 29,18 1,20 20,21 9,22 2,24 31,25 8,26 1,28 2,29 5,32 37,34 1,35 7.4,36 0.099,37 7,38 51,39 68.418,40 76.216,41 45.563,42 43.346,43 1.5,44 9.155}
{0 CHEMBL1915864,1 7.895,2 43.9,3 43.9,4 1.008,5 1.118,6 0.679,7 0.649,8 521.05,9 3,10 18,11 66,13 20,14 41,16 70,17 29,18 1,20 20,21 9,22 2,24 29,25 8,26 1,28 2,29 5,32 37,34 1,35 7.6,36 0.1,37 7,38 52,39 66.534,40 73.8,41 44.801,42 42.819,43 1.5,44 7.585}
{0 CHEMBL1915865,1 7.895,2 43.9,3 43.9,4 1.008,5 1.118,6 0.679,7 0.649,8 521.05,9 3,10 18,11 66,13 20,14 41,16 70,17 29,18 1,20 20,21 9,22 2,24 29,25 8,26 1,28 2,29 5,32 37,34 1,35 7.6,36 0.1,37 7,38 52,39 66.534,40 73.8,41 44.801,42 42.819,43 1.5,44 9}
{0 CHEMBL1915866,1 9.596,2 44.6,3 35.7,4 1.04,5 1.128,6 0.701,7 0.693,8 537.37,9 3.6,10 18,11 56,13 20,14 39,16 59,17 25,18 2,20 20,21 5,22 2,23 2,24 20,25 11,26 2,28 2,29 5,32 36,34 4,35 8.9,36 0.119,37 7,38 50,39 58.233,40 63.178,41 39.25,42 38.833,43 7.1,44 8.854}
{0 CHEMBL1915867,1 8,2 45,3 43.3,4 1.009,5 1.115,6 0.684,7 0.655,8 479.99,9 1.7,10 18,11 60,13 20,14 37,16 63,17 27,18 1,20 20,21 7,22 2,24 26,25 7,26 1,28 1,29 5,32 34,34 1,35 8.3,36 0.111,37 7,38 48,39 60.549,40 66.887,41 41.034,42 39.271,43 1.7,44 7.62}
{0 CHEMBL359564,1 7.721,2 47.5,3 42.4,4 1.006,5 1.111,6 0.685,7 0.66,8 455.54,9 1.7,10 22,11 59,13 24,14 38,16 63,17 28,20 22,21 6,22 2,24 25,25 6,28 1,29 5,32 34,35 8.5,36 0.095,37 6,38 51,39 59.342,40 65.528,41 40.415,42 38.917,44 6.745}
{0 CHEMBL361098,1 7.48,2 43.1,3 45.1,4 1.009,5 1.12,6 0.66,7 0.635,8 381.46,9 2,10 16,11 51,13 18,14 30,16 53,17 22,20 16,21 6,22 2,24 23,25 6,28 1,29 5,32 28,35 9.8,36 0.132,37 7,38 40,39 51.458,40 57.113,41 33.654,42 32.39,44 5.398}
{0 CHEMBL361452,1 7.324,2 42.6,3 46.3,4 1.006,5 1.121,6 0.656,7 0.628,8 395.49,9 1.9,10 16,11 54,13 18,14 31,16 56,17 23,20 16,21 7,22 2,24 25,25 6,28 1,29 5,32 29,35 9.3,36 0.143,37 8,38 41,39 54.342,40 60.528,41 35.415,42 33.917,44 5}
{0 CHEMBL361457,1 7.657,2 48.1,3 42.6,4 1.002,5 1.109,6 0.689,7 0.661,8 413.5,9 1.9,10 22,11 54,13 24,14 34,16 57,17 26,20 22,21 4,22 2,24 23,25 5,28 1,29 4,32 31,35 7.4,36 0.123,37 7,38 47,39 54.131,40 59.903,41 37.199,42 35.675,44 6.921}
{0 CHEMBL362541,1 7.324,2 42.6,3 46.3,4 1.006,5 1.121,6 0.656,7 0.628,8 395.49,9 1.9,10 16,11 54,13 18,14 31,16 56,17 23,20 16,21 7,22 2,24 25,25 6,28 1,29 5,32 29,35 9.3,36 0.143,37 8,38 41,39 54.342,40 60.528,41 35.415,42 33.917,44 5.796}
{0 CHEMBL363984,1 7.884,2 48.2,3 41.1,4 1.008,5 1.109,6 0.69,7 0.668,8 441.51,9 1.8,10 22,11 56,13 24,14 37,16 60,17 27,20 22,21 5,22 2,24 23,25 6,28 1,29 5,32 33,35 8.9,36 0.1,37 6,38 50,39 56.458,40 62.113,41 38.654,42 37.39,44 7.699}
{0 CHEMBL364421,1 7.324,2 42.6,3 46.3,4 1.006,5 1.121,6 0.656,7 0.628,8 395.49,9 1.9,10 16,11 54,13 18,14 31,16 56,17 23,20 16,21 7,22 2,24 25,25 6,28 1,29 5,32 29,35 9.3,36 0.143,37 8,38 41,39 54.342,40 60.528,41 35.415,42 33.917,44 5.602}
{0 CHEMBL364593,1 8.026,2 47.4,3 40.4,4 1.014,5 1.111,6 0.686,7 0.669,8 457.51,9 1.8,10 22,11 57,13 24,14 38,16 61,17 27,20 22,21 5,22 2,24 23,25 7,28 1,29 6,32 34,35 10.5,36 0.098,37 6,38 51,39 57.785,40 63.322,41 39.108,42 38.105,44 8}
{0 CHEMBL364841,1 7.714,2 45.9,3 42.6,4 1.007,5 1.115,6 0.679,7 0.655,8 470.56,9 3.3,10 22,11 61,13 24,14 39,16 65,17 28,20 22,21 6,22 2,24 26,25 7,28 2,29 5,32 35,35 8.2,36 0.092,37 6,38 52,39 61.443,40 68.026,41 41.421,42 39.938,44 8.31}
{0 CHEMBL365243,1 7.833,2 49,3 41.2,4 1.005,5 1.108,6 0.695,7 0.67,8 399.47,9 2,10 22,11 51,13 24,14 33,16 54,17 25,20 22,21 3,22 2,24 21,25 5,28 1,29 4,32 30,35 7.8,36 0.111,37 6,38 46,39 51.247,40 56.488,41 35.438,42 34.149,44 5.886}
{0 CHEMBL365696,1 7.714,2 45.9,3 42.6,4 1.007,5 1.115,6 0.679,7 0.655,8 470.56,9 3.3,10 22,11 61,13 24,14 39,16 65,17 28,20 22,21 6,22 2,24 26,25 7,28 2,29 5,32 35,35 8.2,36 0.092,37 6,38 52,39 61.443,40 68.026,41 41.421,42 39.938,44 6.638}
{0 CHEMBL365829,1 7.721,2 47.5,3 42.4,4 1.006,5 1.111,6 0.685,7 0.66,8 455.54,9 1.7,10 22,11 59,13 24,14 38,16 63,17 28,20 22,21 6,22 2,24 25,25 6,28 1,29 5,32 34,35 8.5,36 0.095,37 6,38 51,39 59.342,40 65.528,41 40.415,42 38.917,44 7.222}
{0 CHEMBL365908,1 8.026,2 47.4,3 40.4,4 1.014,5 1.111,6 0.686,7 0.669,8 457.51,9 1.8,10 22,11 57,13 24,14 38,16 61,17 27,20 22,21 5,22 2,24 23,25 7,28 1,29 6,32 34,35 10.5,36 0.098,37 6,38 51,39 57.785,40 63.322,41 39.108,42 38.105,44 6.921}
{0 CHEMBL425167,1 7.185,2 42.1,3 47.4,4 1.004,5 1.122,6 0.652,7 0.622,8 409.52,9 1.8,10 16,11 57,13 18,14 32,16 59,17 24,20 16,21 8,22 2,24 27,25 6,28 1,29 5,32 30,35 8.8,36 0.153,37 9,38 42,39 57.225,40 63.943,41 37.176,42 35.444,44 5.824}
{0 CHEMBL6,1 8.727,2 46.3,3 39,4 1.02,5 1.112,6 0.702,7 0.681,8 357.81,9 2.4,10 16,11 41,13 18,14 27,16 43,17 19,18 1,20 16,21 3,22 2,24 16,25 6,26 1,28 1,29 4,32 25,34 1,35 9.8,36 0.093,37 4,38 37,39 41.804,40 45.602,41 28.773,42 27.923,43 2.4,44 5}
