{
  "data_features": {
    "feature": [
      {
        "data_type": "nominal",
        "index": "0",
        "is_ignore": "false",
        "is_row_identifier": "true",
        "is_target": "false",
        "name": "molecule_id",
        "nominal_value": [
          "CHEMBL172893",
          "CHEMBL173195",
          "CHEMBL173733",
          "CHEMBL174279",
          "CHEMBL174332",
          "CHEMBL174582",
          "CHEMBL174590",
          "CHEMBL174689",
          "CHEMBL174920",
          "CHEMBL174969",
          "CHEMBL174983",
          "CHEMBL175036",
          "CHEMBL175099",
          "CHEMBL175280",
          "CHEMBL175561",
          "CHEMBL175575",
          "CHEMBL176170",
          "CHEMBL176394",
          "CHEMBL176771",
          "CHEMBL176784",
          "CHEMBL177214",
          "CHEMBL177222",
          "CHEMBL177494",
          "CHEMBL177561",
          "CHEMBL177619",
          "CHEMBL177787",
          "CHEMBL177822",
          "CHEMBL178015",
          "CHEMBL178044",
          "CHEMBL178273",
          "CHEMBL178590",
          "CHEMBL178795",
          "CHEMBL359731",
          "CHEMBL360467",
          "CHEMBL366522",
          "CHEMBL366763",
          "CHEMBL366836",
          "CHEMBL367131",
          "CHEMBL367951",
          "CHEMBL368080",
          "CHEMBL368100",
          "CHEMBL368316",
          "CHEMBL368466",
          "CHEMBL368567",
          "CHEMBL368825",
          "CHEMBL369488",
          "CHEMBL369816",
          "CHEMBL424958",
          "CHEMBL427490",
          "CHEMBL434551",
          "CHEMBL439656"
        ],
        "number_of_missing_values": "0"
      },
      {
        "data_type": "numeric",
        "index": "1",
        "is_ignore": "false",
        "is_row_identifier": "false",
        "is_target": "false",
        "name": "nAB",
        "number_of_missing_values": "0"
      },
      {
        "data_type": "numeric",
        "index": "2",
        "is_ignore": "false",
        "is_row_identifier": "false",
        "is_target": "false",
        "name": "nBM",
        "number_of_missing_values": "0"
      },
      {
        "data_type": "numeric",
        "index": "3",
        "is_ignore": "false",
        "is_row_identifier": "false",
        "is_target": "true",
        "name": "pXC50",
        "number_of_missing_values": "0"
      }
    ]
  }
}