"molecule_id","AMW","C.","H.","Me","Mi","Mp","Mv","MW","N.","nAB","nAT","nB","nBM","nBO","nBR","nBT","nC","nCL","nCsp","nCsp2","nCsp3","nDB","nF","nH","nHet","nHM","nI","nN","nO","nP","nS","nSK","nTB","nX","O.","RBF","RBN","SCBO","Se","Si","Sp","Sv","X.","pXC50"
{1 8.026,2 50,3 40.9,4 0.995,5 1.103,6 0.723,7 0.682,8 529.7,9 4.5,10 24,11 66,13 29,14 43,16 70,17 33,20 31,21 2,22 5,24 27,25 6,26 1,28 3,29 2,31 1,32 39,35 3,36 0.129,37 9,38 60,39 65.64,40 72.816,41 47.711,42 45.002,44 6.046}
{0 CHEMBL1089230,1 7.848,2 44.2,3 44.2,4 0.995,5 1.115,6 0.703,7 0.655,8 337.48,9 7,10 12,11 43,13 15,14 26,16 45,17 19,20 16,21 3,22 3,24 19,25 5,26 1,28 3,29 1,31 1,32 24,35 2.3,36 0.133,37 6,38 35,39 42.778,40 47.946,41 30.211,42 28.181,44 6.222}
{0 CHEMBL1090563,1 7.568,2 48.6,3 44.3,4 0.987,5 1.106,6 0.711,7 0.662,8 529.75,9 4.3,10 24,11 70,13 28,14 43,16 74,17 34,20 30,21 4,22 4,24 31,25 5,26 1,28 3,29 1,31 1,32 39,35 1.4,36 0.135,37 10,38 59,39 69.08,40 77.437,41 49.779,42 46.341,44 6.222}
{0 CHEMBL1090572,1 8.306,2 47.1,3 41.2,4 0.997,5 1.106,6 0.726,7 0.68,8 282.39,9 5.9,10 12,11 34,13 14,14 22,16 36,17 16,20 14,21 2,22 2,24 14,25 4,26 1,28 2,29 1,31 1,32 20,35 2.9,36 0.056,37 2,38 30,39 33.909,40 37.617,41 24.682,42 23.106,44 4.523}
{0 CHEMBL1090602,1 8.011,2 45.9,3 43.2,4 0.994,5 1.109,6 0.715,7 0.666,8 296.42,9 5.4,10 12,11 37,13 14,14 23,16 39,17 17,20 14,21 3,22 2,24 16,25 4,26 1,28 2,29 1,31 1,32 21,35 2.7,36 0.077,37 3,38 31,39 36.793,40 41.032,41 26.443,42 24.632,44 4.699}
{0 CHEMBL1090603,1 9.094,2 44.4,3 36.1,4 1.022,5 1.114,6 0.718,7 0.695,8 327.39,9 8.3,10 12,11 36,13 16,14 25,16 38,17 16,20 14,21 2,22 4,24 13,25 7,26 1,28 3,29 3,31 1,32 23,35 8.3,36 0.105,37 4,38 35,39 36.782,40 40.119,41 25.835,42 25.03,44 4.523}
{0 CHEMBL1090604,1 7.761,2 45,3 45,4 0.992,5 1.111,6 0.705,7 0.654,8 310.45,9 5,10 12,11 40,13 14,14 24,16 42,17 18,20 14,21 4,22 2,24 18,25 4,26 1,28 2,29 1,31 1,32 22,35 2.5,36 0.095,37 4,38 32,39 39.676,40 44.448,41 28.205,42 26.159,44 4.456}
{0 CHEMBL1090896,1 7.642,2 43.5,3 45.7,4 0.993,5 1.117,6 0.695,7 0.646,8 351.51,9 6.5,10 12,11 46,13 15,14 27,16 48,17 20,20 16,21 4,22 3,24 21,25 5,26 1,28 3,29 1,31 1,32 25,35 2.2,36 0.125,37 6,38 36,39 45.662,40 51.361,41 31.972,42 29.707,44 6}
{0 CHEMBL1090897,1 7.803,2 47.2,3 43.4,4 0.991,5 1.109,6 0.712,7 0.665,8 413.58,9 5.7,10 18,11 53,13 21,14 33,16 56,17 25,20 22,21 3,22 3,24 23,25 5,26 1,28 3,29 1,31 1,32 30,35 1.9,36 0.125,37 7,38 45,39 52.545,40 58.776,41 37.733,42 35.234,44 6.301}
{0 CHEMBL1090933,1 7.926,2 48.9,3 42.6,4 0.991,5 1.103,6 0.723,7 0.674,8 372.52,9 4.3,10 18,11 47,13 20,14 30,16 50,17 23,20 20,21 3,22 2,24 20,25 4,26 1,28 2,29 1,31 1,32 27,35 2.1,36 0.1,37 5,38 41,39 46.56,40 51.863,41 33.966,42 31.686,44 5}
{0 CHEMBL1091243,1 10.088,2 42.3,3 30.8,4 1.041,5 1.119,6 0.728,7 0.72,8 524.58,9 11.5,10 12,11 52,13 22,14 39,16 55,17 22,20 20,21 2,22 10,24 16,25 14,26 2,28 6,29 6,31 2,32 36,35 11.5,36 0.164,37 9,38 55,39 54.145,40 58.162,41 37.864,42 37.425,44 5}
{0 CHEMBL1091244,1 7.815,2 49,3 43.1,4 0.989,5 1.103,6 0.72,7 0.671,8 398.56,9 3.9,10 18,11 51,13 21,14 32,16 54,17 25,20 22,21 3,22 3,24 22,25 4,26 1,28 2,29 1,31 1,32 29,35 2,36 0.111,37 6,38 44,39 50.443,40 56.278,41 36.728,42 34.213,44 6.301}
{0 CHEMBL1091251,1 8.614,2 41.7,3 39.6,4 1.023,5 1.12,6 0.688,7 0.667,8 413.49,9 6.3,10 12,11 48,13 17,14 31,16 50,17 20,20 15,21 5,22 5,24 19,25 9,26 1,28 3,29 5,31 1,32 29,35 10.4,36 0.18,37 9,38 42,39 49.087,40 53.784,41 33.029,42 32.04,44 4.602}
{0 CHEMBL1091254,1 7.853,2 46.9,3 40.6,4 1.002,5 1.118,6 0.696,7 0.669,8 251.31,9 9.4,10 12,11 32,13 14,14 21,16 34,17 15,20 14,21 1,22 2,24 13,25 4,28 3,29 1,32 19,35 3.1,36 0.059,37 2,38 29,39 32.051,40 35.78,41 22.279,42 21.413,44 4.398}
{0 CHEMBL1091255,1 7.865,2 46.3,3 43.9,4 0.992,5 1.108,6 0.712,7 0.662,8 322.46,9 4.9,10 12,11 41,13 15,14 25,16 43,17 19,20 16,21 3,22 3,24 18,25 4,26 1,28 2,29 1,31 1,32 23,35 2.4,36 0.116,37 5,38 34,39 40.676,40 45.448,41 29.205,42 27.159,44 5.699}
{0 CHEMBL1091603,1 8.591,2 48,3 38,4 1.009,5 1.107,6 0.722,7 0.692,8 429.53,9 6,10 18,11 50,13 23,14 34,16 53,17 24,20 22,21 2,22 5,24 19,25 7,26 1,28 3,29 3,31 1,32 31,35 6,36 0.132,37 7,38 48,39 50.433,40 55.365,41 36.12,42 34.61,44 5.301}
{0 CHEMBL1092094,1 8.261,2 44.4,3 41.7,4 1,5 1.114,6 0.714,7 0.67,8 297.41,9 8.3,10 12,11 36,13 14,14 23,16 38,17 16,20 14,21 2,22 2,24 15,25 5,26 1,28 3,29 1,31 1,32 21,35 2.8,36 0.079,37 3,38 31,39 36.011,40 40.116,41 25.688,42 24.127,44 5}
{0 CHEMBL1092451,1 8.836,2 45,3 37.5,4 1.017,5 1.113,6 0.715,7 0.689,8 353.43,9 7.5,10 12,11 40,13 17,14 27,16 42,17 18,20 16,21 2,22 5,24 15,25 7,26 1,28 3,29 3,31 1,32 25,35 7.5,36 0.143,37 6,38 38,39 40.665,40 44.534,41 28.597,42 27.557,44 5.523}
{0 CHEMBL1092682,1 7.551,2 44,3 46,4 0.991,5 1.116,6 0.695,7 0.645,8 377.55,9 6,10 12,11 50,13 16,14 29,16 52,17 22,20 18,21 4,22 4,24 23,25 5,26 1,28 3,29 1,31 1,32 27,35 2,36 0.154,37 8,38 39,39 49.545,40 55.776,41 34.733,42 32.234,44 5.523}
{0 CHEMBL1092683,1 7.734,2 44.7,3 44.7,4 0.993,5 1.114,6 0.702,7 0.653,8 363.52,9 6.4,10 12,11 47,13 16,14 28,16 49,17 21,20 18,21 3,22 4,24 21,25 5,26 1,28 3,29 1,31 1,32 26,35 2.1,36 0.163,37 8,38 38,39 46.662,40 52.361,41 32.972,42 30.707,44 6.097}
{0 CHEMBL1092690,1 8.754,2 43.6,3 38.5,4 1.017,5 1.116,6 0.708,7 0.681,8 341.42,9 7.7,10 12,11 39,13 16,14 26,16 41,17 17,20 14,21 3,22 4,24 15,25 7,26 1,28 3,29 3,31 1,32 24,35 7.7,36 0.122,37 5,38 36,39 39.665,40 43.534,41 27.597,42 26.557,44 5}
{0 CHEMBL1093024,1 8.806,2 40.9,3 38.6,4 1.027,5 1.122,6 0.688,7 0.671,8 387.45,9 6.8,10 12,11 44,13 16,14 29,16 46,17 18,20 14,21 4,22 4,24 17,25 9,26 1,28 3,29 5,31 1,32 27,35 11.4,36 0.152,37 7,38 39,39 45.204,40 49.368,41 30.267,42 29.513,44 5}
{0 CHEMBL1093199,1 7.922,2 42.2,3 44.4,4 1.005,5 1.117,6 0.686,7 0.647,8 356.48,9 4.4,10 12,11 45,13 14,14 27,16 47,17 19,20 14,21 5,22 2,24 20,25 6,26 1,28 2,29 3,31 1,32 25,35 6.7,36 0.128,37 6,38 35,39 45.214,40 50.282,41 30.875,42 29.116,44 4.301}
{0 CHEMBL1093215,1 8.772,2 47.8,3 37,4 1.012,5 1.108,6 0.725,7 0.697,8 403.49,9 6.5,10 18,11 46,13 22,14 32,16 49,17 22,20 20,21 2,22 4,24 17,25 7,26 1,28 3,29 3,31 1,32 29,35 6.5,36 0.122,37 6,38 45,39 46.549,40 50.95,41 33.358,42 32.083,44 4.523}
{0 CHEMBL1093230,1 7.474,2 44.4,3 46.3,4 0.989,5 1.115,6 0.694,7 0.644,8 403.59,9 5.6,10 12,11 54,13 17,14 31,16 56,17 24,20 20,21 4,22 5,24 25,25 5,26 1,28 3,29 1,31 1,32 29,35 1.9,36 0.179,37 10,38 42,39 53.429,40 60.192,41 37.495,42 34.761,44 6.398}
{0 CHEMBL1093243,1 8.1,2 48.2,3 41.1,4 0.998,5 1.107,6 0.718,7 0.678,8 453.6,9 5.4,10 18,11 56,13 23,14 36,16 59,17 27,20 25,21 2,22 5,24 23,25 6,26 1,28 3,29 2,31 1,32 33,35 3.6,36 0.136,37 8,38 50,39 55.872,40 61.986,41 40.188,42 37.949,44 6}
{0 CHEMBL1093244,1 8.222,2 48.1,3 40.4,4 1,5 1.107,6 0.72,7 0.681,8 427.56,9 5.8,10 18,11 52,13 22,14 34,16 55,17 25,20 23,21 2,22 4,24 21,25 6,26 1,28 3,29 2,31 1,32 31,35 3.8,36 0.109,37 6,38 47,39 51.989,40 57.571,41 37.426,42 35.422,44 6.222}
{0 CHEMBL1093321,1 8.207,2 45.7,3 41.3,4 1.002,5 1.112,6 0.71,7 0.672,8 377.5,9 6.5,10 12,11 46,13 17,14 29,16 48,17 21,20 19,21 2,22 5,24 19,25 6,26 1,28 3,29 2,31 1,32 27,35 4.3,36 0.146,37 7,38 40,39 46.105,40 51.155,41 32.665,42 30.895,44 5}
{0 CHEMBL1093475,1 7.972,2 48.1,3 42.3,4 0.996,5 1.106,6 0.715,7 0.672,8 414.56,9 3.8,10 18,11 52,13 21,14 33,16 55,17 25,20 22,21 3,22 3,24 22,25 5,26 1,28 2,29 2,31 1,32 30,35 3.8,36 0.091,37 5,38 45,39 51.771,40 57.487,41 37.182,42 34.927,44 5.301}
{0 CHEMBL1093476,1 8.736,2 47.1,3 37.3,4 1.015,5 1.109,6 0.717,7 0.693,8 445.53,9 5.9,10 18,11 51,13 23,14 35,16 54,17 24,20 22,21 2,22 5,24 19,25 8,26 1,28 3,29 4,31 1,32 32,35 7.8,36 0.111,37 6,38 49,39 51.76,40 56.574,41 36.574,42 35.325,44 5}
{0 CHEMBL1093477,1 8.368,2 45.2,3 40.5,4 1.005,5 1.113,6 0.712,7 0.675,8 351.46,9 7.1,10 12,11 42,13 16,14 27,16 44,17 19,20 17,21 2,22 4,24 17,25 6,26 1,28 3,29 2,31 1,32 25,35 4.8,36 0.114,37 5,38 37,39 42.222,40 46.74,41 29.904,42 28.369,44 4.301}
{0 CHEMBL1093491,1 8.086,2 45,3 42.5,4 0.997,5 1.113,6 0.711,7 0.666,8 323.45,9 7.5,10 12,11 40,13 15,14 25,16 42,17 18,20 16,21 2,22 3,24 17,25 5,26 1,28 3,29 1,31 1,32 23,35 2.5,36 0.119,37 5,38 34,39 39.894,40 44.531,41 28.449,42 26.654,44 5.097}
{0 CHEMBL1093519,1 8.1,2 48.2,3 41.1,4 0.998,5 1.107,6 0.718,7 0.678,8 453.6,9 5.4,10 18,11 56,13 23,14 36,16 59,17 27,20 25,21 2,22 5,24 23,25 6,26 1,28 3,29 2,31 1,32 33,35 3.6,36 0.136,37 8,38 50,39 55.872,40 61.986,41 40.188,42 37.949,44 6.155}
{0 CHEMBL1093818,1 7.991,2 48,3 42,4 0.993,5 1.107,6 0.719,7 0.674,8 399.55,9 6,10 18,11 50,13 21,14 32,16 53,17 24,20 22,21 2,22 3,24 21,25 5,26 1,28 3,29 1,31 1,32 29,35 2,36 0.113,37 6,38 44,39 49.662,40 55.361,41 35.972,42 33.707,44 5.097}
{0 CHEMBL1093884,1 9.496,2 45.5,3 33.3,4 1.027,5 1.112,6 0.73,7 0.712,8 313.36,9 9.1,10 12,11 33,13 16,14 24,16 35,17 15,20 14,21 1,22 4,24 11,25 7,26 1,28 3,29 3,31 1,32 22,35 9.1,36 0.086,37 3,38 34,39 33.898,40 36.704,41 24.074,42 23.503,44 4.824}
{0 CHEMBL1093993,1 7.713,2 47.4,3 43.9,4 0.99,5 1.109,6 0.71,7 0.662,8 439.62,9 5.3,10 18,11 57,13 22,14 35,16 60,17 27,20 24,21 3,22 4,24 25,25 5,26 1,28 3,29 1,31 1,32 32,35 1.8,36 0.15,37 9,38 48,39 56.429,40 63.192,41 40.495,42 37.761,44 5.301}
{0 CHEMBL1093994,1 7.511,2 48.6,3 44.6,4 0.986,5 1.106,6 0.71,7 0.66,8 555.79,9 4.1,10 24,11 74,13 29,14 45,16 78,17 36,20 32,21 4,22 5,24 33,25 5,26 1,28 3,29 1,31 1,32 41,35 1.4,36 0.154,37 12,38 62,39 72.963,40 81.852,41 52.54,42 48.868,44 6.301}
{0 CHEMBL116028,1 6.804,2 35.3,3 50,4 0.994,5 1.147,6 0.635,7 0.596,8 231.34,9 14.7,10 6,11 34,13 8,14 18,16 35,17 12,20 8,21 4,22 2,24 17,25 5,28 5,32 17,36 0.057,37 2,38 23,39 33.811,40 38.983,41 21.597,42 20.268,44 4.71}
{0 CHEMBL1201259,1 6.285,2 27.6,3 56.6,4 1.008,5 1.156,6 0.575,7 0.541,8 477.69,9 6.6,11 76,14 35,16 78,17 21,21 21,24 43,25 12,28 5,29 7,32 33,35 9.2,36 0.09,37 7,38 35,39 76.589,40 87.846,41 43.677,42 41.12,44 4.602}
{0 CHEMBL154152,1 7.174,2 35.4,3 48.1,4 1.009,5 1.143,6 0.63,7 0.603,8 566.74,9 10.1,10 17,11 79,13 20,14 43,16 81,17 28,20 15,21 13,22 3,24 38,25 13,28 8,29 5,32 41,35 6.3,36 0.21,37 17,38 54.5,39 79.705,40 90.261,41 49.739,42 47.647,44 8.268}
{0 CHEMBL155016,1 7.621,2 35.8,3 44.8,4 1.017,5 1.143,6 0.637,7 0.62,8 510.62,9 11.9,10 17,11 67,13 20,14 39,16 69,17 24,20 15,21 9,22 3,24 30,25 13,28 8,29 5,32 37,35 7.5,36 0.188,37 13,38 50.5,39 68.171,40 76.601,41 42.693,42 41.54,44 8.268}
{0 CHEMBL157083,1 6.592,2 35,3 52.4,4 0.998,5 1.142,6 0.62,7 0.581,8 678.98,9 7.8,10 17,11 103,13 20,14 51,16 105,17 36,20 15,21 21,22 3,24 54,25 13,28 8,29 5,32 49,35 4.9,36 0.238,37 25,38 62.5,39 102.774,40 117.583,41 63.83,42 59.862,44 5.921}
{0 CHEMBL157904,1 7.621,2 35.8,3 44.8,4 1.017,5 1.143,6 0.637,7 0.62,8 510.62,9 11.9,10 17,11 67,13 20,14 39,16 69,17 24,20 15,21 9,22 3,24 30,25 13,28 8,29 5,32 37,35 7.5,36 0.188,37 13,38 50.5,39 68.171,40 76.601,41 42.693,42 41.54,44 7.252}
{0 CHEMBL16,1 8.138,2 48.4,3 38.7,4 1.009,5 1.113,6 0.701,7 0.681,8 252.29,9 6.5,10 12,11 31,13 14,14 21,16 33,17 15,20 14,21 1,22 2,24 12,25 4,28 2,29 2,32 19,35 6.5,36 0.061,37 2,38 29,39 31.276,40 34.491,41 21.727,42 21.106,44 4}
{0 CHEMBL1800937,1 6.901,2 34.8,3 50,4 1.003,5 1.145,6 0.626,7 0.593,8 317.44,9 10.9,10 6,11 46,13 8,14 25,16 48,17 16,20 8,21 8,22 2,24 23,25 7,28 5,29 2,32 23,35 4.3,36 0.125,37 6,38 30,39 46.116,40 52.647,41 28.79,42 27.278,44 8.638}
{0 CHEMBL1800938,1 7.292,2 34.8,3 47.8,4 1.014,5 1.152,6 0.625,7 0.601,8 335.43,9 10.9,10 6,11 46,13 8,14 26,16 48,17 16,20 8,21 8,22 2,23 1,24 22,25 8,28 5,29 2,32 24,34 1,35 4.3,36 0.125,37 6,38 31,39 46.629,40 52.987,41 28.728,42 27.661,43 2.2,44 7.996}
{0 CHEMBL1800939,1 7.65,2 34.8,3 47.8,4 1.01,5 1.143,6 0.645,7 0.611,8 351.88,9 10.9,10 6,11 46,13 8,14 26,16 48,17 16,18 1,20 8,21 8,22 2,24 22,25 8,26 1,28 5,29 2,32 24,34 1,35 4.3,36 0.125,37 6,38 31,39 46.44,40 52.591,41 29.648,42 28.105,43 2.2,44 8.143}
{0 CHEMBL1800940,1 7.551,2 33.3,3 45.8,4 1.021,5 1.149,6 0.624,7 0.608,8 362.44,9 12.5,10 6,11 48,13 10,14 28,16 50,17 16,20 8,21 8,22 4,24 22,25 10,28 6,29 4,32 26,35 8.3,36 0.14,37 7,38 35,39 48.989,40 55.149,41 29.943,42 29.202,44 8.076}
{0 CHEMBL1800941,1 6.765,2 34.7,3 51,4 1,5 1.144,6 0.624,7 0.588,8 331.47,9 10.2,10 6,11 49,13 8,14 26,16 51,17 17,20 8,21 9,22 2,24 25,25 7,28 5,29 2,32 24,35 4.1,36 0.118,37 6,38 31,39 49,40 56.062,41 30.552,42 28.805,44 8.022}
{0 CHEMBL1800942,1 6.441,2 34.5,3 53.4,4 0.994,5 1.143,6 0.618,7 0.576,8 373.56,9 8.6,10 6,11 58,13 8,14 29,16 60,17 20,20 8,21 12,22 2,24 31,25 7,28 5,29 2,32 27,35 3.4,36 0.117,37 7,38 34,39 57.65,40 66.308,41 35.836,42 33.385,44 7.77}
{0 CHEMBL1800943,1 6.949,2 34,3 50,4 1.007,5 1.145,6 0.62,7 0.59,8 347.47,9 10,10 6,11 50,13 8,14 27,16 52,17 17,20 8,21 9,22 2,24 25,25 8,28 5,29 3,32 25,35 6,36 0.135,37 7,38 32,39 50.327,40 57.272,41 31.006,42 29.519,44 7.951}
{0 CHEMBL1800944,1 7.286,2 36.2,3 46.8,4 1.007,5 1.143,6 0.639,7 0.612,8 342.45,9 12.8,10 6,11 47,13 9,14 27,16 49,17 17,19 1,20 8,21 8,22 2,24 22,25 8,28 6,29 2,32 25,33 1,35 4.3,36 0.122,37 6,38 34,39 47.334,40 53.73,41 30.034,42 28.772,44 8.119}
{0 CHEMBL1800945,1 7.049,2 35.3,3 49,4 1.006,5 1.143,6 0.628,7 0.598,8 359.48,9 9.8,10 6,11 51,13 9,14 28,16 53,17 18,20 9,21 9,22 3,24 25,25 8,28 5,29 3,32 26,35 5.9,36 0.132,37 7,38 34,39 51.327,40 58.272,41 32.006,42 30.519,44 8.036}
{0 CHEMBL1800946,1 6.765,2 34.7,3 51,4 1,5 1.144,6 0.624,7 0.588,8 331.47,9 10.2,10 6,11 49,13 8,14 26,16 51,17 17,20 8,21 9,22 2,24 25,25 7,28 5,29 2,32 24,35 4.1,36 0.118,37 6,38 31,39 49,40 56.062,41 30.552,42 28.805,44 8.161}
{0 CHEMBL1800947,1 7.132,2 34.7,3 49,4 1.01,5 1.151,6 0.622,7 0.596,8 349.46,9 10.2,10 6,11 49,13 8,14 27,16 51,17 17,20 8,21 9,22 2,23 1,24 24,25 8,28 5,29 2,32 25,34 1,35 4.1,36 0.118,37 6,38 32,39 49.512,40 56.402,41 30.489,42 29.188,43 2,44 7.812}
{0 CHEMBL1800948,1 7.468,2 34.7,3 49,4 1.007,5 1.143,6 0.641,7 0.605,8 365.91,9 10.2,10 6,11 49,13 8,14 27,16 51,17 17,18 1,20 8,21 9,22 2,24 24,25 8,26 1,28 5,29 2,32 25,34 1,35 4.1,36 0.118,37 6,38 32,39 49.323,40 56.006,41 31.409,42 29.632,43 2,44 7.86}
{0 CHEMBL1801197,1 7.382,2 33.3,3 47.1,4 1.017,5 1.148,6 0.622,7 0.603,8 376.47,9 11.8,10 6,11 51,13 10,14 29,16 53,17 17,20 8,21 9,22 4,24 24,25 10,28 6,29 4,32 27,35 7.8,36 0.132,37 7,38 36,39 51.872,40 58.564,41 31.705,42 30.729,44 7.833}
{0 CHEMBL1801198,1 6.644,2 34.6,3 51.9,4 0.998,5 1.144,6 0.621,7 0.583,8 345.5,9 9.6,10 6,11 52,13 8,14 27,16 54,17 18,20 8,21 10,22 2,24 27,25 7,28 5,29 2,32 25,35 3.8,36 0.111,37 6,38 32,39 51.883,40 59.478,41 32.313,42 30.331,44 7.757}
{0 CHEMBL1801199,1 6.354,2 34.4,3 54.1,4 0.992,5 1.143,6 0.616,7 0.572,8 387.59,9 8.2,10 6,11 61,13 8,14 30,16 63,17 21,20 8,21 13,22 2,24 33,25 7,28 5,29 2,32 28,35 3.3,36 0.111,37 7,38 35,39 60.534,40 69.723,41 37.597,42 34.912,44 7.668}
{0 CHEMBL1801200,1 6.821,2 34,3 50.9,4 1.004,5 1.145,6 0.618,7 0.586,8 361.5,9 9.4,10 6,11 53,13 8,14 28,16 55,17 18,20 8,21 10,22 2,24 27,25 8,28 5,29 3,32 26,35 5.7,36 0.127,37 7,38 33,39 53.211,40 60.687,41 32.767,42 31.046,44 8.215}
{0 CHEMBL1801201,1 7.13,2 36,3 48,4 1.004,5 1.143,6 0.636,7 0.606,8 356.48,9 12,10 6,11 50,13 9,14 28,16 52,17 18,19 1,20 8,21 9,22 2,24 24,25 8,28 6,29 2,32 26,33 1,35 4,36 0.115,37 6,38 35,39 50.218,40 57.145,41 31.796,42 30.299,44 8.013}
{0 CHEMBL1801202,1 6.917,2 35.2,3 50,4 1.004,5 1.142,6 0.625,7 0.593,8 373.51,9 9.3,10 6,11 54,13 9,14 29,16 56,17 19,20 9,21 10,22 3,24 27,25 8,28 5,29 3,32 27,35 5.6,36 0.125,37 7,38 35,39 54.211,40 61.687,41 33.767,42 32.046,44 7.876}
{0 CHEMBL1801203,1 7.603,2 31.5,3 48.1,4 1.015,5 1.146,6 0.632,7 0.601,8 410.56,9 11.1,10 6,11 54,13 10,14 30,16 56,17 17,20 8,21 9,22 4,24 26,25 11,26 1,28 6,29 4,31 1,32 28,35 7.4,36 0.125,37 7,38 37,39 54.832,40 61.899,41 34.114,42 32.443,44 8.252}
{0 CHEMBL18898,1 10.339,2 40.7,3 40.7,4 1.006,5 1.129,6 0.719,7 0.675,8 279.16,9 14.8,10 12,11 27,13 12,14 17,15 1,16 28,17 11,20 10,21 1,24 11,25 5,26 1,28 4,32 16,34 1,36 0.071,37 2,38 23,39 27.171,40 30.496,41 19.421,42 18.218,43 3.7,44 5.81}
{0 CHEMBL18912,1 8.398,2 36.1,3 38.9,4 1.031,5 1.147,6 0.651,7 0.649,8 302.33,9 16.7,10 12,11 36,13 15,14 23,16 37,17 13,20 11,21 2,22 3,24 14,25 9,28 6,29 3,32 22,35 8.3,36 0.108,37 4,38 32,39 37.127,40 41.279,41 23.443,42 23.38,44 5.55}
{0 CHEMBL18967,1 7.429,2 38.7,3 45.2,4 1.005,5 1.138,6 0.654,7 0.627,8 230.3,9 12.9,10 12,11 31,13 12,14 18,16 32,17 12,20 10,21 2,24 14,25 5,28 4,29 1,32 17,35 3.2,36 0.094,37 3,38 24,39 31.153,40 35.279,41 20.284,42 19.434,44 5.61}
{0 CHEMBL19023,1 7.429,2 38.7,3 45.2,4 1.005,5 1.138,6 0.654,7 0.627,8 230.3,9 12.9,10 12,11 31,13 12,14 18,16 32,17 12,20 10,21 2,24 14,25 5,28 4,29 1,32 17,35 3.2,36 0.094,37 3,38 24,39 31.153,40 35.279,41 20.284,42 19.434,44 5.35}
{0 CHEMBL19113,1 7.569,2 38.2,3 44.1,4 1.007,5 1.14,6 0.656,7 0.631,8 257.33,9 14.7,10 12,11 34,13 13,14 20,16 35,17 13,20 11,21 2,22 1,24 15,25 6,28 5,29 1,32 19,35 2.9,36 0.086,37 3,38 27,39 34.254,40 38.777,41 22.29,42 21.456,44 5.83}
{0 CHEMBL19293,1 10.339,2 40.7,3 40.7,4 1.006,5 1.129,6 0.719,7 0.675,8 279.16,9 14.8,10 12,11 27,13 12,14 17,15 1,16 28,17 11,20 10,21 1,24 11,25 5,26 1,28 4,32 16,34 1,36 0.071,37 2,38 23,39 27.171,40 30.496,41 19.421,42 18.218,43 3.7,44 5.42}
{0 CHEMBL19383,1 6.953,2 37.1,3 48.6,4 0.995,5 1.142,6 0.646,7 0.608,8 243.35,9 14.3,10 12,11 35,13 12,14 19,16 36,17 13,20 10,21 3,24 17,25 5,28 5,32 18,36 0.083,37 3,38 25,39 34.811,40 39.983,41 22.597,42 21.268,44 5.21}
{0 CHEMBL19406,1 7.143,2 40,3 46.7,4 0.994,5 1.136,6 0.661,7 0.624,8 214.3,9 13.3,10 12,11 30,13 12,14 17,16 31,17 12,20 10,21 2,24 14,25 4,28 4,32 16,36 0.065,37 2,38 23,39 29.825,40 34.069,41 19.83,42 18.72,44 5.71}
{0 CHEMBL19414,1 8.458,2 37.9,3 37.9,4 1.028,5 1.143,6 0.663,7 0.659,8 245.27,9 17.2,10 12,11 29,13 14,14 19,16 30,17 11,20 10,21 1,22 2,24 11,25 7,28 5,29 2,32 18,35 6.9,36 0.1,37 3,38 27,39 29.814,40 33.156,41 19.222,42 19.117,44 5.43}
{0 CHEMBL19633,1 7.438,2 37.1,3 45.7,4 1.01,5 1.14,6 0.643,7 0.619,8 260.33,9 11.4,10 12,11 35,13 12,14 20,16 36,17 13,20 10,21 3,24 16,25 6,28 4,29 2,32 19,35 5.7,36 0.111,37 4,38 26,39 35.363,40 39.903,41 22.5,42 21.676,44 5.66}
{0 CHEMBL19672,1 7.424,2 37.9,3 44.8,4 1.001,5 1.143,6 0.658,7 0.628,8 215.29,9 17.2,10 12,11 29,13 12,14 17,16 30,17 11,20 10,21 1,24 13,25 5,28 5,32 16,36 0.067,37 2,38 23,39 29.043,40 33.152,41 19.074,42 18.214,44 4.96}
{0 CHEMBL19771,1 9.17,2 38.7,3 35.5,4 1.055,5 1.171,6 0.648,7 0.664,8 284.27,9 12.9,10 12,11 31,13 12,14 21,16 32,17 12,20 10,21 2,23 3,24 11,25 8,28 4,29 1,32 20,34 3,35 3.2,36 0.094,37 3,38 27,39 32.691,40 36.298,41 20.097,42 20.584,43 9.7,44 5.42}
{0 CHEMBL19772,1 8.084,2 40.7,3 40.7,4 1.017,5 1.148,6 0.667,7 0.651,8 218.26,9 14.8,10 12,11 27,13 12,14 17,16 28,17 11,20 10,21 1,23 1,24 11,25 5,28 4,32 16,34 1,36 0.071,37 2,38 23,39 27.454,40 30.994,41 18.006,42 17.576,43 3.7,44 5.67}
{0 CHEMBL19780,1 8.084,2 40.7,3 40.7,4 1.017,5 1.148,6 0.667,7 0.651,8 218.26,9 14.8,10 12,11 27,13 12,14 17,16 28,17 11,20 10,21 1,23 1,24 11,25 5,28 4,32 16,34 1,36 0.071,37 2,38 23,39 27.454,40 30.994,41 18.006,42 17.576,43 3.7,44 5.51}
{0 CHEMBL19790,1 8.942,2 40,3 36.7,4 1.045,5 1.17,6 0.655,7 0.662,8 268.27,9 13.3,10 12,11 30,13 12,14 20,16 31,17 12,20 10,21 2,23 3,24 11,25 7,28 4,32 19,34 3,36 0.065,37 2,38 26,39 31.363,40 35.088,41 19.642,42 19.87,43 10,44 5.78}
{0 CHEMBL22,1 7.445,2 35.9,3 46.2,4 1.015,5 1.142,6 0.634,7 0.613,8 290.36,9 10.3,10 12,11 39,13 12,14 22,16 40,17 14,20 10,21 4,24 18,25 7,28 4,29 3,32 21,35 7.7,36 0.125,37 5,38 28,39 39.574,40 44.528,41 24.716,42 23.918,44 5.51}
{0 CHEMBL265493,1 7.417,2 40.7,3 44.4,4 0.998,5 1.135,6 0.669,7 0.637,8 200.27,9 14.8,10 12,11 27,13 12,14 16,16 28,17 11,20 10,21 1,24 12,25 4,28 4,32 15,36 0.071,37 2,38 22,39 26.942,40 30.654,41 18.068,42 17.193,44 5.67}
{0 CHEMBL274031,1 7.473,2 43.9,3 43.9,4 0.998,5 1.125,6 0.678,7 0.646,8 306.4,9 9.8,10 18,11 41,13 18,14 25,16 43,17 18,20 16,21 2,24 18,25 5,28 4,29 1,32 23,35 2.4,36 0.116,37 5,38 34,39 40.92,40 46.109,41 27.807,42 26.488,44 6.53}
{0 CHEMBL277391,1 8.774,2 38.2,3 38.2,4 1.046,5 1.168,6 0.643,7 0.65,8 298.3,9 11.8,10 12,11 34,13 12,14 22,16 35,17 13,20 10,21 3,23 3,24 13,25 8,28 4,29 1,32 21,34 3,35 2.9,36 0.086,37 3,38 28,39 35.574,40 39.713,41 21.858,42 22.111,43 8.8,44 6.27}
{0 CHEMBL279273,1 8.009,2 37.9,3 41.4,4 1.021,5 1.14,6 0.654,7 0.642,8 232.27,9 13.8,10 12,11 29,13 12,14 18,16 30,17 11,20 10,21 1,24 12,25 6,28 4,29 2,32 17,35 6.9,36 0.067,37 2,38 24,39 29.596,40 33.073,41 18.977,42 18.622,44 4.59}
{0 CHEMBL280884,1 8.693,2 40.7,3 40.7,4 1.01,5 1.133,6 0.701,7 0.667,8 234.71,9 14.8,10 12,11 27,13 12,14 17,16 28,17 11,18 1,20 10,21 1,24 11,25 5,26 1,28 4,32 16,34 1,36 0.071,37 2,38 23,39 27.265,40 30.598,41 18.926,42 18.02,43 3.7,44 5.6}
{0 CHEMBL281760,1 6.661,2 37.2,3 51.2,4 0.993,5 1.138,6 0.636,7 0.594,8 286.42,9 9.3,10 12,11 43,13 12,14 22,16 44,17 16,20 10,21 6,24 22,25 5,28 4,29 1,32 21,35 2.3,36 0.159,37 7,38 28,39 42.687,40 48.939,41 27.33,42 25.542,44 5.86}
{0 CHEMBL283279,1 8.009,2 37.9,3 41.4,4 1.021,5 1.14,6 0.654,7 0.642,8 232.27,9 13.8,10 12,11 29,13 12,14 18,16 30,17 11,20 10,21 1,24 12,25 6,28 4,29 2,32 17,35 6.9,36 0.067,37 2,38 24,39 29.596,40 33.073,41 18.977,42 18.622,44 3.39}
{0 CHEMBL285209,1 6.418,2 36.7,3 53.1,4 0.989,5 1.138,6 0.63,7 0.584,8 314.48,9 8.2,10 12,11 49,13 12,14 24,16 50,17 18,20 10,21 8,24 26,25 5,28 4,29 1,32 23,35 2,36 0.18,37 9,38 30,39 48.454,40 55.77,41 30.853,42 28.595,44 5.57}
{0 CHEMBL287241,1 7.438,2 37.1,3 45.7,4 1.01,5 1.14,6 0.643,7 0.619,8 260.33,9 11.4,10 12,11 35,13 12,14 20,16 36,17 13,20 10,21 3,24 16,25 6,28 4,29 2,32 19,35 5.7,36 0.111,37 4,38 26,39 35.363,40 39.903,41 22.5,42 21.676,44 5.51}
{0 CHEMBL29712,1 12.08,2 40.7,3 40.7,4 1,5 1.125,6 0.768,7 0.686,8 326.16,9 14.8,10 12,11 27,13 12,14 17,16 28,17 11,20 10,21 1,24 11,25 5,26 1,27 1,28 4,32 16,34 1,36 0.071,37 2,38 23,39 27.011,40 30.375,41 20.728,42 18.51,43 3.7,44 6.15}
{0 CHEMBL30734,1 7.724,2 39.3,3 42.9,4 1.01,5 1.138,6 0.662,7 0.64,8 216.27,9 14.3,10 12,11 28,13 12,14 17,16 29,17 11,20 10,21 1,24 12,25 5,28 4,29 1,32 16,35 3.6,36 0.069,37 2,38 23,39 28.269,40 31.863,41 18.523,42 17.908,44 4.88}
{0 CHEMBL30937,1 6.418,2 36.7,3 53.1,4 0.989,5 1.138,6 0.63,7 0.584,8 314.48,9 8.2,10 12,11 49,13 12,14 24,16 50,17 18,20 10,21 8,24 26,25 5,28 4,29 1,32 23,35 2,36 0.18,37 9,38 30,39 48.454,40 55.77,41 30.853,42 28.595,44 5.45}
{0 CHEMBL31055,1 7.809,2 37.1,3 42.9,4 1.017,5 1.142,6 0.65,7 0.633,8 273.33,9 14.3,10 12,11 35,13 13,14 21,16 36,17 13,20 11,21 2,22 1,24 15,25 7,28 5,29 2,32 20,35 5.7,36 0.139,37 5,38 28,39 35.582,40 39.986,41 22.745,42 22.171,44 5.27}
{0 CHEMBL31235,1 6.317,2 36.5,3 53.8,4 0.987,5 1.138,6 0.627,7 0.579,8 328.51,9 7.7,10 12,11 52,13 12,14 25,16 53,17 19,20 10,21 9,24 28,25 5,28 4,29 1,32 24,35 1.9,36 0.189,37 10,38 31,39 51.338,40 59.185,41 32.614,42 30.122,44 5.78}
{0 CHEMBL31351,1 7.22,2 36.8,3 47.4,4 1.007,5 1.14,6 0.638,7 0.611,8 274.36,9 10.5,10 12,11 38,13 12,14 21,16 39,17 14,20 10,21 4,24 18,25 6,28 4,29 2,32 20,35 5.3,36 0.154,37 6,38 27,39 38.247,40 43.318,41 24.262,42 23.203,44 5.58}
{0 CHEMBL31402,1 7.111,2 34.7,3 49,4 1.011,5 1.143,6 0.622,7 0.596,8 348.45,9 8.2,10 12,11 49,13 12,14 26,16 50,17 17,20 10,21 7,24 24,25 8,28 4,29 4,32 25,35 8.2,36 0.2,37 10,38 32,39 49.552,40 55.983,41 30.455,42 29.213,44 5.17}
{0 CHEMBL31462,1 7.186,2 38.2,3 47.1,4 1.001,5 1.138,6 0.648,7 0.617,8 244.33,9 11.8,10 12,11 34,13 12,14 19,16 35,17 13,20 10,21 3,24 16,25 5,28 4,29 1,32 18,35 2.9,36 0.114,37 4,38 25,39 34.036,40 38.694,41 22.046,42 20.961,44 5.49}
{0 CHEMBL31547,1 6.532,2 37,3 52.2,4 0.991,5 1.138,6 0.632,7 0.588,8 300.45,9 8.7,10 12,11 46,13 12,14 23,16 47,17 17,20 10,21 7,24 24,25 5,28 4,29 1,32 22,35 2.2,36 0.17,37 8,38 29,39 45.571,40 52.355,41 29.091,42 27.068,44 6.39}
{0 CHEMBL31619,1 7.438,2 37.1,3 45.7,4 1.01,5 1.14,6 0.643,7 0.619,8 260.33,9 11.4,10 12,11 35,13 12,14 20,16 36,17 13,20 10,21 3,24 16,25 6,28 4,29 2,32 19,35 5.7,36 0.111,37 4,38 26,39 35.363,40 39.903,41 22.5,42 21.676,44 4.3}
{0 CHEMBL31912,1 6.532,2 37,3 52.2,4 0.991,5 1.138,6 0.632,7 0.588,8 300.45,9 8.7,10 12,11 46,13 12,14 23,16 47,17 17,20 10,21 7,24 24,25 5,28 4,29 1,32 22,35 2.2,36 0.17,37 8,38 29,39 45.571,40 52.355,41 29.091,42 27.068,44 5.55}
{0 CHEMBL31946,1 6.81,2 37.5,3 50,4 0.995,5 1.138,6 0.639,7 0.6,8 272.39,9 10,10 12,11 40,13 12,14 21,16 41,17 15,20 10,21 5,24 20,25 5,28 4,29 1,32 20,35 2.5,36 0.146,37 6,38 27,39 39.803,40 45.524,41 25.569,42 24.015,44 6.48}
{0 CHEMBL32039,1 7.27,2 34.8,3 47.8,4 1.015,5 1.143,6 0.624,7 0.602,8 334.42,9 8.7,10 12,11 46,13 12,14 25,16 47,17 16,20 10,21 6,24 22,25 8,28 4,29 4,32 24,35 8.7,36 0.17,37 8,38 31,39 46.669,40 52.568,41 28.693,42 27.686,44 4.88}
{0 CHEMBL32067,1 7.429,2 38.7,3 45.2,4 1.005,5 1.138,6 0.654,7 0.627,8 230.3,9 12.9,10 12,11 31,13 12,14 18,16 32,17 12,20 10,21 2,24 14,25 5,28 4,29 1,32 17,35 3.2,36 0.094,37 3,38 24,39 31.153,40 35.279,41 20.284,42 19.434,44 5.2}
{0 CHEMBL32793,1 6.81,2 37.5,3 50,4 0.995,5 1.138,6 0.639,7 0.6,8 272.39,9 10,10 12,11 40,13 12,14 21,16 41,17 15,20 10,21 5,24 20,25 5,28 4,29 1,32 20,35 2.5,36 0.146,37 6,38 27,39 39.803,40 45.524,41 25.569,42 24.015,44 5.74}
{0 CHEMBL34259,1 8.264,2 36.4,3 40,4 1.03,5 1.144,6 0.648,7 0.644,8 454.5,9 14.5,10 17,11 55,13 20,14 35,16 57,17 20,20 15,21 5,22 3,24 22,25 13,28 8,29 5,32 33,35 9.1,36 0.158,37 9,38 46.5,39 56.636,40 62.94,41 35.648,42 35.433,44 8.626}
{0 CHEMBL345807,1 6.845,2 35.2,3 50.5,4 1.003,5 1.142,6 0.624,7 0.591,8 622.86,9 8.8,10 17,11 91,13 20,14 47,16 93,17 32,20 15,21 17,22 3,24 46,25 13,28 8,29 5,32 45,35 5.5,36 0.226,37 21,38 58.5,39 91.239,40 103.922,41 56.785,42 53.754,44 6.357}
{0 CHEMBL347439,1 7.174,2 35.4,3 48.1,4 1.009,5 1.143,6 0.63,7 0.603,8 566.74,9 10.1,10 17,11 79,13 20,14 43,16 81,17 28,20 15,21 13,22 3,24 38,25 13,28 8,29 5,32 41,35 6.3,36 0.21,37 17,38 54.5,39 79.705,40 90.261,41 49.739,42 47.647,44 6.444}
{0 CHEMBL351765,1 6.845,2 35.2,3 50.5,4 1.003,5 1.142,6 0.624,7 0.591,8 622.86,9 8.8,10 17,11 91,13 20,14 47,16 93,17 32,20 15,21 17,22 3,24 46,25 13,28 8,29 5,32 45,35 5.5,36 0.226,37 21,38 58.5,39 91.239,40 103.922,41 56.785,42 53.754,44 7.469}
{0 CHEMBL351766,1 6.592,2 35,3 52.4,4 0.998,5 1.142,6 0.62,7 0.581,8 678.98,9 7.8,10 17,11 103,13 20,14 51,16 105,17 36,20 15,21 21,22 3,24 54,25 13,28 8,29 5,32 49,35 4.9,36 0.238,37 25,38 62.5,39 102.774,40 117.583,41 63.83,42 59.862,44 7.432}
{0 CHEMBL416177,1 7.143,2 40,3 46.7,4 0.994,5 1.136,6 0.661,7 0.624,8 214.3,9 13.3,10 12,11 30,13 12,14 17,16 31,17 12,20 10,21 2,24 14,25 4,28 4,32 16,36 0.065,37 2,38 23,39 29.825,40 34.069,41 19.83,42 18.72,44 5.27}
{0 CHEMBL417095,1 8.693,2 40.7,3 40.7,4 1.01,5 1.133,6 0.701,7 0.667,8 234.71,9 14.8,10 12,11 27,13 12,14 17,16 28,17 11,18 1,20 10,21 1,24 11,25 5,26 1,28 4,32 16,34 1,36 0.071,37 2,38 23,39 27.265,40 30.598,41 18.926,42 18.02,43 3.7,44 5.8}
{0 CHEMBL418584,1 7.22,2 36.8,3 47.4,4 1.007,5 1.14,6 0.638,7 0.611,8 274.36,9 10.5,10 12,11 38,13 12,14 21,16 39,17 14,20 10,21 4,24 18,25 6,28 4,29 2,32 20,35 5.3,36 0.154,37 6,38 27,39 38.247,40 43.318,41 24.262,42 23.203,44 5.31}
{0 CHEMBL434787,1 8.658,2 35.3,3 41.2,4 1.026,5 1.136,6 0.672,7 0.649,8 294.37,9 11.8,10 12,11 34,13 14,14 21,16 35,17 12,20 10,21 2,22 2,24 14,25 8,26 1,28 4,29 3,31 1,32 20,35 8.8,36 0.114,37 4,38 29,39 34.884,40 38.617,41 22.841,42 22.051,44 5.58}
{0 CHEMBL455,1 8.928,2 33.3,3 41.7,4 1.033,5 1.134,6 0.67,7 0.645,8 214.27,9 8.3,10 6,11 24,13 9,14 14,16 24,17 8,20 7,21 1,22 3,24 10,25 6,26 1,28 2,29 3,31 1,32 14,35 12.5,36 0.083,37 2,38 20,39 24.796,40 27.206,41 16.068,42 15.482,44 4.658}
{0 CHEMBL533117,1 8.121,2 35.5,3 45.2,4 1.008,5 1.146,6 0.668,7 0.631,8 251.75,9 16.1,10 6,11 31,13 8,14 18,16 32,17 11,18 1,20 8,21 3,22 2,24 14,25 6,26 1,28 5,32 17,34 1,36 0.063,37 2,38 23,39 31.251,40 35.512,41 20.693,42 19.569,43 3.2,44 4}
{0 CHEMBL573274,1 8.121,2 35.5,3 45.2,4 1.008,5 1.146,6 0.668,7 0.631,8 251.75,9 16.1,10 6,11 31,13 8,14 18,16 32,17 11,18 1,20 8,21 3,22 2,24 14,25 6,26 1,28 5,32 17,34 1,36 0.063,37 2,38 23,39 31.251,40 35.512,41 20.693,42 19.569,43 3.2,44 4}
{0 CHEMBL573275,1 11.715,2 38.5,3 30.8,4 1.043,5 1.137,6 0.765,7 0.737,8 304.58,9 19.2,10 12,11 26,13 12,14 19,16 27,17 10,18 3,20 9,21 1,24 8,25 8,26 3,28 5,32 18,34 3,36 0.074,37 2,38 25,39 27.131,40 29.569,41 19.886,42 19.17,43 11.5,44 4}
{0 CHEMBL573444,1 7.067,2 34.3,3 48.6,4 1.004,5 1.148,6 0.63,7 0.6,8 247.34,9 14.3,10 6,11 35,13 8,14 19,16 36,17 12,20 8,21 4,22 2,24 17,25 6,28 5,29 1,32 18,35 2.9,36 0.083,37 3,38 24,39 35.138,40 40.192,41 22.051,42 20.983,44 4}
{0 CHEMBL573445,1 7.067,2 34.3,3 48.6,4 1.004,5 1.148,6 0.63,7 0.6,8 247.34,9 14.3,10 6,11 35,13 8,14 19,16 36,17 12,20 8,21 4,22 2,24 17,25 6,28 5,29 1,32 18,35 2.9,36 0.083,37 3,38 24,39 35.138,40 40.192,41 22.051,42 20.983,44 4}
{0 CHEMBL573513,1 6.62,2 36.6,3 51.2,4 0.99,5 1.142,6 0.637,7 0.593,8 271.41,9 12.2,10 6,11 41,13 8,14 22,16 43,17 15,20 8,21 7,22 2,24 21,25 5,28 5,32 20,36 0.023,37 1,38 27,39 40.578,40 46.813,41 26.12,42 24.321,44 4}
{0 CHEMBL573514,1 6.843,2 35.7,3 50,4 0.998,5 1.143,6 0.633,7 0.596,8 287.41,9 11.9,10 6,11 42,13 8,14 23,16 44,17 15,20 8,21 7,22 2,24 21,25 6,28 5,29 1,32 21,35 2.4,36 0.045,37 2,38 28,39 41.905,40 48.023,41 26.574,42 25.036,44 4}
{0 CHEMBL573515,1 9.555,2 35.5,3 45.2,4 1.005,5 1.142,6 0.683,7 0.638,8 296.2,9 16.1,10 6,11 31,13 8,14 18,15 1,16 32,17 11,20 8,21 3,22 2,24 14,25 6,26 1,28 5,32 17,34 1,36 0.063,37 2,38 23,39 31.156,40 35.409,41 21.188,42 19.766,43 3.2,44 4}
{0 CHEMBL573962,1 6.878,2 34.2,3 50,4 1.001,5 1.148,6 0.627,7 0.592,8 261.37,9 13.2,10 6,11 38,13 8,14 20,16 39,17 13,20 8,21 5,22 2,24 19,25 6,28 5,29 1,32 19,35 2.6,36 0.077,37 3,38 25,39 38.022,40 43.607,41 23.813,42 22.509,44 4.231}
{0 CHEMBL574189,1 7.01,2 35.5,3 48.4,4 0.998,5 1.147,6 0.64,7 0.605,8 217.31,9 16.1,10 6,11 31,13 8,14 17,16 32,17 11,20 8,21 3,22 2,24 15,25 5,28 5,32 16,36 0.063,37 2,38 22,39 30.927,40 35.568,41 19.836,42 18.741,44 4}
{0 CHEMBL574411,1 6.773,2 36.8,3 50,4 0.992,5 1.142,6 0.641,7 0.6,8 257.38,9 13.2,10 6,11 38,13 8,14 21,16 40,17 14,20 8,21 6,22 2,24 19,25 5,28 5,32 19,36 0.025,37 1,38 26,39 37.694,40 43.398,41 24.358,42 22.795,44 4}
{0 CHEMBL574656,1 7.679,2 36.8,3 47.4,4 1,5 1.141,6 0.664,7 0.622,8 291.82,9 13.2,10 6,11 38,13 8,14 22,16 40,17 14,18 1,20 8,21 6,22 2,24 18,25 6,26 1,28 5,32 20,34 1,36 0.025,37 1,38 27,39 38.018,40 43.342,41 25.216,42 23.622,43 2.6,44 4}
{0 CHEMBL574657,1 6.62,2 36.6,3 51.2,4 0.99,5 1.142,6 0.637,7 0.593,8 271.41,9 12.2,10 6,11 41,13 8,14 22,16 43,17 15,20 8,21 7,22 2,24 21,25 5,28 5,32 20,36 0.023,37 1,38 27,39 40.578,40 46.813,41 26.12,42 24.321,44 4}
{0 CHEMBL574658,1 7.067,2 34.3,3 48.6,4 1.004,5 1.148,6 0.63,7 0.6,8 247.34,9 14.3,10 6,11 35,13 8,14 19,16 36,17 12,20 8,21 4,22 2,24 17,25 6,28 5,29 1,32 18,35 2.9,36 0.083,37 3,38 24,39 35.138,40 40.192,41 22.051,42 20.983,44 4}
{0 CHEMBL574661,1 7.817,2 35.3,3 47.1,4 1.004,5 1.145,6 0.66,7 0.62,8 265.78,9 14.7,10 6,11 34,13 8,14 19,16 35,17 12,18 1,20 8,21 4,22 2,24 16,25 6,26 1,28 5,32 18,34 1,36 0.057,37 2,38 24,39 34.134,40 38.927,41 22.455,42 21.095,43 2.9,44 4.524}
{0 CHEMBL574843,1 10.025,2 35.7,3 32.1,4 1.048,5 1.149,6 0.69,7 0.694,8 280.7,9 21.4,10 12,11 28,13 14,14 20,16 29,17 10,18 1,20 9,21 1,22 2,24 9,25 9,26 1,28 6,29 2,32 19,34 1,35 7.1,36 0.103,37 3,38 28,39 29.356,40 32.183,41 19.324,42 19.439,43 3.6,44 4}
{0 CHEMBL575299,1 6.843,2 35.7,3 50,4 0.998,5 1.143,6 0.633,7 0.596,8 287.41,9 11.9,10 6,11 42,13 8,14 23,16 44,17 15,20 8,21 7,22 2,24 21,25 6,28 5,29 1,32 21,35 2.4,36 0.045,37 2,38 28,39 41.905,40 48.023,41 26.574,42 25.036,44 4}
{0 CHEMBL575300,1 9.065,2 38.5,3 38.5,4 1.019,5 1.142,6 0.699,7 0.674,8 235.7,9 19.2,10 12,11 26,13 12,14 17,16 27,17 10,18 1,20 9,21 1,24 10,25 6,26 1,28 5,32 16,34 1,36 0.074,37 2,38 23,39 26.484,40 29.681,41 18.171,42 17.515,43 3.8,44 4}
{0 CHEMBL575493,1 9.555,2 35.5,3 45.2,4 1.005,5 1.142,6 0.683,7 0.638,8 296.2,9 16.1,10 6,11 31,13 8,14 18,15 1,16 32,17 11,20 8,21 3,22 2,24 14,25 6,26 1,28 5,32 17,34 1,36 0.063,37 2,38 23,39 31.156,40 35.409,41 21.188,42 19.766,43 3.2,44 4}
{0 CHEMBL575494,1 6.804,2 35.3,3 50,4 0.994,5 1.147,6 0.635,7 0.596,8 231.34,9 14.7,10 6,11 34,13 8,14 18,16 35,17 12,20 8,21 4,22 2,24 17,25 5,28 5,32 17,36 0.057,37 2,38 23,39 33.811,40 38.983,41 21.597,42 20.268,44 4}
{0 CHEMBL575703,1 6.62,2 36.6,3 51.2,4 0.99,5 1.142,6 0.637,7 0.593,8 271.41,9 12.2,10 6,11 41,13 8,14 22,16 43,17 15,20 8,21 7,22 2,24 21,25 5,28 5,32 20,36 0.023,37 1,38 27,39 40.578,40 46.813,41 26.12,42 24.321,44 4}
{0 CHEMBL575917,1 7.679,2 36.8,3 47.4,4 1,5 1.141,6 0.664,7 0.622,8 291.82,9 13.2,10 6,11 38,13 8,14 22,16 40,17 14,18 1,20 8,21 6,22 2,24 18,25 6,26 1,28 5,32 20,34 1,36 0.025,37 1,38 27,39 38.018,40 43.342,41 25.216,42 23.622,43 2.6,44 4}
{0 CHEMBL582877,1 9.555,2 35.5,3 45.2,4 1.005,5 1.142,6 0.683,7 0.638,8 296.2,9 16.1,10 6,11 31,13 8,14 18,15 1,16 32,17 11,20 8,21 3,22 2,24 14,25 6,26 1,28 5,32 17,34 1,36 0.063,37 2,38 23,39 31.156,40 35.409,41 21.188,42 19.766,43 3.2,44 4}
{0 CHEMBL582902,1 7.679,2 36.8,3 47.4,4 1,5 1.141,6 0.664,7 0.622,8 291.82,9 13.2,10 6,11 38,13 8,14 22,16 40,17 14,18 1,20 8,21 6,22 2,24 18,25 6,26 1,28 5,32 20,34 1,36 0.025,37 1,38 27,39 38.018,40 43.342,41 25.216,42 23.622,43 2.6,44 4}
{0 CHEMBL582944,1 8.121,2 35.5,3 45.2,4 1.008,5 1.146,6 0.668,7 0.631,8 251.75,9 16.1,10 6,11 31,13 8,14 18,16 32,17 11,18 1,20 8,21 3,22 2,24 14,25 6,26 1,28 5,32 17,34 1,36 0.063,37 2,38 23,39 31.251,40 35.512,41 20.693,42 19.569,43 3.2,44 4}
{0 CHEMBL582969,1 6.632,2 35.1,3 51.4,4 0.992,5 1.146,6 0.631,7 0.589,8 245.37,9 13.5,10 6,11 37,13 8,14 19,16 38,17 13,20 8,21 5,22 2,24 19,25 5,28 5,32 18,36 0.053,37 2,38 24,39 36.694,40 42.398,41 23.358,42 21.795,44 4.609}
{0 CHEMBL583174,1 6.804,2 35.3,3 50,4 0.994,5 1.147,6 0.635,7 0.596,8 231.34,9 14.7,10 6,11 34,13 8,14 18,16 35,17 12,20 8,21 4,22 2,24 17,25 5,28 5,32 17,36 0.057,37 2,38 23,39 33.811,40 38.983,41 21.597,42 20.268,44 4}
{0 CHEMBL583584,1 6.804,2 35.3,3 50,4 0.994,5 1.147,6 0.635,7 0.596,8 231.34,9 14.7,10 6,11 34,13 8,14 18,16 35,17 12,20 8,21 4,22 2,24 17,25 5,28 5,32 17,36 0.057,37 2,38 23,39 33.811,40 38.983,41 21.597,42 20.268,44 4}
{0 CHEMBL583755,1 10.775,2 38.5,3 38.5,4 1.015,5 1.138,6 0.718,7 0.681,8 280.15,9 19.2,10 12,11 26,13 12,14 17,15 1,16 27,17 10,20 9,21 1,24 10,25 6,26 1,28 5,32 16,34 1,36 0.074,37 2,38 23,39 26.389,40 29.579,41 18.665,42 17.713,43 3.8,44 4}
{0 CHEMBL583757,1 6.843,2 35.7,3 50,4 0.998,5 1.143,6 0.633,7 0.596,8 287.41,9 11.9,10 6,11 42,13 8,14 23,16 44,17 15,20 8,21 7,22 2,24 21,25 6,28 5,29 1,32 21,35 2.4,36 0.045,37 2,38 28,39 41.905,40 48.023,41 26.574,42 25.036,44 4}
{0 CHEMBL584171,1 8.83,2 35.3,3 44.1,4 1.013,5 1.143,6 0.686,7 0.645,8 300.22,9 14.7,10 6,11 34,13 8,14 20,16 35,17 12,18 2,20 8,21 4,22 2,24 15,25 7,26 2,28 5,32 19,34 2,36 0.057,37 2,38 25,39 34.458,40 38.871,41 23.313,42 21.923,43 5.9,44 4.893}
{0 CHEMBL584569,1 10.39,2 38.5,3 34.6,4 1.031,5 1.139,6 0.732,7 0.705,8 270.14,9 19.2,10 12,11 26,13 12,14 18,16 27,17 10,18 2,20 9,21 1,24 9,25 7,26 2,28 5,32 17,34 2,36 0.074,37 2,38 24,39 26.807,40 29.625,41 19.029,42 18.342,43 7.7,44 4}
{0 CHEMBL585168,1 12.1,2 38.5,3 34.6,4 1.027,5 1.135,6 0.751,7 0.713,8 314.59,9 19.2,10 12,11 26,13 12,14 18,15 1,16 27,17 10,18 1,20 9,21 1,24 9,25 7,26 2,28 5,32 17,34 2,36 0.074,37 2,38 24,39 26.713,40 29.523,41 19.523,42 18.54,43 7.7,44 4}
