{
  "data_set_description": {
    "collection_date": "November 2013",
    "creator": "Dr Jeremy Besnard, Dr Ivan Olier, Dr Noureddin Sadawi, Dr Larisa Soldatova, Dr Crina Grosan, Prof Ross King, Dr Richard Bickerton, Prof Andrew Hopkins and Dr Willem van Hoorn",
    "default_target_attribute": "pXC50",
    "description": "This dataset contains QSAR data (from ChEMBL version 17) showing activity values (unit is pseudo-pCI50) of several compounds on drug target ChEMBL_ID: CHEMBL2573 (TID: 12502), and it has 121 rows and 1322 features (not including molecule IDs and class feature: molecule_id and pXC50). The features represent Molecular Descriptors which were generated from SMILES strings. Missing value imputation was applied to this dataset (By choosing the Median).",
    "description_version": "1",
    "file_id": "3505761",
    "format": "ARFF",
    "id": "33455",
    "licence": "Public",
    "md5_checksum": "f13be32b4bb41ee498b2a5029d68a37b",
    "minio_url": "https://data.openml.org/datasets/0003/33455/dataset_33455.pq",
    "name": "QSAR-DATASET-FOR-DRUG-TARGET-CHEMBL2573",
    "original_data_url": "https://www.ebi.ac.uk/chembl/target/inspect/CHEMBL2573",
    "parquet_url": "https://data.openml.org/datasets/0003/33455/dataset_33455.pq",
    "processing_date": "2018-10-04 03:22:40",
    "row_id_attribute": "molecule_id",
    "status": "deactivated",
    "tag": [
      "MetaQSAR",
      "study_13"
    ],
    "upload_date": "2016-07-15T12:49:26",
    "url": "https://api.openml.org/data/v1/download/3505761/QSAR-DATASET-FOR-DRUG-TARGET-CHEMBL2573.arff",
    "version": "11",
    "visibility": "public"
  }
}