"molecule_id","AMW","C.","pXC50"
{1 7.054,2 34.8,3 8.194}
{0 CHEMBL140459,1 6.451,2 37.2,3 6.77}
{0 CHEMBL2114365,1 6.451,2 37.2,3 6.114}
{0 CHEMBL281437,1 7.009,2 33.3,3 9.076}
{0 CHEMBL282212,1 6.181,2 28.6,3 5.699}
{0 CHEMBL282583,1 6.818,2 34,3 8.602}
{0 CHEMBL284228,1 5.943,2 34.7,3 4.444}
{0 CHEMBL28623,1 6.498,2 35.6,3 8.398}
{0 CHEMBL28708,1 6.609,2 34.5,3 5.553}
{0 CHEMBL29292,1 6.705,2 34.8,3 7.538}
{0 CHEMBL305198,1 7.054,2 34.8,3 8.337}
{0 CHEMBL309130,1 6.149,2 34.9,3 4.409}
{0 CHEMBL68509,1 5.932,2 24,3 9.041}
{0 CHEMBL68979,1 7.054,2 34.8,3 5.62}
{0 CHEMBL69146,1 5.29,2 24,3 4}
{0 CHEMBL69238,1 6.523,2 34.9,3 4.447}
{0 CHEMBL69239,1 6.523,2 34.9,3 5.398}
{0 CHEMBL69349,1 5.795,2 26.1,3 6.886}
{0 CHEMBL69814,1 5.666,2 26.9,3 5.155}
