"molecule_id","AMW","C.","H.","Me","Mi","Mp","Mv","MW","N.","nAB","nAT","nB","nBM","nBO","nBR","nBT","nC","nCL","nCsp","nCsp2","nCsp3","nDB","nF","nH","nHet","nHM","nI","nN","nO","nP","nS","nSK","nTB","nX","O.","RBF","RBN","SCBO","Se","Si","Sp","Sv","X.","pXC50"
{1 7.078,2 40.9,3 47.7,4 0.998,5 1.128,6 0.654,7 0.619,8 311.42,9 6.8,10 12,11 44,13 14,14 24,16 45,17 18,20 14,21 4,22 2,24 21,25 5,28 3,29 2,32 23,35 4.5,36 0.133,37 6,38 32,39 43.912,40 49.651,41 28.779,42 27.235,44 7.545}
{0 CHEMBL147344,1 7.276,2 40,3 46.7,4 1.005,5 1.13,6 0.65,7 0.621,8 327.42,9 6.7,10 12,11 45,13 14,14 25,16 46,17 18,20 14,21 4,22 2,24 21,25 6,28 3,29 3,32 24,35 6.7,36 0.196,37 9,38 33,39 45.24,40 50.86,41 29.233,42 27.95,44 7.943}
{0 CHEMBL148731,1 7.926,2 41.7,3 41.7,4 1.016,5 1.128,6 0.665,7 0.649,8 285.33,9 8.3,10 12,11 36,13 14,14 22,16 37,17 15,20 14,21 1,22 2,24 15,25 6,28 3,29 3,32 21,35 8.3,36 0.162,37 6,38 30,39 36.589,40 40.614,41 23.949,42 23.369,44 7.788}
{0 CHEMBL148833,1 7.926,2 41.7,3 41.7,4 1.016,5 1.128,6 0.665,7 0.649,8 285.33,9 8.3,10 12,11 36,13 14,14 22,16 37,17 15,20 14,21 1,22 2,24 15,25 6,28 3,29 3,32 21,35 8.3,36 0.162,37 6,38 30,39 36.589,40 40.614,41 23.949,42 23.369,44 7.564}
{0 CHEMBL148957,1 8.246,2 42.1,3 39.5,4 1.024,5 1.127,6 0.669,7 0.66,8 313.34,9 7.9,10 12,11 38,13 15,14 24,16 39,17 16,20 15,21 1,22 3,24 15,25 7,28 3,29 4,32 23,35 10.5,36 0.179,37 7,38 33,39 38.916,40 42.824,41 25.404,42 25.084,44 7.889}
{0 CHEMBL149135,1 7.253,2 41.5,3 46.3,4 1.001,5 1.128,6 0.659,7 0.627,8 297.39,9 7.3,10 12,11 41,13 14,14 23,16 42,17 17,20 14,21 3,22 2,24 19,25 5,28 3,29 2,32 22,35 4.9,36 0.143,37 6,38 31,39 41.029,40 46.235,41 27.017,42 25.708,44 8.18}
{0 CHEMBL149156,1 7.078,2 40.9,3 47.7,4 0.998,5 1.128,6 0.654,7 0.619,8 311.42,9 6.8,10 12,11 44,13 14,14 24,16 45,17 18,20 14,21 4,22 2,24 21,25 5,28 3,29 2,32 23,35 4.5,36 0.133,37 6,38 32,39 43.912,40 49.651,41 28.779,42 27.235,44 6.523}
{0 CHEMBL149157,1 7.567,2 41.9,3 44.2,4 1.008,5 1.127,6 0.662,7 0.638,8 325.4,9 7,10 12,11 43,13 15,14 25,16 44,17 18,20 16,21 2,22 3,24 19,25 6,28 3,29 3,32 24,35 7,36 0.182,37 8,38 34,39 43.356,40 48.445,41 28.472,42 27.423,44 7.863}
{0 CHEMBL149324,1 7.978,2 43.8,3 40.6,4 1.012,5 1.125,6 0.679,7 0.66,8 255.3,9 9.4,10 12,11 32,13 14,14 20,16 33,17 14,20 14,22 2,24 13,25 5,28 3,29 2,32 19,35 6.3,36 0.152,37 5,38 28,39 32.378,40 35.99,41 21.733,42 21.128,44 8.252}
{0 CHEMBL150009,1 9.237,2 42.9,3 34.3,4 1.051,5 1.155,6 0.666,7 0.68,8 323.3,9 8.6,10 12,11 35,13 14,14 24,16 36,17 15,20 14,21 1,22 2,23 3,24 12,25 8,28 3,29 2,32 23,34 3,35 5.7,36 0.139,37 5,38 32,39 36.8,40 40.424,41 23.307,42 23.805,43 8.6,44 7.415}
{0 CHEMBL151454,1 7.695,2 42.9,3 42.9,4 1.007,5 1.126,6 0.671,7 0.647,8 269.33,9 8.6,10 12,11 35,13 14,14 21,16 36,17 15,20 14,21 1,22 2,24 15,25 5,28 3,29 2,32 20,35 5.7,36 0.139,37 5,38 29,39 35.262,40 39.405,41 23.495,42 22.655,44 8.481}
{0 CHEMBL151747,1 8.494,2 45.5,3 36.4,4 1.018,5 1.123,6 0.696,7 0.686,8 280.31,9 12.1,10 12,11 33,13 15,14 22,16 34,17 15,19 1,20 14,22 2,24 12,25 6,28 4,29 2,32 21,33 1,35 6.1,36 0.147,37 5,38 32,39 33.596,40 37.073,41 22.977,42 22.622,44 8.921}
{0 CHEMBL1834511,1 8.38,2 41.3,3 41.3,4 1.017,5 1.121,6 0.686,7 0.659,8 385.48,9 6.5,10 17,11 46,13 20,14 29,16 48,17 19,20 16,21 3,22 3,24 19,25 8,26 1,28 3,29 4,31 1,32 27,35 8.7,36 0.146,37 7,38 40.5,39 46.76,40 51.574,41 31.574,42 30.325,44 4.495}
{0 CHEMBL1911252,1 8.246,2 42.1,3 39.5,4 1.024,5 1.127,6 0.669,7 0.66,8 313.34,9 7.9,10 12,11 38,13 15,14 24,16 39,17 16,20 15,21 1,22 3,24 15,25 7,28 3,29 4,32 23,35 10.5,36 0.179,37 7,38 33,39 38.916,40 42.824,41 25.404,42 25.084,44 4.569}
{0 CHEMBL2023317,1 7.079,2 32.8,3 51.7,4 1.005,5 1.14,6 0.627,7 0.586,8 410.6,9 6.9,10 10,11 58,13 13,14 29,16 59,17 19,20 8,21 11,22 3,24 30,25 9,26 1,28 4,29 4,31 1,32 28,35 6.9,36 0.169,37 10,38 37,39 58.28,40 66.148,41 36.387,42 33.98,44 4.201}
{0 CHEMBL2316070,1 8.858,2 37,3 39.1,4 1.035,5 1.141,6 0.669,7 0.657,8 407.47,9 10.9,10 16,11 46,13 19,14 30,16 48,17 17,20 14,21 3,22 3,23 1,24 18,25 11,26 1,28 5,29 4,31 1,32 28,34 1,35 8.7,36 0.146,37 7,38 41,39 47.593,40 52.495,41 30.762,42 30.224,43 2.2,44 4.097}
{0 CHEMBL356950,1 9.237,2 42.9,3 34.3,4 1.051,5 1.155,6 0.666,7 0.68,8 323.3,9 8.6,10 12,11 35,13 14,14 24,16 36,17 15,20 14,21 1,22 2,23 3,24 12,25 8,28 3,29 2,32 23,34 3,35 5.7,36 0.139,37 5,38 32,39 36.8,40 40.424,41 23.307,42 23.805,43 8.6,44 7.481}
{0 CHEMBL357455,1 9.054,2 43.8,3 37.5,4 1.022,5 1.123,6 0.706,7 0.686,8 289.74,9 9.4,10 12,11 32,13 14,14 21,16 33,17 14,18 1,20 14,22 2,24 12,25 6,26 1,28 3,29 2,32 20,34 1,35 6.3,36 0.152,37 5,38 29,39 32.702,40 35.934,41 22.591,42 21.955,43 3.1,44 8.523}
{0 CHEMBL357708,1 7.926,2 41.7,3 41.7,4 1.016,5 1.128,6 0.665,7 0.649,8 285.33,9 8.3,10 12,11 36,13 14,14 22,16 37,17 15,20 14,21 1,22 2,24 15,25 6,28 3,29 3,32 21,35 8.3,36 0.162,37 6,38 30,39 36.589,40 40.614,41 23.949,42 23.369,44 7.754}
{0 CHEMBL358868,1 10.443,2 43.8,3 37.5,4 1.019,5 1.12,6 0.721,7 0.692,8 334.19,9 9.4,10 12,11 32,13 14,14 21,15 1,16 33,17 14,20 14,22 2,24 12,25 6,26 1,28 3,29 2,32 20,34 1,35 6.3,36 0.152,37 5,38 29,39 32.607,40 35.831,41 23.085,42 22.153,43 3.1,44 8.456}
{0 CHEMBL440176,1 6.97,2 39.2,3 49,4 1,5 1.131,6 0.642,7 0.608,8 355.48,9 5.9,10 12,11 51,13 14,14 27,16 52,17 20,20 14,21 6,22 2,24 25,25 6,28 3,29 3,32 26,35 5.9,36 0.192,37 10,38 35,39 51.007,40 57.69,41 32.756,42 31.003,44 7.001}
{0 CHEMBL539058,1 8.009,2 41,3 41,4 1.018,5 1.131,6 0.666,7 0.651,8 312.36,9 10.3,10 12,11 39,13 15,14 24,16 40,17 16,20 15,21 1,22 3,24 16,25 7,28 4,29 3,32 23,35 7.7,36 0.15,37 6,38 33,39 39.691,40 44.113,41 25.955,42 25.391,44 8.097}
{0 CHEMBL540096,1 7.985,2 41.5,3 41.5,4 1.02,5 1.128,6 0.663,7 0.649,8 327.37,9 7.3,10 12,11 41,13 15,14 25,16 42,17 17,20 15,21 2,22 3,24 17,25 7,28 3,29 4,32 24,35 9.8,36 0.19,37 8,38 34,39 41.8,40 46.239,41 27.165,42 26.611,44 8.032}
{0 CHEMBL542258,1 8.246,2 42.1,3 39.5,4 1.024,5 1.127,6 0.669,7 0.66,8 313.34,9 7.9,10 12,11 38,13 15,14 24,16 39,17 16,20 15,21 1,22 3,24 15,25 7,28 3,29 4,32 23,35 10.5,36 0.179,37 7,38 33,39 38.916,40 42.824,41 25.404,42 25.084,44 8.268}
{0 CHEMBL542261,1 8.494,2 45.5,3 36.4,4 1.018,5 1.123,6 0.696,7 0.686,8 280.31,9 12.1,10 12,11 33,13 15,14 22,16 34,17 15,19 1,20 14,22 2,24 12,25 6,28 4,29 2,32 21,33 1,35 6.1,36 0.147,37 5,38 32,39 33.596,40 37.073,41 22.977,42 22.622,44 8.143}
{0 CHEMBL543454,1 8.28,2 45.9,3 37.8,4 1.013,5 1.121,6 0.696,7 0.68,8 306.35,9 10.8,10 17,11 37,13 19,14 25,16 39,17 17,20 17,22 2,24 14,25 6,28 4,29 2,32 23,35 5.4,36 0.128,37 5,38 35.5,39 37.48,40 41.488,41 25.739,42 25.149,44 7.703}
{0 CHEMBL545564,1 8.287,2 41.7,3 38.9,4 1.022,5 1.13,6 0.672,7 0.663,8 298.33,9 11.1,10 12,11 36,13 15,14 23,16 37,17 15,20 15,22 3,24 14,25 7,28 4,29 3,32 22,35 8.3,36 0.162,37 6,38 32,39 36.807,40 40.697,41 24.193,42 23.864,44 6.523}
{0 CHEMBL554140,1 8.246,2 42.1,3 39.5,4 1.024,5 1.127,6 0.669,7 0.66,8 313.34,9 7.9,10 12,11 38,13 15,14 24,16 39,17 16,20 15,21 1,22 3,24 15,25 7,28 3,29 4,32 23,35 10.5,36 0.179,37 7,38 33,39 38.916,40 42.824,41 25.404,42 25.084,44 9.174}
