"molecule_id","AECC","ATS2e","ATS2i","ATS3i","ATS4e","ATS4i","ATS5i","ATSC1p","ATSC2m","ATSC2p","ATSC2v","ATSC3m","ATSC3p","ATSC3v","ATSC4m","ATSC4p","ATSC4v","ATSC5m","ATSC5p","ATSC5v","ATSC6m","ATSC6v","C.006","Chi1_EA.dm.","CIC3","DECC","Eig01_AEA.dm.","Eta_B_A","Eta_F_A","H.047","HVcpx","ICR","IDE","JGI1","JGT","MSD","nDB","NdO","O.058","ON1V","P_VSA_e_2","P_VSA_e_5","P_VSA_i_2","P_VSA_LogP_4","P_VSA_MR_5","SdO","Si","SpDiam_AEA.dm.","SpMax3_Bh.s.","SpMaxA_AEA.dm.","SpMax_AEA.dm.","SpMin2_Bh.e.","SpMin2_Bh.i.","SpMin4_Bh.s.","SpMin6_Bh.s.","SpMin6_Bh.v.","SpMin7_Bh.s.","TIC1","TIC2","TIC3","TIC4","TIC5","Uindex","Yindex","MATS5m","SpMin1_Bh.m.","ATSC1m","ATSC1v","ATSC2i","Psi_e_A","Psi_i_A","SssCH2","ATS1e","ATS1i","ATS1p","ATS1v","ATS2p","ATS3e","ATS3p","ATS3v","ATS4p","ATS5e","ATS5p","ATS6i","ATS7p","ATS8e","ATS8i","ATS8p","ATS8v","ATSC7v","Chi0_EA.dm.","D.Dtr06","Eig03_EA.dm.","Eta_L","ISIZ","nAT","nBT","SaasC","Se","SpMax6_Bh.e.","SpMax6_Bh.i.","SpMax6_Bh.m.","SpMax6_Bh.p.","SpMax6_Bh.v.","SpMaxA_AEA.bo.","SpMaxA_AEA.ed.","SpMaxA_AEA.ri.","SpMaxA_EA","SpMaxA_EA.bo.","SpMin3_Bh.i.","SpMin6_Bh.e.","SpMin6_Bh.i.","SpMin6_Bh.p.","SpMin7_Bh.v.","Vindex","X1Kup","X1MulPer","X1Per","Xindex","ATSC7m","CIC0","CIC1","CIC2","ECC","Eig05_AEA.ed.","Eig05_AEA.ri.","Eig05_EA","Eig05_EA.bo.","Eig05_EA.ed.","Eig05_EA.ri.","Eta_beta_A","Eta_betaP_A","Eta_FL_A","Eta_L_A","MDDD","Mp","MPC06","nCsp3","nH","ON0V","P_VSA_e_1","P_VSA_i_3","P_VSA_LogP_7","P_VSA_m_1","P_VSA_p_1","P_VSA_s_2","P_VSA_s_3","P_VSA_v_1","SAtot","SIC1","SM13_AEA.bo.","SM14_AEA.dm.","SM15_AEA.ri.","SpMAD_EA.bo.","SpMax7_Bh.i.","SpMax8_Bh.i.","SpMaxA_EA.ed.","SpMin4_Bh.e.","SpMin4_Bh.v.","SpMin5_Bh.s.","SpMin6_Bh.m.","SpMin7_Bh.m.","SpMin8_Bh.e.","SpMin8_Bh.p.","SpMin8_Bh.v.","SssO","UNIP","BIC0","P_VSA_MR_1","SIC0","SpMin4_Bh.m.","SpMin5_Bh.m.","GATS6e","MATS2i","C.002","pXC50"
{1 9.308,2 4.361,3 4.477,4 4.669,5 4.618,6 4.81,7 4.729,8 4.022,9 13.404,10 6.683,11 6.469,12 15.813,13 7.546,14 7.745,15 20.92,16 8.062,17 8.59,18 18.533,19 7.41,20 8.762,21 13.44,22 7.626,24 13.898,25 0.738,26 1.408,27 4.661,28 0.043,29 1.148,30 9,31 3.146,32 2.643,33 3.369,34 0.304,35 0.618,36 5.788,37 2,38 2,39 2,40 2.103,41 123.871,42 44.313,43 118.063,44 60.976,45 21.118,46 22.686,47 45.759,48 6.661,49 7.999,50 0.166,51 4.661,52 1.916,53 1.9,54 0.556,55 0.218,56 1.279,57 0.218,58 142.309,59 162.838,60 183.367,61 183.367,62 183.367,63 44.054,64 0.715,65 0.126,66 2.057,67 6.968,68 3.631,69 1.632,70 8.545,71 3.045,73 3.826,74 3.914,75 3.416,76 3.406,77 3.769,78 4.518,79 3.867,80 3.841,81 3.836,82 4.521,83 3.771,84 4.586,85 3.635,86 4.418,87 4.632,88 3.464,89 3.447,90 6.612,91 16.116,92 168.629,94 5.057,95 212.877,96 40,97 42,98 0.858,99 41.76,100 3.055,101 3.141,102 2.899,103 2.741,104 2.79,105 0.172,106 0.255,107 0.153,108 0.121,109 0.167,110 1.524,111 1,112 0.918,113 1.268,114 1.107,115 0.248,116 7.419,117 7.136,118 5.899,119 0.378,120 19.248,121 3.357,122 1.764,123 1.251,124 242,125 5.071,126 3.233,127 2.243,128 3.058,129 6.131,130 2.214,131 1.346,132 0.731,133 0.269,134 0.194,135 23.556,136 0.693,137 4.663,138 2,139 14,140 7.412,141 141.253,142 185.566,143 141.253,144 141.253,145 186.134,146 149.013,147 16.192,148 141.253,149 404.048,150 0.669,151 2.243,152 6.131,153 3.058,154 2.11,155 2.925,156 2.925,157 0.426,158 1.486,159 1.655,160 0.525,161 1.181,162 1.181,163 0.886,164 1.062,165 1.107,167 86,168 0.344,169 141.253,170 0.369,171 1.474,172 1.308,173 0.799,174 0.214,176 4.398}
{0 CHEMBL142493,1 9.429,2 4.148,3 4.279,4 4.43,5 4.38,6 4.535,7 4.584,8 3.635,9 12.683,10 5.528,11 6.362,12 14.655,13 6.45,14 7.577,15 16.89,16 6.858,17 8.035,18 18.262,19 6.99,20 8.513,21 16.896,22 8.934,24 9.519,25 0.838,26 1.361,27 3.49,28 0.021,29 1.011,30 15,31 3.209,32 2.661,33 3.343,34 0.182,35 0.451,36 5.581,37 2,38 1,39 1,40 1.918,41 129.044,42 89.828,43 129.044,44 72.962,46 12.043,47 41.159,48 5.49,49 4.937,50 0.159,51 3.49,52 1.868,53 1.852,54 0.574,55 0.218,56 1.131,57 0.144,58 116.304,59 142.079,60 161.73,61 169.24,62 175.24,63 39.368,64 0.755,65 -0.24,66 2.026,67 6.959,68 4.141,69 0.666,70 7.976,71 2.476,73 3.697,74 3.78,75 3.243,76 3.236,77 3.549,78 4.3,79 3.653,80 3.629,81 3.619,82 4.391,83 3.565,84 4.524,85 3.302,86 3.968,87 4.133,88 3.195,89 3.148,90 7.847,91 10.68,92 150.638,94 3.845,95 192.75,96 37,97 38,98 2.575,99 37.378,100 2.988,101 3.014,102 2.867,103 2.818,104 2.821,105 0.199,106 0.295,107 0.181,108 0.137,109 0.184,110 1.415,111 0.933,112 0.906,113 1.149,114 1.107,115 0.276,116 6.266,117 6.05,118 5.096,119 0.433,120 15.902,121 3.824,122 2.066,123 1.369,124 198,125 4.2,126 2.473,127 1.525,128 2.088,129 3.77,130 1.44,131 1.381,132 0.786,133 0.3,134 0.183,135 14.803,136 0.673,137 3.807,138 2,139 16,140 7.2,141 176.567,142 266.395,143 176.567,144 176.567,145 176.567,146 176.567,147 21.991,148 176.567,149 395.438,150 0.603,151 1.525,152 3.77,153 2.088,154 1.935,155 2.925,156 2.757,157 0.46,158 1.201,159 1.536,160 0.558,161 1.181,162 1.099,163 0.705,164 0.903,165 0.926,166 10.51,167 71,168 0.251,169 176.567,170 0.266,171 1.574,172 1.542,173 0.488,174 0.131,176 4.614}
{0 CHEMBL1651180,1 12.071,2 4.669,3 4.867,4 5.124,5 4.889,6 5.107,7 5.238,8 5.738,9 24.501,10 8.86,11 12.557,12 31.075,13 10.76,14 15.371,15 30.59,16 11.625,17 16.277,18 33.408,19 12.685,20 18.013,21 30.959,22 16.295,23 5,24 19.707,25 0.867,26 1.944,27 3.225,28 0.015,29 0.877,30 19,31 3.53,32 3.071,33 3.7,34 0.15,35 0.35,36 6.947,40 4.06,41 150.945,42 22,43 150.945,44 16.786,45 52.537,47 65.228,48 5.225,49 4.525,50 0.108,51 3.225,52 1.862,53 1.841,54 1.047,55 0.869,56 1.636,57 0.617,58 174.956,59 245.194,60 289.498,61 291.498,62 291.498,63 49.593,64 0.578,65 0.076,66 2.117,67 13.531,68 7.883,69 1.25,70 7.464,71 1.964,72 5.394,73 4.117,74 4.242,75 3.647,76 3.599,77 3.989,78 4.891,79 4.114,80 4.028,81 4.138,82 4.977,83 4.14,84 5.146,85 4.062,86 4.813,87 5.057,88 4.06,89 3.911,90 15.074,91 17.112,92 238.503,93 0.8,94 7.136,95 339.763,96 58,97 60,98 3.753,99 57.229,100 3.306,101 3.407,102 3.136,103 3.123,104 3.102,105 0.152,106 0.219,107 0.136,108 0.104,109 0.15,110 1.624,111 1.351,112 1.256,113 1.584,114 1.502,115 0.212,116 10.115,117 9.799,118 8.218,119 0.334,120 26.563,121 4.504,122 2.842,123 1.63,124 338,125 5.215,126 3.052,127 2.115,128 2.438,129 6.315,130 1.975,131 1.223,132 0.607,133 0.236,134 0.255,135 32.449,136 0.648,137 4.533,138 9,139 30,140 11.233,141 353.133,142 375.133,143 353.133,144 353.133,145 353.133,146 353.133,147 39.183,148 353.133,149 545.987,150 0.515,151 2.115,152 6.315,153 2.438,154 1.85,155 3.363,156 3.069,157 0.349,158 1.595,159 1.824,160 0.891,161 1.671,162 1.527,163 0.989,164 1.246,165 1.275,166 11.873,167 114,168 0.222,169 258.964,170 0.231,171 1.885,172 1.725,173 1.245,174 -0.012,175 1,176 5.155}
{0 CHEMBL1651181,1 12.655,2 4.723,3 4.911,4 5.228,5 4.955,6 5.198,7 5.152,8 5.918,9 25.532,10 9.563,11 13.359,12 34.093,13 12.236,14 17.355,15 32.827,16 12.185,17 17.191,18 31.082,19 11.926,20 16.716,21 29.48,22 15.737,23 5,24 19.707,25 0.759,26 2.033,27 3.225,28 0.015,29 0.847,30 19,31 3.593,32 3.083,33 3.753,34 0.125,35 0.298,36 7.181,40 4.06,41 140.898,42 22,43 140.898,44 16.786,45 42.49,47 66.228,48 5.225,49 4.525,50 0.101,51 3.225,52 1.862,53 1.841,54 1.048,55 0.825,56 1.52,57 0.623,58 179.024,59 254.282,60 302.321,61 304.321,62 304.321,63 44.663,64 0.475,65 0.061,66 2.118,67 13.705,68 8.057,69 1.336,70 7.414,71 1.914,72 9.788,73 4.149,74 4.27,75 3.698,76 3.652,77 4.075,78 4.989,79 4.197,80 4.093,81 4.149,82 4.906,83 4.113,84 5.086,85 4.082,86 4.814,87 5.054,88 4.081,89 3.94,90 15.441,91 17.112,92 334.802,93 0.8,94 7.766,95 347.076,96 59,97 62,98 3.808,99 58.229,100 3.357,101 3.413,102 3.222,103 3.212,104 3.205,105 0.142,106 0.205,107 0.128,108 0.097,109 0.14,110 1.763,111 1.356,112 1.299,113 1.506,114 1.429,115 0.175,116 10.701,117 10.463,118 8.695,119 0.278,120 27.836,121 4.531,122 2.848,123 1.573,124 367,125 5.222,126 3.059,127 2.122,128 2.516,129 6.327,130 1.981,131 1.216,132 0.586,133 0.226,134 0.268,135 34.005,136 0.654,137 4.595,138 10,139 30,140 10.733,141 353.133,142 375.133,143 353.133,144 353.133,145 353.133,146 353.133,147 46.786,148 353.133,149 535.94,150 0.516,151 2.122,152 6.327,153 2.516,154 1.843,155 3.206,156 3.1,157 0.327,158 1.595,159 1.824,160 1.007,161 1.535,162 1.513,163 1.003,164 1.261,165 1.282,166 11.956,167 121,168 0.22,169 282.506,170 0.23,171 1.885,172 1.722,173 1.214,174 -0.048,175 4,176 5.155}
{0 CHEMBL2048632,1 9.871,2 4.448,3 4.525,4 4.83,5 4.767,6 4.905,7 4.875,8 3.729,9 7.708,10 6.105,11 5.675,12 17.488,13 8.664,14 8.305,15 21.308,16 8.861,17 7.244,18 16.716,19 8.117,20 6.858,21 15.405,22 7.925,24 17.098,25 0.654,26 1.376,27 4.713,28 0.032,29 1.295,30 12,31 3.229,32 2.69,33 3.42,34 0.2,35 0.491,36 5.997,37 4,38 4,39 2,40 2.467,41 144.729,42 95.06,43 138.921,44 77.381,45 4.533,46 47.847,47 48.771,48 6.713,49 6.999,50 0.135,51 4.713,52 1.919,53 1.894,54 0.676,55 0.344,56 1.32,57 0.218,58 143.421,59 176.441,60 211.46,61 220.215,62 220.215,63 43.196,64 0.583,65 -0.075,66 2.038,67 5.469,68 3.233,69 1.042,70 8.13,71 2.63,73 3.953,74 4.021,75 3.619,76 3.602,77 4.027,78 4.7,79 4.16,80 4.128,81 4.123,82 4.729,83 4.099,84 4.797,85 4.173,86 4.743,87 4.908,88 4.046,89 3.958,90 10.013,91 18.917,92 280.359,94 5.453,95 240.215,96 44,97 48,98 3.63,99 45.535,100 3.393,101 3.405,102 3.416,103 3.017,104 3.105,105 0.142,106 0.214,107 0.129,108 0.102,109 0.138,110 1.861,111 1.211,112 1.214,113 1.36,114 1.296,115 0.196,116 9.148,117 8.848,118 7.273,119 0.296,120 20.601,121 3.553,122 2.2,123 1.449,124 306,125 5.833,126 3.37,127 2.39,128 3.375,129 7.852,130 2.339,131 1.565,132 0.919,133 0.303,134 0.176,135 28.876,136 0.753,137 5.247,139 13,140 8.076,141 141.253,142 275.462,143 141.253,144 141.253,145 141.253,146 141.253,147 25.206,148 141.253,149 460.705,150 0.597,151 2.39,152 7.852,153 3.375,154 2.187,155 2.93,156 2.925,157 0.385,158 1.484,159 1.663,160 0.464,161 1.181,162 1.181,163 0.886,164 1.062,165 1.107,167 109,168 0.318,169 141.253,170 0.349,171 1.484,172 1.325,173 0.673,174 -0.184,176 5}
{0 CHEMBL2158994,1 11.5,2 4.312,3 4.497,4 4.704,5 4.571,6 4.827,7 4.671,8 4.174,9 16.49,10 6.288,11 8.533,12 20.375,13 8.217,14 10.974,15 22.483,16 8.745,17 11.99,18 19.562,19 7.222,20 9.79,21 15.524,22 8.258,23 2,24 10.775,25 1.029,26 2.136,27 3.489,28 0.02,29 0.911,30 21,31 3.495,32 2.981,33 3.675,34 0.174,35 0.374,36 6.791,37 2,38 1,39 1,40 2.424,41 144.478,42 36.145,43 144.478,44 30.278,45 9.822,46 12.098,47 48.069,48 5.489,49 4.771,50 0.152,51 3.489,52 1.877,53 1.854,54 0.699,55 0.469,56 1.308,57 0.218,58 127.527,59 166.535,60 189.065,61 195.82,62 195.82,63 42.625,64 0.6,65 0.1,66 2.051,67 9.238,68 5.545,69 0.874,70 7.689,71 2.189,72 1.495,73 3.812,74 3.929,75 3.375,76 3.33,77 3.694,78 4.508,79 3.798,80 3.691,81 3.699,82 4.42,83 3.552,84 4.445,85 3.525,86 4.274,87 4.519,88 3.466,89 3.298,90 8.155,91 9.849,92 168.027,94 4.521,95 233.329,96 43,97 44,98 2.456,99 42.592,100 2.949,101 3.009,102 2.831,103 2.81,104 2.807,105 0.183,106 0.262,107 0.167,108 0.123,109 0.165,110 1.538,111 0.934,112 0.886,113 1.239,114 1.107,115 0.233,116 7.212,117 6.941,118 5.863,119 0.378,120 14.62,121 4.069,122 2.461,123 1.553,124 253,125 4.187,126 2.591,127 1.595,128 2.209,129 3.863,130 1.584,131 1.295,132 0.705,133 0.278,134 0.206,135 23.702,136 0.663,137 3.761,138 4,139 21,140 8.2,141 247.193,142 283.338,143 247.193,144 247.193,145 247.193,146 247.193,147 23.446,148 247.193,149 430.94,150 0.547,151 1.595,152 3.863,153 2.209,154 1.886,155 2.981,156 2.925,157 0.374,158 1.434,159 1.593,160 0.615,161 1.417,162 1.181,163 0.886,164 1.062,165 1.107,166 5.61,167 88,168 0.238,169 247.193,170 0.25,171 1.605,172 1.545,173 0.861,174 0.215,176 4.547}
{0 CHEMBL2158995,1 10.095,2 4.148,3 4.279,4 4.43,5 4.369,6 4.538,7 4.569,8 3.635,9 12.683,10 5.528,11 6.362,12 14.682,13 6.452,14 7.565,15 16.836,16 6.893,17 8.287,18 18.106,19 6.8,20 8.55,21 14.95,22 7.703,24 9.519,25 0.892,26 1.442,27 3.489,28 0.021,29 1,30 15,31 3.322,32 2.737,33 3.438,34 0.205,35 0.464,36 5.879,37 2,38 1,39 1,40 1.911,41 129.044,42 89.828,43 129.044,44 72.962,46 11.982,47 41.159,48 5.489,49 4.938,50 0.159,51 3.489,52 1.868,53 1.852,54 0.574,55 0.218,56 1.115,57 0.167,58 116.304,59 140.079,60 159.73,61 167.24,62 169.24,63 39.514,64 0.7,65 -0.086,66 2.028,67 6.959,68 4.141,69 0.666,70 7.976,71 2.476,73 3.697,74 3.78,75 3.243,76 3.236,77 3.549,78 4.3,79 3.652,80 3.62,81 3.599,82 4.356,83 3.502,84 4.404,85 3.265,86 3.934,87 4.136,88 3.162,89 3.083,90 7.048,91 10.68,92 153.891,94 3.844,95 192.75,96 37,97 38,98 2.732,99 37.378,100 2.951,101 2.987,102 2.804,103 2.779,104 2.776,105 0.195,106 0.28,107 0.176,108 0.132,109 0.179,110 1.423,111 0.908,112 0.873,113 1.129,114 1.107,115 0.262,116 6.26,117 6.042,118 5.089,119 0.416,120 14.026,121 3.824,122 2.066,123 1.424,124 212,125 4.368,126 2.521,127 1.61,128 2.058,129 4.131,130 1.461,131 1.381,132 0.786,133 0.3,134 0.183,135 16.367,136 0.673,137 3.829,138 2,139 16,140 7.2,141 176.567,142 266.395,143 176.567,144 176.567,145 176.567,146 176.567,147 21.991,148 176.567,149 395.438,150 0.603,151 1.61,152 4.131,153 2.058,154 1.935,155 2.925,156 2.84,157 0.415,158 1.192,159 1.539,160 0.533,161 1.181,162 1.113,163 0.791,164 0.984,165 1.018,166 10.368,167 75,168 0.251,169 176.567,170 0.266,171 1.576,172 1.502,173 0.71,174 0.131,176 4.577}
{0 CHEMBL2158996,1 12.32,2 4.291,3 4.404,4 4.662,5 4.481,6 4.652,7 4.645,8 4.175,9 13.643,10 6.363,11 7.231,12 19.259,13 7.736,14 8.981,15 18.911,16 7.716,17 9.267,18 18.11,19 7.839,20 9.791,21 19.755,22 9.29,23 2,24 13.538,25 0.564,26 1.933,27 3.627,28 0.02,29 1.044,30 17,31 3.571,32 3.083,33 3.751,34 0.173,35 0.387,36 7.135,37 4,38 2,39 2,40 2.3,41 152.092,42 114.973,43 152.092,44 99.017,45 9.185,46 22.82,47 47.784,48 5.627,49 6.351,50 0.14,51 3.627,52 1.875,53 1.856,54 0.715,55 0.218,56 1.186,57 0.207,58 141.224,59 183.82,60 209.065,61 216.574,62 219.329,63 51.985,64 0.617,65 0.021,66 2.038,67 7.626,68 4.667,69 0.768,70 8.1,71 2.6,72 -0.068,73 3.841,74 3.921,75 3.395,76 3.39,77 3.687,78 4.51,79 3.767,80 3.731,81 3.74,82 4.461,83 3.746,84 4.677,85 3.573,86 4.248,87 4.46,88 3.458,89 3.36,90 8.526,91 13.532,92 189.374,93 0.922,94 4.781,95 233.329,96 43,97 44,98 2.228,99 43.589,100 2.996,101 3.017,102 2.929,103 2.843,104 2.855,105 0.167,106 0.248,107 0.153,108 0.115,109 0.152,110 1.505,111 0.937,112 0.912,113 1.174,114 1.111,115 0.237,116 7.487,117 7.325,118 6.114,119 0.383,120 17.17,121 4.026,122 2.142,123 1.151,124 308,125 4.603,126 2.989,127 2.005,128 2.604,129 5.027,130 1.954,131 1.33,132 0.74,133 0.293,134 0.191,135 26.784,136 0.677,137 3.951,138 2,139 18,140 7.533,141 200.109,142 315.082,143 200.109,144 200.109,145 200.109,146 200.109,147 32.086,148 200.109,149 467.173,150 0.605,151 2.005,152 5.027,153 2.604,154 1.912,155 2.985,156 2.925,157 0.382,158 1.461,159 1.667,160 0.595,161 1.218,162 1.181,163 0.886,164 1.062,165 1.107,166 10.54,167 107,168 0.243,169 200.109,170 0.258,171 1.625,172 1.537,173 1.126,174 -0.098,176 4.772}
{0 CHEMBL2158997,1 11.609,2 4.326,3 4.505,4 4.717,5 4.596,6 4.842,7 4.682,8 4.208,9 16.185,10 6.338,11 8.129,12 20.583,13 8.3,14 10.354,15 23.767,16 8.822,17 11.396,18 20.443,19 7.262,20 9.429,21 15.792,22 8.06,23 2,24 11.437,25 0.797,26 2.147,27 3.49,28 0.023,29 0.946,30 20,31 3.488,32 2.968,33 3.691,34 0.188,35 0.423,36 6.901,37 2,38 1,39 1,40 2.411,41 144.122,42 36.145,43 144.122,44 30.278,45 9.822,46 12.087,47 48.409,48 5.49,49 4.838,50 0.145,51 3.49,52 1.873,53 1.851,54 0.699,55 0.469,56 1.308,57 0.218,58 136.891,59 177.065,60 199.065,61 203.82,62 203.82,63 45.684,64 0.606,65 0.06,66 2.035,67 8.637,68 5.278,69 0.965,70 7.928,71 2.428,72 1.416,73 3.823,74 3.936,75 3.373,76 3.344,77 3.691,78 4.53,79 3.794,80 3.721,81 3.694,82 4.437,83 3.549,84 4.454,85 3.521,86 4.301,87 4.536,88 3.461,89 3.333,90 7.81,91 11.477,92 175.262,94 4.713,95 233.329,96 43,97 44,98 1.31,99 43.105,100 2.955,101 3.009,102 2.855,103 2.809,104 2.808,105 0.177,106 0.252,107 0.161,108 0.119,109 0.16,110 1.538,111 0.934,112 0.885,113 1.239,114 1.107,115 0.234,116 7.293,117 7.043,118 5.92,119 0.38,120 14.527,121 3.934,122 2.243,123 1.308,124 267,125 4.308,126 2.631,127 1.648,128 2.21,129 4.17,130 1.613,131 1.272,132 0.674,133 0.276,134 0.205,135 24.465,136 0.662,137 3.85,138 4,139 20,140 8.26,141 235.422,142 271.567,143 235.422,144 235.422,145 250.382,146 235.422,147 32.567,148 235.422,149 433.774,150 0.587,151 1.648,152 4.17,153 2.21,154 1.882,155 2.987,156 2.954,157 0.361,158 1.434,159 1.593,160 0.615,161 1.417,162 1.181,163 0.886,164 1.068,165 1.097,166 5.576,167 94,168 0.262,169 250.382,170 0.275,171 1.605,172 1.545,173 0.557,174 0.102,176 4.742}
{0 CHEMBL2158998,1 15.276,2 4.548,3 4.712,4 4.946,5 4.801,6 5.035,7 4.91,8 5.214,9 19.976,10 8.013,11 10.36,12 25.973,13 10.42,14 13.277,15 28.219,16 11.081,17 14.669,18 24.821,19 9.778,20 12.976,21 21.577,22 12.007,23 2,24 18.914,25 1.181,26 2.649,27 3.489,28 0.02,29 1.026,30 25,31 3.872,32 3.375,33 4.072,34 0.177,35 0.365,36 8.779,37 2,38 1,39 1,40 3.062,41 192.869,42 47.145,43 192.869,44 30.278,45 9.822,46 12.382,47 60.109,48 5.489,49 4.833,50 0.113,51 3.489,52 1.893,53 1.874,54 1.026,55 0.605,56 1.485,57 0.469,58 160.081,59 208.884,60 246.989,61 265.254,62 265.254,63 53.049,64 0.413,65 0.076,66 2.046,67 11.058,68 6.66,69 1.089,70 7.672,71 2.172,72 1.461,73 4.055,74 4.161,75 3.629,76 3.595,77 3.953,78 4.765,79 4.051,80 3.969,81 3.977,82 4.68,83 3.912,84 4.792,85 3.869,86 4.547,87 4.786,88 3.765,89 3.615,90 11.84,91 16.319,92 345.144,93 0.8,94 5.749,95 310.764,96 54,97 56,98 3.874,99 53.687,100 3.211,101 3.285,102 3.052,103 2.983,104 2.986,105 0.136,106 0.195,107 0.124,108 0.091,109 0.123,110 1.811,111 1.195,112 1.114,113 1.453,114 1.308,115 0.165,116 9.414,117 9.107,118 7.652,119 0.274,120 20.84,121 4.388,122 2.79,123 1.887,124 443,125 4.954,126 3.112,127 2.193,128 2.79,129 5.866,130 2.018,131 1.362,132 0.759,133 0.288,134 0.198,135 40.426,136 0.676,137 4.205,138 4,139 25,140 10.2,141 294.278,142 341.422,143 294.278,144 294.278,145 294.278,146 294.278,147 33.933,148 294.278,149 537.416,150 0.515,151 2.193,152 5.866,153 2.79,154 1.917,155 3.027,156 3.009,157 0.277,158 1.615,159 1.875,160 0.698,161 1.54,162 1.417,163 0.934,164 1.147,165 1.127,166 11.427,167 153,168 0.225,169 294.278,170 0.238,171 1.874,172 1.592,173 0.734,174 0.123,176 5.046}
{0 CHEMBL2158999,1 13.04,2 4.499,3 4.71,4 4.862,5 4.823,6 5.085,7 4.982,8 4.804,9 20.632,10 7.034,11 10.154,12 24.256,13 9.559,14 13.143,15 28.696,16 10.988,17 15.521,18 25.898,19 9.581,20 13.532,21 20.089,22 10.715,23 2,24 20.56,25 1.157,26 2.285,27 3.489,28 0.025,29 0.949,30 26,31 3.658,32 3.113,33 3.857,34 0.212,35 0.452,36 7.631,37 2,38 1,39 1,40 2.818,41 154.551,42 36.145,43 154.551,44 30.278,45 9.822,46 12.265,47 57.398,48 5.489,49 4.767,50 0.134,51 3.489,52 1.884,53 1.862,54 0.814,55 0.577,56 1.473,57 0.469,58 156.074,59 200.274,60 230.274,61 234.274,62 234.274,63 52.209,64 0.563,65 0.077,66 2.052,67 11.546,68 6.674,69 1.07,70 7.653,71 2.153,72 1.485,73 3.978,74 4.107,75 3.497,76 3.451,77 3.828,78 4.672,79 3.987,80 3.881,81 3.956,82 4.709,83 3.806,84 4.72,85 3.672,86 4.468,87 4.722,88 3.645,89 3.479,90 9.575,91 16.366,92 195.567,93 0.8,94 5.248,95 289.294,96 51,97 52,98 3.568,99 50.461,100 3.197,101 3.276,102 3.002,103 2.969,104 2.962,105 0.162,106 0.232,107 0.148,108 0.109,109 0.146,110 1.54,111 1.19,112 1.105,113 1.44,114 1.308,115 0.221,116 8.204,117 7.806,118 6.638,119 0.364,120 17.068,121 4.283,122 2.612,123 1.745,124 326,125 4.65,126 3.108,127 2.189,128 2.226,129 5.157,130 2.006,131 1.25,132 0.64,133 0.268,134 0.21,135 29.507,136 0.648,137 4.007,138 6,139 26,140 10.317,141 306.049,142 342.193,143 306.049,144 306.049,145 306.049,146 306.049,147 26.203,148 306.049,149 502.993,150 0.54,151 2.189,152 5.157,153 2.226,154 1.864,155 3.009,156 3.009,157 0.331,158 1.504,159 1.73,160 0.698,161 1.526,162 1.417,163 0.934,164 1.239,165 1.308,166 5.636,167 113,168 0.235,169 306.049,170 0.245,171 1.747,172 1.575,173 0.773,174 0.348,176 5.114}
{0 CHEMBL358518,1 9.381,2 4.135,3 4.265,4 4.467,5 4.44,6 4.615,7 4.615,8 3.639,9 12.059,10 5.634,11 6.68,12 15.058,13 6.752,14 7.851,15 18.202,16 7.463,17 9.219,18 18.923,19 7.147,20 8.838,21 17.114,22 8.465,24 12.642,25 0.581,26 1.315,27 3.491,28 0.028,29 1.009,30 11,31 3.189,32 2.629,33 3.325,34 0.227,35 0.519,36 5.512,37 2,38 1,39 1,40 1.954,41 115.452,42 121.512,43 115.452,44 115.645,45 8.825,46 12.049,47 41.159,48 5.491,49 6.468,50 0.159,51 3.491,52 1.879,53 1.862,54 0.596,55 0.218,56 1.13,57 0.116,58 124.975,59 155.73,60 171.24,61 173.24,62 175.24,63 39.357,64 0.772,65 -0.161,66 2.039,67 7.024,68 4.131,69 0.672,70 8.079,71 2.579,73 3.697,74 3.781,75 3.256,76 3.244,77 3.584,78 4.337,79 3.703,80 3.668,81 3.664,82 4.413,83 3.557,84 4.516,85 3.319,86 3.968,87 4.114,88 3.253,89 3.187,90 7.369,91 12.343,92 150.321,94 3.904,95 192.75,96 37,97 38,98 2.767,99 37.378,100 2.986,101 3.014,102 2.828,103 2.803,104 2.801,105 0.201,106 0.294,107 0.183,108 0.138,109 0.187,110 1.412,111 0.924,112 0.898,113 1.157,114 1.107,115 0.281,116 6.314,117 6.079,118 5.111,119 0.439,120 16.149,121 3.824,122 1.832,123 1.001,124 197,125 5.007,126 2.928,127 1.975,128 2.545,129 5.67,130 1.873,131 1.369,132 0.786,133 0.291,134 0.186,135 14.449,136 0.673,137 3.892,138 2,139 16,140 7.15,141 164.795,142 286.307,143 164.795,144 164.795,145 164.795,146 164.795,147 19.934,148 164.795,149 401.759,150 0.648,151 1.975,152 5.67,153 2.545,154 1.962,155 2.925,156 2.747,157 0.456,158 1.253,159 1.562,160 0.528,161 1.181,162 1.083,163 0.653,164 0.934,165 0.918,166 5.205,167 70,168 0.251,169 164.795,170 0.266,171 1.59,172 1.483,173 0.699,174 0.075,176 4.873}
{0 CHEMBL422481,1 9.429,2 4.148,3 4.279,4 4.43,5 4.37,6 4.535,7 4.573,8 3.635,9 12.683,10 5.528,11 6.362,12 14.636,13 6.444,14 7.473,15 16.792,16 6.906,17 8.261,18 17.695,19 7.018,20 9.246,21 15.794,22 7.896,24 10.882,25 0.852,26 1.361,27 3.49,28 0.021,29 1.007,30 15,31 3.225,32 2.661,33 3.349,34 0.205,35 0.465,36 5.615,37 2,38 1,39 1,40 1.911,41 129.044,42 89.828,43 129.044,44 72.962,46 12.043,47 41.159,48 5.49,49 4.926,50 0.159,51 3.49,52 1.868,53 1.852,54 0.582,55 0.218,56 1.141,57 0.174,58 116.304,59 141.589,60 161.24,61 169.24,62 175.24,63 39.334,64 0.749,65 0.053,66 2.025,67 6.959,68 4.141,69 0.666,70 7.976,71 2.476,73 3.697,74 3.78,75 3.243,76 3.236,77 3.549,78 4.298,79 3.653,80 3.623,81 3.615,82 4.353,83 3.532,84 4.442,85 3.297,86 4.069,87 4.243,88 3.285,89 3.214,90 5.869,91 12.074,92 150.638,94 3.843,95 192.75,96 37,97 38,98 2.734,99 37.378,100 2.998,101 3.024,102 2.865,103 2.843,104 2.839,105 0.195,106 0.281,107 0.177,108 0.133,109 0.18,110 1.415,111 0.947,112 0.922,113 1.156,114 1.107,115 0.274,116 6.26,117 6.042,118 5.086,119 0.43,120 13.707,121 3.824,122 2.066,123 1.383,124 198,125 4.437,126 2.648,127 1.679,128 2.277,129 4.413,130 1.619,131 1.381,132 0.786,133 0.3,134 0.183,135 15.483,136 0.673,137 3.892,138 2,139 16,140 7.2,141 176.567,142 266.395,143 176.567,144 176.567,145 176.567,146 176.567,147 21.991,148 176.567,149 395.438,150 0.603,151 1.679,152 4.413,153 2.277,154 1.935,155 2.925,156 2.805,157 0.417,158 1.233,159 1.561,160 0.546,161 1.181,162 1.128,163 0.748,164 0.959,165 0.984,166 10.404,167 71,168 0.251,169 176.567,170 0.266,171 1.585,172 1.519,173 0.637,174 0.131,176 4.824}
{0 CHEMBL434066,1 10,2 4.148,3 4.279,4 4.43,5 4.372,6 4.535,7 4.575,8 3.635,9 12.683,10 5.528,11 6.362,12 14.636,13 6.444,14 7.473,15 16.837,16 6.914,17 8.353,18 17.693,19 6.996,20 9.179,21 16.206,22 7.267,24 12.045,25 0.838,26 1.333,27 3.49,28 0.021,29 1.004,30 15,31 3.301,32 2.697,33 3.408,34 0.205,35 0.465,36 5.756,37 2,38 1,39 1,40 1.911,41 129.044,42 89.828,43 129.044,44 72.962,46 12.018,47 41.159,48 5.49,49 4.929,50 0.159,51 3.49,52 1.868,53 1.852,54 0.578,55 0.218,56 1.116,57 0.165,58 116.304,59 142.079,60 161.73,61 169.24,62 175.24,63 39.432,64 0.725,65 0.074,66 2.026,67 6.959,68 4.141,69 0.666,70 7.976,71 2.476,73 3.697,74 3.78,75 3.243,76 3.236,77 3.549,78 4.298,79 3.653,80 3.623,81 3.614,82 4.351,83 3.516,84 4.434,85 3.306,86 4.104,87 4.324,88 3.243,89 3.15,90 6.305,91 12.074,92 152.397,94 3.843,95 192.75,96 37,97 38,98 2.743,99 37.378,100 2.96,101 2.993,102 2.813,103 2.784,104 2.781,105 0.195,106 0.281,107 0.177,108 0.133,109 0.179,110 1.418,111 0.911,112 0.878,113 1.134,114 1.107,115 0.268,116 6.26,117 6.042,118 5.086,119 0.424,120 12.451,121 3.824,122 2.066,123 1.369,124 210,125 4.424,126 2.608,127 1.658,128 2.202,129 4.341,130 1.565,131 1.381,132 0.786,133 0.3,134 0.183,135 16.054,136 0.673,137 3.871,138 2,139 16,140 7.2,141 176.567,142 266.395,143 176.567,144 176.567,145 176.567,146 176.567,147 21.991,148 176.567,149 395.438,150 0.603,151 1.658,152 4.341,153 2.202,154 1.935,155 2.925,156 2.849,157 0.417,158 1.217,159 1.552,160 0.539,161 1.181,162 1.104,163 0.804,164 0.991,165 1.03,166 10.389,167 73,168 0.251,169 176.567,170 0.266,171 1.58,172 1.51,173 1.027,174 0.131,176 4.536}
{0 CHEMBL490,1 10.125,2 4.486,3 4.63,4 4.945,5 4.784,6 5.014,7 4.977,8 4.479,9 18.468,10 7.506,11 9.094,12 25.541,13 10.028,14 12.855,15 27.957,16 10.338,17 13.743,18 26.417,19 10.041,20 13.995,21 25.509,22 12.193,23 3,24 32.768,25 0.5,26 1.479,27 3.324,28 0.019,29 0.806,30 13,31 3.331,32 2.757,33 3.47,34 0.148,35 0.347,36 6.044,40 2.668,41 112.359,42 33,43 112.359,45 35.999,47 49.618,48 5.324,49 4.669,50 0.123,51 3.324,52 1.839,53 1.827,54 0.905,55 0.559,56 1.326,57 0.377,58 146.383,59 196.564,60 218.215,61 222.215,62 222.215,63 33.917,64 0.513,65 0.091,66 2.106,67 9.078,68 5.339,69 1.086,70 7.729,71 2.229,72 3.766,73 3.907,74 4.005,75 3.426,76 3.423,77 3.832,78 4.738,79 3.963,80 3.883,81 3.923,82 4.725,83 3.859,84 4.921,85 3.669,86 4.436,87 4.659,88 3.547,89 3.475,90 10.263,91 24.795,92 205.02,93 0.532,94 6.029,95 240.215,96 44,97 47,98 3.246,99 44.432,100 3.081,101 3.164,102 2.965,103 2.875,104 2.884,105 0.159,106 0.241,107 0.149,108 0.112,109 0.145,110 1.664,111 1.042,112 0.962,113 1.307,114 1.124,115 0.188,116 8.131,117 8.016,118 6.567,119 0.296,120 22.742,121 3.907,122 2.133,123 0.992,124 243,125 4.923,126 2.926,127 1.967,128 2.341,129 5.631,130 1.87,131 1.219,132 0.563,133 0.24,134 0.251,135 18.667,136 0.657,137 4.357,138 7,139 20,140 7.643,141 223.651,142 256.651,143 200.109,144 223.651,145 238.611,146 223.651,147 46.025,148 223.651,149 401.981,150 0.609,151 1.967,152 5.631,153 2.341,154 1.814,155 2.951,156 2.925,157 0.377,158 1.285,159 1.54,160 0.579,161 1.345,162 1.181,163 0.859,164 1.062,165 1.107,166 16.693,167 86,168 0.271,169 203.298,170 0.284,171 1.586,172 1.438,173 0.864,174 -0.009,175 1,176 5.155}
{0 CHEMBL772,1 14.818,2 5.15,3 5.309,4 5.544,5 5.63,6 5.814,7 5.955,8 8.395,9 38.798,10 13.685,11 17.586,12 47.552,13 18.381,14 23.982,15 63.286,16 22.4,17 29.953,18 75.006,19 24.179,20 32.903,21 71.831,22 32.7,23 2,24 43.02,25 1.064,26 2.599,27 3.877,28 0.025,29 1.067,30 30,31 3.8,32 3.389,33 3.989,34 0.184,35 0.452,36 8.441,37 2,38 2,39 2,40 4.808,41 173.696,42 127.289,43 173.696,44 75.672,45 31.725,46 26.965,47 94.77,48 5.877,49 5,50 0.079,51 3.877,52 1.928,53 1.908,54 1.073,55 0.904,56 1.614,57 0.672,58 291.742,59 404.677,60 447.596,61 464.425,62 482.425,63 65.953,64 0.402,65 -0.046,66 2.142,67 18.469,68 10.434,69 1.879,70 7.746,71 2.246,72 3.93,73 4.542,74 4.639,75 3.998,76 4.002,77 4.431,78 5.387,79 4.685,80 4.65,81 4.803,82 5.747,83 4.818,84 5.93,85 4.736,86 5.596,87 5.814,88 4.661,89 4.598,90 32.262,91 38.115,92 462.357,93 0.916,94 11.516,95 536.955,96 84,97 89,98 4.647,99 84.938,100 3.438,101 3.467,102 3.348,103 3.225,104 3.25,105 0.096,106 0.143,107 0.089,108 0.069,109 0.094,110 1.873,111 1.365,112 1.328,113 1.612,114 1.565,115 0.145,116 14.536,117 14.077,118 11.609,119 0.226,120 72.044,121 4.879,122 2.919,123 1.575,124 652,125 6.034,126 3.602,127 2.641,128 3.264,129 8.58,130 2.512,131 1.108,132 0.432,133 0.223,134 0.262,135 55.657,136 0.638,137 5.541,138 17,139 40,140 16.867,141 459.073,142 586.362,143 459.073,144 459.073,145 459.073,146 459.073,147 61.016,148 459.073,149 779.968,150 0.543,151 2.641,152 8.58,153 3.264,154 1.803,155 3.385,156 3.362,157 0.245,158 1.731,159 1.903,160 0.958,161 1.628,162 1.59,163 1.231,164 1.554,165 1.559,166 39.113,167 224,168 0.228,169 376.675,170 0.237,171 1.884,172 1.639,173 1.004,174 0.191,175 3,176 5.121}
