"molecule_id","AMW","C.","H.","Me","Mi","Mp","Mv","MW","N.","nAB","nAT","nB","nBM","nBO","nBR","nBT","nC","nCL","nCsp","nCsp2","nCsp3","nDB","nF","nH","nHet","nHM","nI","nN","nO","nP","nS","nSK","nTB","nX","O.","RBF","RBN","SCBO","Se","Si","Sp","Sv","X.","pXC50"
{1 5.607,2 35.4,3 59.8,4 0.979,5 1.135,6 0.605,7 0.546,8 459.79,9 1.2,11 82,13 1,14 37,16 86,17 29,20 1,21 28,22 1,24 49,25 4,28 1,29 3,32 33,35 3.7,36 0.035,37 3,38 38,39 80.29,40 93.091,41 49.643,42 44.809,44 4.268}
{0 CHEMBL142198,1 5.752,2 36,3 59.6,4 0.972,5 1.128,6 0.638,7 0.562,8 511.95,9 1.1,10 6,11 89,13 6,14 40,16 93,17 32,20 5,21 27,24 53,25 4,26 1,28 1,29 2,32 36,35 2.2,36 0.054,37 5,38 43,39 86.508,40 100.436,41 56.768,42 50.033,44 4}
{0 CHEMBL142964,1 5.453,2 33.7,3 62.1,4 0.97,5 1.133,6 0.622,7 0.543,8 518.01,9 1.1,11 95,14 40,16 99,17 32,21 32,24 59,25 4,26 1,28 1,29 2,32 36,35 2.1,36 0.051,37 5,38 40,39 92.159,40 107.682,41 59.052,42 51.613,44 5.097}
{0 CHEMBL143021,1 5.607,2 35.4,3 59.8,4 0.979,5 1.135,6 0.605,7 0.546,8 459.79,9 1.2,11 82,13 1,14 37,16 86,17 29,20 1,21 28,22 1,24 49,25 4,28 1,29 3,32 33,35 3.7,36 0.035,37 3,38 38,39 80.29,40 93.091,41 49.643,42 44.809,44 4.89}
{0 CHEMBL143478,1 5.848,2 38.2,3 57.4,4 0.979,5 1.129,6 0.623,7 0.566,8 397.66,9 1.5,10 6,11 68,13 6,14 33,16 72,17 26,20 5,21 21,24 39,25 3,28 1,29 2,32 29,35 2.9,36 0.028,37 2,38 36,39 66.545,40 76.806,41 42.381,42 38.46,44 4.414}
{0 CHEMBL145672,1 6.19,2 36,3 58.1,4 0.976,5 1.128,6 0.65,7 0.574,8 532.36,9 1.2,10 6,11 86,13 6,14 40,16 90,17 31,18 1,20 5,21 26,24 50,25 5,26 2,28 1,29 2,32 36,34 1,35 2.3,36 0.056,37 5,38 43,39 83.948,40 96.965,41 55.864,42 49.333,43 1.2,44 4}
{0 CHEMBL2069129,1 5.453,2 33.7,3 62.1,4 0.97,5 1.133,6 0.622,7 0.543,8 518.01,9 1.1,11 95,14 40,16 99,17 32,21 32,24 59,25 4,26 1,28 1,29 2,32 36,35 2.1,36 0.051,37 5,38 40,39 92.159,40 107.682,41 59.052,42 51.613,44 4.914}
{0 CHEMBL2069130,1 5.456,2 35.1,3 60.8,4 0.976,5 1.136,6 0.604,7 0.541,8 403.72,9 1.4,11 74,14 33,16 78,17 26,21 26,24 45,25 3,28 1,29 2,32 29,35 2.7,36 0.026,37 2,38 33,39 72.196,40 84.052,41 44.665,42 40.041,44 7.553}
{0 CHEMBL213606,1 5.894,2 35.9,3 57.7,4 0.985,5 1.134,6 0.61,7 0.557,8 459.74,9 1.3,11 78,13 3,14 36,16 81,17 28,20 4,21 24,22 3,24 45,25 5,28 1,29 4,32 33,35 5.1,36 0.111,37 9,38 39,39 76.85,40 88.47,41 47.574,42 43.47,44 4}
{0 CHEMBL214526,1 5.943,2 36,3 57.3,4 0.986,5 1.134,6 0.611,7 0.559,8 445.71,9 1.3,11 75,13 3,14 35,16 78,17 27,20 4,21 23,22 3,24 43,25 5,28 1,29 4,32 32,35 5.3,36 0.103,37 8,38 38,39 73.967,40 85.055,41 45.813,42 41.943,44 4}
{0 CHEMBL215774,1 5.574,2 35.3,3 60,4 0.979,5 1.135,6 0.605,7 0.545,8 473.82,9 1.2,11 85,13 2,14 37,16 88,17 30,20 3,21 27,22 2,24 51,25 4,28 1,29 3,32 34,35 3.5,36 0.125,37 11,38 39,39 83.174,40 96.507,41 51.404,42 46.336,44 4}
{0 CHEMBL216562,1 5.894,2 35.9,3 57.7,4 0.985,5 1.134,6 0.61,7 0.557,8 459.74,9 1.3,11 78,13 3,14 36,16 81,17 28,20 4,21 24,22 3,24 45,25 5,28 1,29 4,32 33,35 5.1,36 0.111,37 9,38 39,39 76.85,40 88.47,41 47.574,42 43.47,44 4}
{0 CHEMBL216713,1 6.115,2 36.4,3 56.1,4 0.99,5 1.133,6 0.614,7 0.566,8 403.62,9 1.5,11 66,13 3,14 32,16 69,17 24,20 4,21 20,22 3,24 37,25 5,28 1,29 4,32 29,35 6.1,36 0.058,37 4,38 35,39 65.316,40 74.81,41 40.529,42 37.363,44 4}
{0 CHEMBL217006,1 6.053,2 36.2,3 56.5,4 0.988,5 1.134,6 0.613,7 0.564,8 417.65,9 1.4,11 69,13 3,14 33,16 72,17 25,20 4,21 21,22 3,24 39,25 5,28 1,29 4,32 30,35 5.8,36 0.069,37 5,38 36,39 68.199,40 78.225,41 42.29,42 38.89,44 4}
{0 CHEMBL217116,1 6.501,2 39.5,3 52.6,4 0.992,5 1.127,6 0.634,7 0.591,8 741.07,9 1.8,10 12,11 114,13 17,14 59,16 119,17 45,20 18,21 27,22 5,24 60,25 9,28 2,29 7,32 54,35 6.1,36 0.143,37 17,38 70,39 113.119,40 128.503,41 72.274,42 67.324,44 4}
{0 CHEMBL217129,1 5.816,2 35.8,3 58.2,4 0.983,5 1.135,6 0.609,7 0.555,8 389.64,9 1.5,11 67,13 2,14 31,16 70,17 24,20 3,21 21,22 2,24 39,25 4,28 1,29 3,32 28,35 4.5,36 0.071,37 5,38 33,39 65.872,40 76.015,41 40.836,42 37.175,44 4}
{0 CHEMBL217279,1 5.849,2 35.8,3 58,4 0.984,5 1.134,6 0.609,7 0.556,8 473.77,9 1.2,11 81,13 3,14 37,16 84,17 29,20 4,21 25,22 3,24 47,25 5,28 1,29 4,32 34,35 4.9,36 0.119,37 10,38 40,39 79.734,40 91.886,41 49.336,42 44.997,44 4}
{0 CHEMBL217321,1 5.732,2 35.6,3 58.9,4 0.982,5 1.135,6 0.607,7 0.551,8 515.86,9 1.1,11 90,13 3,14 40,16 93,17 32,20 4,21 28,22 3,24 53,25 5,28 1,29 4,32 37,35 4.4,36 0.14,37 13,38 43,39 88.385,40 102.131,41 54.62,42 49.577,44 4}
{0 CHEMBL217513,1 5.849,2 35.8,3 58,4 0.984,5 1.134,6 0.609,7 0.556,8 473.77,9 1.2,11 81,13 3,14 37,16 84,17 29,20 4,21 25,22 3,24 47,25 5,28 1,29 4,32 34,35 4.9,36 0.107,37 9,38 40,39 79.734,40 91.886,41 49.336,42 44.997,44 4}
{0 CHEMBL217523,1 5.889,2 34.9,3 57.8,4 0.986,5 1.137,6 0.607,7 0.554,8 488.79,9 2.4,11 83,13 3,14 38,16 86,17 29,20 4,21 25,22 3,24 48,25 6,28 2,29 4,32 35,35 4.8,36 0.105,37 9,38 41,39 81.836,40 94.384,41 50.342,42 46.018,44 4}
{0 CHEMBL217527,1 5.943,2 36,3 57.3,4 0.986,5 1.134,6 0.611,7 0.559,8 445.71,9 1.3,11 75,13 3,14 35,16 78,17 27,20 4,21 23,22 3,24 43,25 5,28 1,29 4,32 32,35 5.3,36 0.09,37 7,38 38,39 73.967,40 85.055,41 45.813,42 41.943,44 4}
{0 CHEMBL217534,1 5.722,2 35.6,3 58.9,4 0.981,5 1.135,6 0.608,7 0.551,8 417.7,9 1.4,11 73,13 2,14 33,16 76,17 26,20 3,21 23,22 2,24 43,25 4,28 1,29 3,32 30,35 4.1,36 0.092,37 7,38 35,39 71.639,40 82.846,41 44.359,42 40.229,44 5.398}
{0 CHEMBL217554,1 6.096,2 34.8,3 56.5,4 0.992,5 1.137,6 0.606,7 0.56,8 560.86,9 2.2,11 92,13 4,14 43,16 95,17 32,20 5,21 27,22 4,24 52,25 8,28 2,29 6,32 40,35 6.5,36 0.116,37 11,38 47,39 91.257,40 104.633,41 55.773,42 51.502,44 4}
{0 CHEMBL217576,1 5.807,2 35.7,3 58.3,4 0.984,5 1.135,6 0.608,7 0.554,8 487.8,9 1.2,11 84,13 3,14 38,16 87,17 30,20 4,21 26,22 3,24 49,25 5,28 1,29 4,32 35,35 4.8,36 0.115,37 10,38 41,39 82.617,40 95.301,41 51.097,42 46.524,44 4}
{0 CHEMBL218237,1 5.698,2 35.5,3 59.1,4 0.981,5 1.135,6 0.606,7 0.55,8 529.89,9 1.1,11 93,13 3,14 41,16 96,17 33,20 4,21 29,22 3,24 55,25 5,28 1,29 4,32 38,35 4.3,36 0.146,37 14,38 44,39 91.268,40 105.546,41 56.381,42 51.104,44 4}
{0 CHEMBL218239,1 5.807,2 35.7,3 58.3,4 0.984,5 1.135,6 0.608,7 0.554,8 487.8,9 1.2,11 84,13 3,14 38,16 87,17 30,20 4,21 26,22 3,24 49,25 5,28 1,29 4,32 35,35 4.8,36 0.126,37 11,38 41,39 82.617,40 95.301,41 51.097,42 46.524,44 4}
{0 CHEMBL218731,1 5.681,2 35.5,3 59.2,4 0.981,5 1.135,6 0.607,7 0.549,8 431.73,9 1.3,11 76,13 2,14 34,16 79,17 27,20 3,21 24,22 2,24 45,25 4,28 1,29 3,32 31,35 3.9,36 0.101,37 8,38 36,39 74.523,40 86.261,41 46.12,42 41.755,44 4.311}
{0 CHEMBL262278,1 5.643,2 35.4,3 59.5,4 0.98,5 1.135,6 0.606,7 0.548,8 445.76,9 1.3,11 79,13 2,14 35,16 82,17 28,20 3,21 25,22 2,24 47,25 4,28 1,29 3,32 32,35 3.8,36 0.11,37 9,38 37,39 77.407,40 89.676,41 47.881,42 43.282,44 4}
{0 CHEMBL265536,1 6.396,2 37.6,3 53.8,4 0.993,5 1.131,6 0.624,7 0.58,8 594.87,9 2.2,10 6,11 93,13 10,14 47,16 97,17 35,20 11,21 24,22 4,24 50,25 8,28 2,29 6,32 43,35 6.5,36 0.113,37 11,38 54,39 92.374,40 105.218,41 58.012,42 53.975,44 4}
{0 CHEMBL279572,1 6.317,2 35.2,3 54.9,4 0.997,5 1.137,6 0.61,7 0.568,8 574.84,9 2.2,11 91,13 5,14 44,16 94,17 32,20 6,21 26,22 5,24 50,25 9,28 2,29 7,32 41,35 7.7,36 0.106,37 10,38 49,39 90.701,40 103.427,41 55.466,42 51.69,44 4}
{0 CHEMBL343194,1 5.752,2 36,3 59.6,4 0.972,5 1.128,6 0.638,7 0.562,8 511.95,9 1.1,10 6,11 89,13 6,14 40,16 93,17 32,20 5,21 27,24 53,25 4,26 1,28 1,29 2,32 36,35 2.2,36 0.054,37 5,38 43,39 86.508,40 100.436,41 56.768,42 50.033,44 4}
{0 CHEMBL343703,1 5.456,2 35.1,3 60.8,4 0.976,5 1.136,6 0.604,7 0.541,8 403.72,9 1.4,11 74,14 33,16 78,17 26,21 26,24 45,25 3,28 1,29 2,32 29,35 2.7,36 0.026,37 2,38 33,39 72.196,40 84.052,41 44.665,42 40.041,44 7}
{0 CHEMBL344079,1 5.574,2 34,3 61.2,4 0.973,5 1.133,6 0.622,7 0.547,8 574.08,9 1,11 103,13 1,14 44,16 107,17 35,20 1,21 34,22 1,24 63,25 5,26 1,28 1,29 3,32 40,35 2.9,36 0.056,37 6,38 45,39 100.254,40 116.722,41 64.029,42 56.381,44 4}
{0 CHEMBL359216,1 6.354,2 38.2,3 55.9,4 0.983,5 1.129,6 0.636,7 0.578,8 432.1,9 1.5,10 6,11 68,13 6,14 34,16 72,17 26,18 1,20 5,21 21,24 38,25 4,26 1,28 1,29 2,32 30,34 1,35 2.9,36 0.028,37 2,38 37,39 66.869,40 76.75,41 43.239,42 39.288,43 1.5,44 4}
{0 CHEMBL359385,1 5.752,2 36,3 59.6,4 0.972,5 1.128,6 0.638,7 0.562,8 511.95,9 1.1,10 6,11 89,13 6,14 40,16 93,17 32,20 5,21 27,24 53,25 4,26 1,28 1,29 2,32 36,35 2.2,36 0.054,37 5,38 43,39 86.508,40 100.436,41 56.768,42 50.033,44 4}
{0 CHEMBL384016,1 5.894,2 35.9,3 57.7,4 0.985,5 1.134,6 0.61,7 0.557,8 459.74,9 1.3,11 78,13 3,14 36,16 81,17 28,20 4,21 24,22 3,24 45,25 5,28 1,29 4,32 33,35 5.1,36 0.099,37 8,38 39,39 76.85,40 88.47,41 47.574,42 43.47,44 4}
{0 CHEMBL384335,1 6.499,2 37.8,3 53.1,4 0.996,5 1.131,6 0.625,7 0.584,8 636.91,9 2,10 6,11 98,13 11,14 50,16 102,17 37,20 12,21 25,22 5,24 52,25 9,28 2,29 7,32 46,35 7.1,36 0.127,37 13,38 58,39 97.585,40 110.842,41 61.228,42 57.216,44 4}
{0 CHEMBL384383,1 6.343,2 37.5,3 54.2,4 0.992,5 1.132,6 0.623,7 0.578,8 608.9,9 2.1,10 6,11 96,13 10,14 48,16 100,17 36,20 11,21 25,22 4,24 52,25 8,28 2,29 6,32 44,35 6.3,36 0.12,37 12,38 55,39 95.257,40 108.633,41 59.773,42 55.502,44 4}
{0 CHEMBL385193,1 6.265,2 35.1,3 55.3,4 0.996,5 1.137,6 0.609,7 0.566,8 588.87,9 2.1,11 94,13 5,14 45,16 97,17 33,20 6,21 27,22 5,24 52,25 9,28 2,29 7,32 42,35 7.4,36 0.113,37 11,38 50,39 93.585,40 106.842,41 57.228,42 53.216,44 4}
{0 CHEMBL385318,1 6.051,2 34.7,3 56.8,4 0.991,5 1.137,6 0.606,7 0.558,8 574.89,9 2.1,11 95,13 4,14 44,16 98,17 33,20 5,21 28,22 4,24 54,25 8,28 2,29 6,32 41,35 6.3,36 0.122,37 12,38 48,39 94.141,40 108.048,41 57.535,42 53.028,44 4}
{0 CHEMBL386433,1 5.807,2 35.7,3 58.3,4 0.984,5 1.135,6 0.608,7 0.554,8 487.8,9 1.2,11 84,13 3,14 38,16 87,17 30,20 4,21 26,22 3,24 49,25 5,28 1,29 4,32 35,35 4.8,36 0.126,37 11,38 41,39 82.617,40 95.301,41 51.097,42 46.524,44 4}
{0 CHEMBL387268,1 5.768,2 35.6,3 58.6,4 0.983,5 1.135,6 0.608,7 0.552,8 501.83,9 1.1,11 87,13 3,14 39,16 90,17 31,20 4,21 27,22 3,24 51,25 5,28 1,29 4,32 36,35 4.6,36 0.133,37 12,38 42,39 85.501,40 98.716,41 52.859,42 48.051,44 4}
{0 CHEMBL387463,1 5.732,2 35.6,3 58.9,4 0.982,5 1.135,6 0.607,7 0.551,8 515.86,9 1.1,11 90,13 3,14 40,16 93,17 32,20 4,21 28,22 3,24 53,25 5,28 1,29 4,32 37,35 4.4,36 0.14,37 13,38 43,39 88.385,40 102.131,41 54.62,42 49.577,44 4}
{0 CHEMBL406817,1 6.292,2 37.4,3 54.5,4 0.991,5 1.132,6 0.622,7 0.576,8 622.93,9 2,10 6,11 99,13 10,14 49,16 103,17 37,20 11,21 26,22 4,24 54,25 8,28 2,29 6,32 45,35 6.1,36 0.136,37 14,38 56,39 98.141,40 112.048,41 61.535,42 57.028,44 4}
{0 CHEMBL422651,1 5.574,2 34,3 61.2,4 0.973,5 1.133,6 0.622,7 0.547,8 574.08,9 1,11 103,13 1,14 44,16 107,17 35,20 1,21 34,22 1,24 63,25 5,26 1,28 1,29 3,32 40,35 2.9,36 0.056,37 6,38 45,39 100.254,40 116.722,41 64.029,42 56.381,44 4}
{0 CHEMBL424916,1 5.607,2 35.4,3 59.8,4 0.979,5 1.135,6 0.605,7 0.546,8 459.79,9 1.2,11 82,13 2,14 36,16 85,17 29,20 3,21 26,22 2,24 49,25 4,28 1,29 3,32 33,35 3.7,36 0.118,37 10,38 38,39 80.29,40 93.091,41 49.643,42 44.809,44 4}
{0 CHEMBL425634,1 5.456,2 35.1,3 60.8,4 0.976,5 1.136,6 0.604,7 0.541,8 403.72,9 1.4,11 74,14 33,16 78,17 26,21 26,24 45,25 3,28 1,29 2,32 29,35 2.7,36 0.026,37 2,38 33,39 72.196,40 84.052,41 44.665,42 40.041,44 5.754}
{0 CHEMBL433876,1 5.848,2 38.2,3 57.4,4 0.979,5 1.129,6 0.623,7 0.566,8 397.66,9 1.5,10 6,11 68,13 6,14 33,16 72,17 26,20 5,21 21,24 39,25 3,28 1,29 2,32 29,35 2.9,36 0.028,37 2,38 36,39 66.545,40 76.806,41 42.381,42 38.46,44 4}
{0 CHEMBL437714,1 5.996,2 36.1,3 56.9,4 0.987,5 1.134,6 0.612,7 0.561,8 431.68,9 1.4,11 72,13 3,14 34,16 75,17 26,20 4,21 22,22 3,24 41,25 5,28 1,29 4,32 31,35 5.6,36 0.08,37 6,38 37,39 71.083,40 81.64,41 44.052,42 40.417,44 4}
