"molecule_id","AMW","C.","pXC50"
{1 8.067,2 44.2,3 4.254}
{0 CHEMBL1329141,1 9.19,2 43.6,3 4.254}
{0 CHEMBL1343544,1 9.362,2 38.6,3 4.254}
{0 CHEMBL1401747,1 10.213,2 45.7,3 4.911}
{0 CHEMBL1416439,1 10.608,2 43.2,3 4.733}
{0 CHEMBL1431007,1 10.16,2 44.2,3 6.624}
{0 CHEMBL1455226,1 9.187,2 47.1,3 4.254}
{0 CHEMBL1458563,1 9.481,2 44.4,3 4.254}
{0 CHEMBL1460470,1 9.818,2 41,3 4.254}
{0 CHEMBL1464805,1 9.264,2 46.3,3 5.144}
{0 CHEMBL1465955,1 8.24,2 46.2,3 4.254}
{0 CHEMBL1497651,1 9.116,2 42.1,3 4.254}
{0 CHEMBL1517227,1 7.636,2 43.3,3 5.108}
{0 CHEMBL1517376,1 7.815,2 47.2,3 5.671}
{0 CHEMBL1611294,1 8.3,2 43.8,3 4.552}
{0 CHEMBL1988133,1 8.499,2 43.1,3 4.254}
{0 CHEMBL1990545,1 8.684,2 46.5,3 4.254}
{0 CHEMBL257359,1 9.12,2 40.5,3 5.007}
{0 CHEMBL6246,1 10.793,2 50,3 4.254}
