"molecule_id","AMW","C.","H.","Me","Mi","Mp","Mv","MW","N.","nAB","nAT","nB","nBM","nBO","nBR","nBT","nC","nCL","nCsp","nCsp2","nCsp3","nDB","nF","nH","nHet","nHM","nI","nN","nO","nP","nS","nSK","nTB","nX","O.","RBF","RBN","SCBO","Se","Si","Sp","Sv","X.","pXC50"
{1 8.402,2 47.8,3 39.1,4 1,5 1.109,6 0.727,7 0.689,8 386.51,9 8.7,10 22,11 46,13 24,14 31,16 49,17 22,20 21,21 1,22 2,24 18,25 6,26 1,28 4,29 1,31 1,32 28,35 2.2,36 0.102,37 5,38 44,39 45.996,40 51.029,41 33.455,42 31.675,44 4.692}
{0 CHEMBL1306600,1 9.739,2 50,3 32.1,4 1.026,5 1.108,6 0.744,7 0.729,8 272.7,9 7.1,10 16,11 28,13 17,14 21,16 30,17 14,18 1,20 14,22 1,24 9,25 5,26 1,28 2,29 2,32 19,34 1,35 7.1,36 0.067,37 2,38 30,39 28.716,40 31.02,41 20.824,42 20.407,43 3.6,44 4.295}
{0 CHEMBL1317397,1 9.308,2 43.2,3 35.1,4 1.029,5 1.128,6 0.711,7 0.695,8 344.4,9 10.8,10 6,11 37,13 12,14 26,16 39,17 16,20 14,21 2,22 6,23 1,24 13,25 8,26 1,28 4,29 2,31 1,32 24,34 1,35 5.4,36 0.103,37 4,38 35,39 38.069,40 41.748,41 26.324,42 25.72,43 2.7,44 4.348}
{0 CHEMBL1322059,1 7.732,2 37.2,3 46.5,4 1.005,5 1.131,6 0.667,7 0.626,8 332.47,9 9.3,11 43,13 6,14 25,16 45,17 16,20 8,21 8,22 6,24 20,25 7,26 1,28 4,29 2,31 1,32 23,35 4.7,36 0.067,37 3,38 31,39 43.207,40 48.654,41 28.671,42 26.917,44 4.637}
{0 CHEMBL1327091,1 9.545,2 43.9,3 39,4 1.008,5 1.115,6 0.749,7 0.698,8 391.35,9 9.8,10 17,11 41,13 17,14 28,16 44,17 18,18 2,20 13,21 5,24 16,25 7,26 3,28 4,31 1,32 25,34 2,36 0.068,37 3,38 36.5,39 41.316,40 45.708,41 30.716,42 28.615,43 4.9,44 4.623}
{0 CHEMBL1335938,1 7.048,2 39.2,3 49,4 1.007,5 1.128,6 0.636,7 0.606,8 359.46,9 2,10 10,11 51,13 12,14 28,16 53,17 20,20 10,21 10,22 2,24 25,25 6,28 1,29 5,32 26,35 9.8,36 0.094,37 5,38 35,39 51.342,40 57.528,41 32.415,42 30.917,44 4.348}
{0 CHEMBL1337335,1 12.317,2 41.4,3 31,4 1.047,5 1.112,6 0.754,7 0.732,8 357.2,9 6.9,10 11,11 29,13 14,14 21,15 1,16 30,17 12,20 11,21 1,22 3,24 9,25 8,26 2,28 2,29 4,31 1,32 20,34 1,35 13.8,36 0.133,37 4,38 29.5,39 30.353,40 32.257,41 21.875,42 21.222,43 3.4,44 4.449}
{0 CHEMBL1337717,1 9.42,2 52.5,3 32.5,4 1.02,5 1.102,6 0.745,7 0.729,8 376.81,9 5,10 18,11 40,13 21,14 30,16 43,17 21,18 1,20 21,22 3,24 13,25 6,26 1,28 2,29 3,32 27,34 1,35 7.5,36 0.07,37 3,38 42,39 40.811,40 44.06,41 29.801,42 29.176,43 2.5,44 4.747}
{0 CHEMBL1338762,1 7.961,2 37.5,3 45,4 1.008,5 1.131,6 0.673,7 0.635,8 318.44,9 10,11 40,13 6,14 24,16 42,17 15,20 8,21 7,22 6,24 18,25 7,26 1,28 4,29 2,31 1,32 22,35 5,36 0.071,37 3,38 30,39 40.323,40 45.238,41 26.909,42 25.39,44 4.495}
{0 CHEMBL1349410,1 8.596,2 43.5,3 37,4 1.032,5 1.123,6 0.676,7 0.675,8 395.4,9 6.5,10 17,11 46,13 21,14 31,16 48,17 20,20 18,21 2,22 4,24 17,25 9,28 3,29 6,32 29,35 13,36 0.146,37 7,38 43.5,39 47.454,40 51.658,41 31.074,42 31.041,44 4.777}
{0 CHEMBL1353827,1 8.349,2 46.4,3 37.5,4 1.016,5 1.119,6 0.695,7 0.682,8 467.52,9 8.9,10 23,11 56,13 27,14 38,16 59,17 26,20 25,21 1,22 4,24 21,25 9,28 5,29 4,32 35,35 7.1,36 0.153,37 9,38 53.5,39 56.887,40 62.651,41 38.938,42 38.181,44 4.241}
{0 CHEMBL1355397,1 7.732,2 37.2,3 46.5,4 1.005,5 1.131,6 0.667,7 0.626,8 332.47,9 9.3,11 43,13 6,14 25,16 45,17 16,20 8,21 8,22 6,24 20,25 7,26 1,28 4,29 2,31 1,32 23,35 4.7,36 0.067,37 3,38 31,39 43.207,40 48.654,41 28.671,42 26.917,44 4.582}
{0 CHEMBL1359272,1 8.289,2 48.8,3 37.2,4 1.008,5 1.114,6 0.709,7 0.69,8 356.41,9 9.3,10 23,11 43,13 24,14 30,16 46,17 21,20 20,21 1,22 1,24 16,25 6,28 4,29 2,32 27,35 4.7,36 0.109,37 5,38 42.5,39 43.363,40 47.903,41 30.5,42 29.676,44 4.007}
{0 CHEMBL1364117,1 8.715,2 40.7,3 40.7,4 1.015,5 1.119,6 0.703,7 0.668,8 470.62,9 7.4,10 16,11 54,13 18,14 36,16 58,17 22,20 14,21 8,22 2,24 22,25 10,26 2,28 4,29 4,31 2,32 32,35 7.4,36 0.103,37 6,38 46,39 54.822,40 60.408,41 37.989,42 36.06,44 4.419}
{0 CHEMBL1376030,1 9.308,2 40,3 35.6,4 1.038,5 1.142,6 0.684,7 0.681,8 418.85,9 13.3,10 17,11 45,13 19,14 31,16 47,17 18,18 1,20 16,21 2,22 2,23 1,24 16,25 11,26 1,28 6,29 3,32 29,34 2,35 6.7,36 0.128,37 6,38 41.5,39 46.731,40 51.393,41 30.762,42 30.644,43 4.4,44 4.275}
{0 CHEMBL1378326,1 8.28,2 39.6,3 39.6,4 1.028,5 1.134,6 0.659,7 0.654,8 397.43,9 10.4,10 16,11 48,13 20,14 31,16 50,17 19,20 15,21 4,22 4,24 19,25 10,28 5,29 5,32 29,35 10.4,36 0.18,37 9,38 43,39 49.331,40 54.445,41 31.631,42 31.369,44 4.31}
{0 CHEMBL1384419,1 8.803,2 44.6,3 37.5,4 1.024,5 1.12,6 0.697,7 0.683,8 492.95,9 7.1,10 18,11 56,13 22,14 38,16 59,17 25,18 1,20 22,21 3,22 4,24 21,25 10,26 1,28 4,29 5,32 35,34 1,35 8.9,36 0.119,37 7,38 51,39 57.32,40 62.721,41 39.006,42 38.228,43 1.8,44 4.076}
{0 CHEMBL1384965,1 7.87,2 44.2,3 41.9,4 1.014,5 1.12,6 0.673,7 0.654,8 338.39,9 4.7,10 12,11 43,13 15,14 27,16 45,17 19,20 15,21 4,22 3,24 18,25 6,28 2,29 4,32 25,35 9.3,36 0.089,37 4,38 36,39 43.582,40 48.156,41 28.921,42 28.116,44 4.187}
{0 CHEMBL1392517,1 8.457,2 42.6,3 40.4,4 1.016,5 1.119,6 0.693,7 0.666,8 397.49,9 6.4,10 12,11 47,13 16,14 30,16 49,17 20,20 17,21 3,22 4,24 19,25 8,26 1,28 3,29 4,31 1,32 28,35 8.5,36 0.122,37 6,38 40,39 47.76,40 52.574,41 32.574,42 31.325,44 4.548}
{0 CHEMBL1411915,1 9.743,2 44.9,3 30.6,4 1.062,5 1.147,6 0.676,7 0.702,8 477.4,9 6.1,10 18,11 49,13 22,14 36,16 51,17 22,20 20,21 2,22 4,23 4,24 15,25 12,28 3,29 5,32 34,34 4,35 10.2,36 0.157,37 8,38 49,39 52.062,40 56.222,41 33.131,42 34.386,43 8.2,44 4.908}
{0 CHEMBL1417452,1 7.423,2 41.4,3 44.8,4 1.002,5 1.13,6 0.665,7 0.635,8 430.56,9 10.3,10 21,11 58,13 22,14 36,16 62,17 24,20 17,21 7,22 1,24 26,25 8,28 6,29 2,32 32,35 3.4,36 0.065,37 4,38 47.5,39 58.101,40 65.561,41 38.557,42 36.826,44 4.131}
{0 CHEMBL1418921,1 8.499,2 45.1,3 37.3,4 1.026,5 1.119,6 0.683,7 0.678,8 433.45,9 5.9,10 18,11 51,13 21,14 35,16 54,17 23,20 20,21 3,22 3,24 19,25 9,28 3,29 6,32 32,35 11.8,36 0.13,37 7,38 47,39 52.338,40 57.073,41 34.835,42 34.567,44 4.678}
{0 CHEMBL1422828,1 7.214,2 38.8,3 46.9,4 1.002,5 1.136,6 0.649,7 0.618,8 353.47,9 10.2,10 15,11 49,13 16,14 29,16 52,17 19,20 11,21 8,22 1,24 23,25 7,28 5,29 2,32 26,35 4.1,36 0.058,37 3,38 37.5,39 49.116,40 55.647,41 31.79,42 30.278,44 4.082}
{0 CHEMBL1428762,1 8.381,2 48.8,3 37.2,4 1.016,5 1.11,6 0.701,7 0.688,8 360.39,9 4.7,10 21,11 43,13 22,14 31,16 47,17 21,20 18,21 3,22 1,24 16,25 6,28 2,29 4,32 27,35 9.3,36 0.064,37 3,38 42.5,39 43.698,40 47.741,41 30.159,42 29.59,44 4.777}
{0 CHEMBL1436039,1 7.784,2 41.5,3 45.3,4 1.006,5 1.119,6 0.676,7 0.639,8 412.55,9 3.8,10 16,11 53,13 19,14 32,16 56,17 22,20 15,21 7,22 3,24 24,25 7,26 1,28 2,29 4,31 1,32 29,35 7.5,36 0.125,37 7,38 43,39 53.309,40 59.321,41 35.853,42 33.884,44 4.22}
{0 CHEMBL1440829,1 8.783,2 48.6,3 37.1,4 1.004,5 1.106,6 0.741,7 0.703,8 307.4,9 8.6,10 17,11 35,13 19,14 24,16 37,17 17,20 17,22 2,24 13,25 5,26 1,28 3,29 1,31 1,32 22,35 2.9,36 0.108,37 4,38 34.5,39 35.127,40 38.7,41 25.926,42 24.6,44 4.54}
{0 CHEMBL1451181,1 11.039,2 43.8,3 31.3,4 1.031,5 1.115,6 0.778,7 0.742,8 353.25,9 12.5,10 16,11 32,13 17,14 24,16 34,17 14,18 2,20 13,21 1,22 1,24 10,25 8,26 3,28 4,29 1,31 1,32 22,34 2,35 3.1,36 0.147,37 5,38 33,39 32.993,40 35.671,41 24.886,42 23.75,43 6.3,44 4.519}
{0 CHEMBL1454925,1 7.24,2 41.5,3 46.2,4 0.998,5 1.129,6 0.663,7 0.629,8 470.63,9 9.2,10 22,11 65,13 23,14 39,16 69,17 27,20 18,21 9,22 1,24 30,25 8,28 6,29 2,32 35,35 3.1,36 0.087,37 6,38 51,39 64.869,40 73.391,41 43.08,42 40.88,44 4.392}
{0 CHEMBL1456506,1 8.145,2 38.6,3 40.9,4 1.028,5 1.135,6 0.651,7 0.644,8 358.39,9 9.1,10 12,11 44,13 16,14 27,16 45,17 17,20 14,21 3,22 4,24 18,25 9,28 4,29 5,32 26,35 11.4,36 0.133,37 6,38 37,39 45.229,40 49.947,41 28.625,42 28.347,44 4.462}
{0 CHEMBL1457816,1 8.736,2 36.4,3 36.4,4 1.038,5 1.147,6 0.657,7 0.662,8 384.4,9 18.2,10 16,11 44,13 20,14 30,16 46,17 16,20 13,21 3,22 4,24 16,25 12,28 8,29 4,32 28,35 9.1,36 0.13,37 6,38 42,39 45.658,40 50.485,41 28.909,42 29.138,44 4.749}
{0 CHEMBL1461321,1 8.509,2 50,3 35.7,4 1.014,5 1.11,6 0.713,7 0.699,8 357.39,9 7.1,10 22,11 42,13 23,14 31,16 46,17 21,20 20,21 1,22 1,24 15,25 6,28 3,29 3,32 27,35 7.1,36 0.065,37 3,38 43,39 42.589,40 46.614,41 29.949,42 29.369,44 4.377}
{0 CHEMBL1464968,1 9.367,2 44.4,3 38.9,4 1.019,5 1.117,6 0.721,7 0.689,8 337.22,9 5.6,10 12,11 36,13 13,14 24,16 38,17 16,18 2,20 13,21 3,22 1,24 14,25 6,26 2,28 2,29 2,32 22,34 2,35 5.6,36 0.105,37 4,38 31,39 36.691,40 40.21,41 25.966,42 24.815,43 5.6,44 4.735}
{0 CHEMBL1469108,1 7.476,2 44.4,3 44.4,4 1.003,5 1.119,6 0.672,7 0.643,8 336.42,9 4.4,10 12,11 45,13 16,14 26,16 46,17 20,20 18,21 2,22 4,24 20,25 5,28 2,29 3,32 25,35 6.7,36 0.152,37 7,38 36,39 45.138,40 50.362,41 30.228,42 28.928,44 4.283}
{0 CHEMBL1471494,1 8.427,2 40,3 38.2,4 1.028,5 1.135,6 0.666,7 0.662,8 463.5,9 12.7,10 22,11 55,13 24,14 37,16 58,17 22,20 18,21 4,22 2,24 21,25 12,28 7,29 5,32 34,35 9.1,36 0.138,37 8,38 50,39 56.534,40 62.442,41 36.642,42 36.411,44 4.139}
{0 CHEMBL1483108,1 10.053,2 45.7,3 30.4,4 1.052,5 1.143,6 0.71,7 0.716,8 462.46,9 8.7,10 16,11 46,13 19,14 36,16 50,17 21,20 17,21 4,22 3,23 4,24 14,25 11,26 1,28 4,29 2,31 1,32 32,34 4,35 4.3,36 0.06,37 3,38 47,39 48.374,40 52.597,41 32.659,42 32.923,43 8.7,44 4.3}
{0 CHEMBL1489731,1 9.465,2 47.9,3 35.4,4 1.021,5 1.111,6 0.733,7 0.71,8 454.33,9 6.3,10 18,11 48,13 21,14 33,16 50,17 23,18 2,19 1,20 20,21 2,22 2,24 17,25 8,26 2,28 3,29 3,32 31,33 1,34 2,35 6.3,36 0.14,37 7,38 46,39 49.004,40 53.333,41 35.188,42 34.078,43 4.2,44 4.015}
{0 CHEMBL1490316,1 8.079,2 46.5,3 39.5,4 1.011,5 1.117,6 0.691,7 0.672,8 347.4,9 7,10 16,11 43,13 19,14 29,16 46,17 20,20 17,21 3,22 3,24 17,25 6,28 3,29 3,32 26,35 7,36 0.065,37 3,38 40,39 43.473,40 48.03,41 29.71,42 28.896,44 4.542}
{0 CHEMBL1491602,1 10.749,2 42.5,3 30,4 1.029,5 1.118,6 0.773,7 0.741,8 429.95,9 17.5,10 22,11 40,13 23,14 31,16 43,17 17,18 1,20 16,21 1,22 1,24 12,25 11,26 3,28 7,29 1,31 2,32 28,34 1,35 2.5,36 0.14,37 6,38 43,39 41.167,40 44.727,41 30.932,42 29.647,43 2.5,44 4.425}
{0 CHEMBL1501508,1 7.917,2 48.1,3 40.7,4 1.006,5 1.119,6 0.694,7 0.669,8 427.51,9 5.6,10 27,11 54,13 27,14 36,16 58,17 26,20 22,21 4,23 1,24 22,25 6,28 3,29 2,32 32,34 1,35 3.7,36 0.086,37 5,38 49.5,39 54.309,40 60.405,41 37.478,42 36.145,43 1.9,44 4.155}
{0 CHEMBL1504776,1 8.1,2 44.9,3 42.9,4 1.007,5 1.117,6 0.691,7 0.659,8 396.9,9 4.1,10 17,11 49,13 18,14 31,16 52,17 22,18 1,20 17,21 5,22 1,24 21,25 6,26 1,28 2,29 3,32 28,34 1,35 6.1,36 0.096,37 5,38 40.5,39 49.345,40 54.721,41 33.847,42 32.283,43 2,44 4.088}
{0 CHEMBL1507325,1 8.289,2 48.8,3 37.2,4 1.008,5 1.114,6 0.709,7 0.69,8 356.41,9 9.3,10 23,11 43,13 24,14 30,16 46,17 21,20 20,21 1,22 1,24 16,25 6,28 4,29 2,32 27,35 4.7,36 0.109,37 5,38 42.5,39 43.363,40 47.903,41 30.5,42 29.676,44 4.417}
{0 CHEMBL1513146,1 7.92,2 36.4,3 45.5,4 1.012,5 1.133,6 0.662,7 0.628,8 348.47,9 9.1,11 44,13 6,14 26,16 46,17 16,20 8,21 8,22 6,24 20,25 8,26 1,28 4,29 3,31 1,32 24,35 6.8,36 0.065,37 3,38 32,39 44.534,40 49.863,41 29.125,42 27.632,44 4.97}
{0 CHEMBL1513912,1 8.738,2 45.5,3 38.6,4 1.019,5 1.118,6 0.706,7 0.681,8 384.46,9 4.5,10 17,11 44,13 20,14 30,16 47,17 20,20 17,21 3,22 3,23 1,24 17,25 7,26 1,28 2,29 3,31 1,32 27,34 1,35 6.8,36 0.085,37 4,38 41.5,39 44.843,40 49.206,41 31.051,42 29.972,43 2.3,44 4.327}
{0 CHEMBL1516266,1 7.709,2 41.5,3 45.3,4 1,5 1.122,6 0.683,7 0.641,8 408.57,9 7.5,10 6,11 53,13 12,14 32,16 56,17 22,20 14,21 8,22 6,24 24,25 7,26 1,28 4,29 2,31 1,32 29,35 3.8,36 0.089,37 5,38 41,39 52.974,40 59.484,41 36.193,42 33.97,44 4.57}
{0 CHEMBL1528515,1 9.267,2 44.7,3 36.2,4 1.013,5 1.112,6 0.74,7 0.704,8 435.57,9 10.6,10 17,11 47,13 20,14 32,16 49,17 21,19 2,20 16,21 3,22 1,24 17,25 9,26 2,28 5,29 2,31 2,32 30,33 2,35 4.3,36 0.143,37 7,38 45.5,39 47.618,40 52.242,41 34.801,42 33.072,44 4.365}
{0 CHEMBL1539954,1 8.631,2 45.9,3 35.1,4 1.019,5 1.124,6 0.702,7 0.693,8 319.35,9 13.5,10 21,11 37,13 22,14 27,16 40,17 17,20 16,21 1,22 1,24 13,25 7,28 5,29 2,32 24,35 5.4,36 0.075,37 3,38 38.5,39 37.698,40 41.571,41 25.983,42 25.644,44 4.105}
{0 CHEMBL1541182,1 7.784,2 42.5,3 42.5,4 1.012,5 1.126,6 0.668,7 0.647,8 311.37,9 7.5,10 15,11 40,13 17,14 25,16 42,17 17,20 13,21 4,22 2,24 17,25 6,28 3,29 3,32 23,35 7.5,36 0.119,37 5,38 34.5,39 40.473,40 45.03,41 26.71,42 25.896,44 4.49}
{0 CHEMBL1541598,1 8.784,2 46.6,3 36.2,4 1.037,5 1.124,6 0.68,7 0.683,8 509.49,9 1.7,10 18,11 58,13 22,14 40,16 61,17 27,20 23,21 4,22 4,23 2,24 21,25 10,28 1,29 7,32 37,34 2,35 12.1,36 0.148,37 9,38 53,39 60.138,40 65.211,41 39.438,42 39.586,43 3.4,44 4.505}
{0 CHEMBL1542222,1 9.521,2 36.4,3 38.2,4 1.032,5 1.124,6 0.705,7 0.676,8 523.67,9 9.1,10 17,11 55,13 23,14 36,16 57,17 20,20 17,21 3,22 6,24 21,25 14,26 3,28 5,29 6,31 3,32 34,35 10.9,36 0.123,37 7,38 50.5,39 56.771,40 61.83,41 38.79,42 37.171,44 4.332}
{0 CHEMBL1551928,1 8.227,2 37.8,3 43.2,4 1.012,5 1.13,6 0.68,7 0.645,8 304.41,9 10.8,11 37,13 6,14 23,16 39,17 14,20 8,21 6,22 6,24 16,25 7,26 1,28 4,29 2,31 1,32 21,35 5.4,36 0.077,37 3,38 29,39 37.44,40 41.823,41 25.148,42 23.863,44 4.344}
{0 CHEMBL1567008,1 8.662,2 48.8,3 37.2,4 1.003,5 1.107,6 0.737,7 0.701,8 372.48,9 9.3,10 22,11 43,13 24,14 30,16 46,17 21,20 21,22 2,24 16,25 6,26 1,28 4,29 1,31 1,32 27,35 2.3,36 0.109,37 5,38 43,39 43.113,40 47.614,41 31.693,42 30.148,44 4.493}
{0 CHEMBL1569927,1 9.996,2 46.2,3 33.3,4 1.03,5 1.118,6 0.742,7 0.719,8 389.86,9 7.7,10 11,11 39,13 14,14 29,16 42,17 18,18 1,19 1,20 12,21 5,22 2,23 1,24 13,25 8,26 2,28 3,29 2,31 1,32 26,33 1,34 2,35 5.1,36 0.071,37 3,38 38.5,39 40.174,40 43.609,41 28.938,42 28.053,43 5.1,44 4.361}
{0 CHEMBL1572586,1 7.853,2 44.4,3 42.2,4 1.015,5 1.117,6 0.67,7 0.652,8 353.4,9 2.2,10 11,11 45,13 14,14 29,16 48,17 20,20 14,21 6,22 3,24 19,25 6,28 1,29 5,32 26,35 11.1,36 0.083,37 4,38 37.5,39 45.691,40 50.282,41 30.131,42 29.337,44 4.545}
{0 CHEMBL1573243,1 8.819,2 40.4,3 38.3,4 1.028,5 1.125,6 0.687,7 0.671,8 414.48,9 8.5,10 17,11 47,13 18,14 32,16 50,17 19,20 14,21 5,22 1,24 18,25 10,26 1,28 4,29 5,31 1,32 29,35 10.6,36 0.14,37 7,38 41.5,39 48.305,40 52.867,41 32.273,42 31.534,44 4.753}
{0 CHEMBL1586644,1 8.631,2 38.1,3 42.9,4 1.01,5 1.123,6 0.704,7 0.657,8 362.52,9 9.5,10 16,11 42,13 18,14 26,16 44,17 16,20 12,21 4,22 2,24 18,25 8,26 2,28 4,29 2,31 2,32 24,35 4.8,36 0.091,37 4,38 36,39 42.4,40 47.158,41 29.557,42 27.577,44 4.372}
{0 CHEMBL1598262,1 8.906,2 44.7,3 36.8,4 1.015,5 1.116,6 0.721,7 0.693,8 338.42,9 10.5,10 17,11 38,13 19,14 26,16 40,17 17,20 16,21 1,22 2,24 14,25 7,26 1,28 4,29 2,31 1,32 24,35 5.3,36 0.1,37 4,38 36.5,39 38.556,40 42.408,41 27.387,42 26.336,44 4.437}
{0 CHEMBL1608112,1 7.928,2 44.9,3 40.8,4 1.009,5 1.121,6 0.683,7 0.662,8 388.46,9 8.2,10 18,11 49,13 21,14 31,16 51,17 22,20 20,21 2,22 3,24 20,25 7,28 4,29 3,32 29,35 6.1,36 0.157,37 8,38 43,39 49.458,40 54.943,41 33.478,42 32.444,44 4.985}
{0 CHEMBL1608446,1 8.848,2 40,3 40,4 1.021,5 1.12,6 0.699,7 0.669,8 486.62,9 7.3,10 16,11 55,13 19,14 36,16 58,17 22,20 16,21 6,22 3,24 22,25 11,26 2,28 4,29 5,31 2,32 33,35 9.1,36 0.155,37 9,38 47,39 56.149,40 61.617,41 38.443,42 36.775,44 4.357}
{0 CHEMBL1611190,1 8.156,2 35.4,3 43.8,4 1.02,5 1.137,6 0.658,7 0.633,8 391.5,9 10.4,11 48,13 7,14 29,16 50,17 17,20 9,21 8,22 7,24 21,25 10,26 1,28 5,29 4,31 1,32 27,35 8.3,36 0.1,37 5,38 36,39 48.963,40 54.571,41 31.585,42 30.368,44 4.274}
{0 CHEMBL1611873,1 9.753,2 43.2,3 35.1,4 1.024,5 1.118,6 0.736,7 0.707,8 360.85,9 10.8,10 6,11 37,13 12,14 26,16 39,17 16,18 1,20 14,21 2,22 6,24 13,25 8,26 2,28 4,29 2,31 1,32 24,34 1,35 5.4,36 0.103,37 4,38 35,39 37.88,40 41.352,41 27.244,42 26.164,43 2.7,44 4.737}
{0 CHEMBL1612424,1 8.897,2 45.7,3 37.1,4 1.013,5 1.112,6 0.725,7 0.695,8 311.39,9 8.6,10 6,11 35,13 12,14 24,16 37,17 16,20 14,21 2,22 6,24 13,25 6,26 1,28 3,29 2,31 1,32 22,35 5.7,36 0.108,37 4,38 33,39 35.454,40 38.91,41 25.381,42 24.315,44 4.28}
{0 CHEMBL1719561,1 8.638,2 39.2,3 39.2,4 1.023,5 1.13,6 0.683,7 0.664,8 440.53,9 11.8,10 17,11 51,13 19,14 34,16 54,17 20,20 15,21 5,22 2,24 20,25 11,26 1,28 6,29 4,31 1,32 31,35 7.8,36 0.13,37 7,38 44.5,39 52.182,40 57.654,41 34.83,42 33.862,44 4.39}
{0 CHEMBL1735069,1 7.048,2 39.2,3 49,4 1.007,5 1.128,6 0.636,7 0.606,8 359.46,9 2,10 10,11 51,13 12,14 28,16 53,17 20,20 10,21 10,22 2,24 25,25 6,28 1,29 5,32 26,35 9.8,36 0.113,37 6,38 35,39 51.342,40 57.528,41 32.415,42 30.917,44 4.156}
{0 CHEMBL1865338,1 7.771,2 40.5,3 42.9,4 1.014,5 1.132,6 0.66,7 0.641,8 326.39,9 9.5,10 12,11 42,13 15,14 25,16 43,17 17,20 15,21 2,22 3,24 18,25 7,28 4,29 3,32 24,35 7.1,36 0.14,37 6,38 34,39 42.574,40 47.528,41 27.716,42 26.918,44 4.592}
{0 CHEMBL1881384,1 7.581,2 46,3 42.9,4 0.998,5 1.119,6 0.688,7 0.656,8 477.61,9 7.9,10 28,11 63,13 29,14 40,16 67,17 29,20 25,21 4,22 1,24 27,25 7,28 5,29 2,32 36,35 3.2,36 0.119,37 8,38 55,39 62.883,40 70.478,41 43.313,42 41.331,44 4.737}
{0 CHEMBL1885679,1 8.329,2 43.2,3 40.9,4 1.007,5 1.119,6 0.702,7 0.668,8 366.48,9 9.1,10 16,11 44,13 17,14 30,16 48,17 19,20 13,21 6,22 1,24 18,25 7,26 1,28 4,29 2,31 1,32 26,35 4.5,36 0.042,37 2,38 39,39 44.323,40 49.238,41 30.909,42 29.39,44 4.637}
{0 CHEMBL1968986,1 12.242,2 44.4,3 30.6,4 1.037,5 1.108,6 0.779,7 0.747,8 440.72,9 8.3,10 11,11 36,13 15,14 27,15 1,16 38,17 16,18 1,20 15,21 1,22 4,24 11,25 9,26 3,28 3,29 3,31 1,32 25,34 2,35 8.3,36 0.132,37 5,38 36.5,39 37.335,40 39.905,41 28.046,42 26.882,43 5.6,44 4.465}
{0 CHEMBL2131048,1 8.753,2 42.6,3 36.2,4 1.038,5 1.125,6 0.671,7 0.676,8 411.4,9 6.4,10 17,11 47,13 21,14 32,16 49,17 20,20 18,21 2,22 4,24 17,25 10,28 3,29 7,32 30,35 14.9,36 0.163,37 8,38 44.5,39 48.782,40 52.867,41 31.528,42 31.755,44 4.474}
{0 CHEMBL2143453,1 6.843,2 39.6,3 50,4 0.998,5 1.129,6 0.641,7 0.604,8 328.45,9 4.2,10 10,11 48,13 12,14 26,16 50,17 19,20 10,21 9,22 2,24 24,25 5,28 2,29 3,32 24,35 6.3,36 0.08,37 4,38 33,39 47.905,40 54.192,41 30.75,42 28.982,44 4.547}
{0 CHEMBL260419,1 7.565,2 42.6,3 44.4,4 1.01,5 1.122,6 0.66,7 0.637,8 408.49,9 3.7,10 12,11 54,13 15,14 33,16 57,17 23,20 16,21 7,22 3,24 24,25 7,28 2,29 5,32 30,35 9.3,36 0.123,37 7,38 42,39 54.56,40 60.611,41 35.659,42 34.412,44 4.434}
