{
  "data_set_description": {
    "collection_date": "November 2013",
    "creator": "Dr Jeremy Besnard, Dr Ivan Olier, Dr Noureddin Sadawi, Dr Larisa Soldatova, Dr Crina Grosan, Prof Ross King, Dr Richard Bickerton, Prof Andrew Hopkins and Dr Willem van Hoorn",
    "default_target_attribute": "pXC50",
    "description": "This dataset contains QSAR data (from ChEMBL version 17) showing activity values (unit is pseudo-pCI50) of several compounds on drug target ChEMBL_ID: CHEMBL5098 (TID: 11530), and it has 49 rows and 43 features (not including molecule IDs and class feature: molecule_id and pXC50). The features represent Basic Molecular Descriptors which were generated from SMILES strings.  Missing value imputation was applied to this dataset (By choosing the Median).",
    "description_version": "1",
    "file_id": "3499140",
    "format": "ARFF",
    "id": "33186",
    "licence": "Public",
    "md5_checksum": "5d2d8182f62399da3bce377cdb85b21c",
    "minio_url": "https://data.openml.org/datasets/0003/33186/dataset_33186.pq",
    "name": "QSAR-DATASET-FOR-DRUG-TARGET-CHEMBL5098",
    "original_data_url": "https://www.ebi.ac.uk/chembl/target/inspect/CHEMBL5098",
    "parquet_url": "https://data.openml.org/datasets/0003/33186/dataset_33186.pq",
    "processing_date": "2018-10-04 03:16:30",
    "row_id_attribute": "molecule_id",
    "status": "deactivated",
    "tag": [
      "MetaQSAR",
      "study_13"
    ],
    "upload_date": "2016-07-15T12:08:09",
    "url": "https://api.openml.org/data/v1/download/3499140/QSAR-DATASET-FOR-DRUG-TARGET-CHEMBL5098.arff",
    "version": "9",
    "visibility": "public"
  }
}