"molecule_id","AMW","C.","H.","Me","Mi","Mp","Mv","MW","N.","nAB","nAT","nB","nBM","nBO","nBR","nBT","nC","nCL","nCsp","nCsp2","nCsp3","nDB","nF","nH","nHet","nHM","nI","nN","nO","nP","nS","nSK","nTB","nX","O.","RBF","RBN","SCBO","Se","Si","Sp","Sv","X.","pXC50"
{1 12.523,2 51.7,3 34.5,4 1.008,5 1.094,6 0.806,7 0.738,8 363.16,9 3.4,10 12,11 29,13 14,14 21,16 31,17 15,20 14,21 1,22 2,24 10,25 4,26 1,27 1,28 1,29 2,32 19,34 1,35 6.9,36 0.065,37 2,38 29,39 29.244,40 31.714,41 23.381,42 21.402,43 3.4,44 4.301}
{0 CHEMBL148483,1 8.878,2 43.5,3 34.8,4 1.036,5 1.125,6 0.681,7 0.686,8 204.2,9 8.7,10 6,11 23,13 9,14 16,16 24,17 10,20 9,21 1,22 3,24 8,25 5,28 2,29 3,32 15,35 13,36 0.042,37 1,38 22,39 23.836,40 25.87,41 15.659,42 15.768,44 4.149}
{0 CHEMBL185698,1 12.034,2 48.6,3 34.3,4 1.022,5 1.101,6 0.773,7 0.725,8 421.2,9 2.9,10 12,11 35,13 14,14 26,16 38,17 17,20 14,21 3,22 2,24 12,25 6,26 1,27 1,28 1,29 4,32 23,34 1,35 11.4,36 0.053,37 2,38 34,39 35.782,40 38.548,41 27.051,42 25.358,43 2.9,44 4.87}
{0 CHEMBL187266,1 7.359,2 47.5,3 45,4 0.998,5 1.109,6 0.68,7 0.647,8 294.37,10 11,11 40,13 13,14 25,16 43,17 19,20 12,21 7,22 2,24 18,25 3,29 3,32 22,35 7.5,38 32.5,39 39.934,40 44.365,41 27.216,42 25.886,44 4.767}
{0 CHEMBL187460,1 7.057,2 45.2,3 47.6,4 0.996,5 1.114,6 0.666,7 0.629,8 296.39,10 6,11 42,13 9,14 25,16 45,17 19,20 10,21 9,22 3,24 20,25 3,29 3,32 22,35 7.1,38 31,39 41.818,40 46.78,41 27.978,42 26.412,44 4.527}
{0 CHEMBL187579,1 8.79,2 46.9,3 34.4,4 1.026,5 1.118,6 0.701,7 0.697,8 281.29,9 9.4,10 11,11 32,13 14,14 23,16 34,17 15,19 1,20 11,21 3,22 2,24 11,25 6,28 3,29 3,32 21,33 1,35 9.4,36 0.059,37 2,38 32.5,39 32.822,40 35.784,41 22.426,42 22.316,44 5.143}
{0 CHEMBL187598,1 9.73,2 53.1,3 31.3,4 1.024,5 1.102,6 0.76,7 0.739,8 311.35,9 3.1,10 16,11 32,13 18,14 25,16 35,17 17,20 16,21 1,22 2,23 1,24 10,25 5,26 1,28 1,29 2,31 1,32 22,34 1,35 6.3,36 0.057,37 2,38 35,39 32.764,40 35.253,41 24.307,42 23.655,43 3.1,44 5.317}
{0 CHEMBL187717,1 9.952,2 50,3 29.4,4 1.033,5 1.1,6 0.751,7 0.741,8 338.36,9 5.9,10 16,11 34,13 20,14 27,16 37,17 17,20 16,21 1,22 4,24 10,25 7,26 1,28 2,29 4,31 1,32 24,35 11.8,36 0.081,37 3,38 39,39 35.124,40 37.415,41 25.523,42 25.196,44 5.699}
{0 CHEMBL188487,1 14.331,2 51.7,3 27.6,4 1.037,5 1.103,6 0.834,7 0.78,8 415.59,9 3.4,10 12,11 29,13 14,14 23,16 31,17 15,18 1,20 14,21 1,22 2,23 1,24 8,25 6,26 2,27 1,28 1,29 2,32 21,34 3,35 6.9,36 0.065,37 2,38 31,39 30.08,40 31.997,41 24.176,42 22.613,43 10.3,44 5.027}
{0 CHEMBL188983,1 12.369,2 52.8,3 33.3,4 1.006,5 1.085,6 0.827,7 0.753,8 445.29,9 2.8,10 16,11 36,13 19,14 27,16 39,17 19,20 18,21 1,22 3,24 12,25 5,26 2,27 1,28 1,29 2,31 1,32 24,34 1,35 5.6,36 0.077,37 3,38 38,39 36.204,40 39.049,41 29.79,42 27.116,43 2.8,44 4.629}
{0 CHEMBL190743,1 13.102,2 53.1,3 31.3,4 1.01,5 1.082,6 0.845,7 0.768,8 419.25,9 3.1,10 16,11 32,13 18,14 25,16 35,17 17,20 16,21 1,22 2,24 10,25 5,26 2,27 1,28 1,29 2,31 1,32 22,34 1,35 6.3,36 0.057,37 2,38 35,39 32.32,40 34.634,41 27.029,42 24.589,43 3.1,44 6.022}
{0 CHEMBL191575,1 13.069,2 50,3 30,4 1.024,5 1.093,6 0.828,7 0.767,8 522.76,9 5,10 17,11 40,13 20,14 31,16 43,17 20,18 1,20 19,21 1,22 3,24 12,25 8,26 3,27 1,28 2,29 3,31 1,32 28,34 2,35 7.5,36 0.093,37 4,38 42.5,39 40.956,40 43.701,41 33.108,42 30.679,43 5,44 4.901}
{0 CHEMBL194398,1 7.082,2 37.8,3 48.8,4 1.007,5 1.133,6 0.633,7 0.605,8 580.75,9 4.9,10 11,11 82,13 17,14 44,16 84,17 31,20 16,21 15,22 6,24 40,25 11,28 4,29 7,32 42,35 8.5,36 0.19,37 16,38 55.5,39 82.603,40 92.933,41 51.909,42 49.572,44 4.347}
{0 CHEMBL196635,1 6.814,2 35.4,3 51.2,4 1.006,5 1.138,6 0.618,7 0.587,8 558.75,9 4.9,10 5,11 82,13 12,14 41,16 83,17 29,20 12,21 17,22 7,24 42,25 11,28 4,29 7,32 40,35 8.5,36 0.193,37 16,38 50.5,39 82.487,40 93.348,41 50.671,42 48.098,44 4.155}
{0 CHEMBL20636,1 7.404,2 37,3 46.9,4 1.016,5 1.14,6 0.631,7 0.61,8 599.73,9 6.2,10 11,11 81,13 17,14 45,16 83,17 30,20 16,21 14,22 6,23 1,24 38,25 13,28 5,29 7,32 43,34 1,35 8.6,36 0.181,37 15,38 56.5,39 82.334,40 92.355,41 51.091,42 49.449,43 1.2,44 5}
{0 CHEMBL207207,1 9.347,2 44.2,3 37.2,4 1.02,5 1.114,6 0.726,7 0.696,8 401.9,9 7,10 18,11 43,13 19,14 29,16 45,17 19,18 1,20 17,21 2,22 1,24 16,25 8,26 2,28 3,29 3,31 1,32 27,34 1,35 7,36 0.133,37 6,38 39,39 43.873,40 47.894,41 31.216,42 29.911,43 2.3,44 4}
{0 CHEMBL208584,1 8.891,2 39.5,3 42.1,4 1.014,5 1.123,6 0.704,7 0.663,8 337.86,9 7.9,10 12,11 38,13 13,14 23,16 39,17 15,18 1,20 11,21 4,22 1,24 16,25 7,26 2,28 3,29 2,31 1,32 22,34 1,35 5.3,36 0.154,37 6,38 30,39 38.545,40 42.684,41 26.762,42 25.196,43 2.6,44 4.523}
{0 CHEMBL208732,1 10.76,2 47.7,3 31.8,4 1.019,5 1.1,6 0.797,7 0.75,8 473.43,9 9.1,10 23,11 44,13 24,14 33,16 47,17 21,18 2,20 20,21 1,22 1,24 14,25 9,26 4,28 4,29 1,31 2,32 30,34 2,35 2.3,36 0.128,37 6,38 45.5,39 44.836,40 48.422,41 35.057,42 32.99,43 4.5,44 5.523}
{0 CHEMBL208763,1 9.612,2 47.7,3 34.1,4 1.017,5 1.108,6 0.75,7 0.72,8 422.92,9 9.1,10 23,11 44,13 24,14 32,16 47,17 21,18 1,20 20,21 1,22 1,24 15,25 8,26 2,28 4,29 2,31 1,32 29,34 1,35 4.5,36 0.128,37 6,38 44.5,39 44.764,40 48.767,41 33.006,42 31.691,43 2.3,44 4.824}
{0 CHEMBL209227,1 10.699,2 44.2,3 32.6,4 1.019,5 1.104,6 0.793,7 0.741,8 460.04,9 11.6,10 22,11 43,13 23,14 32,16 46,17 19,18 1,20 17,21 2,22 1,24 14,25 10,26 4,28 5,29 1,31 3,32 29,34 1,35 2.3,36 0.13,37 6,38 44,39 43.807,40 47.481,41 34.091,42 31.845,43 2.3,44 4.854}
{0 CHEMBL209287,1 11.755,2 42.9,3 42.9,4 1.005,5 1.112,6 0.755,7 0.676,8 329.15,9 3.6,10 6,11 28,13 8,14 17,16 29,17 12,20 8,21 4,22 2,24 12,25 4,26 1,27 1,28 1,29 2,32 16,34 1,35 7.1,36 0.103,37 3,38 22,39 28.127,40 31.129,41 21.142,42 18.929,43 3.6,44 4.18}
{0 CHEMBL209667,1 10.395,2 47.7,3 31.8,4 1.025,5 1.107,6 0.77,7 0.739,8 457.36,9 9.1,10 23,11 44,13 24,14 33,16 47,17 21,18 2,20 20,21 1,22 1,24 14,25 9,26 3,28 4,29 2,31 1,32 30,34 2,35 4.5,36 0.128,37 6,38 45.5,39 45.087,40 48.711,41 33.864,42 32.518,43 4.5,44 4.824}
{0 CHEMBL210092,1 10.18,2 43.1,3 37.3,4 1.008,5 1.101,6 0.785,7 0.717,8 519.18,9 7.8,10 22,11 51,13 23,14 35,16 54,17 22,18 1,20 18,21 4,22 1,24 19,25 10,26 5,28 4,29 1,31 4,32 32,34 1,35 2,36 0.13,37 7,38 47,39 51.433,40 56.148,41 40.017,42 36.591,43 2,44 4.959}
{0 CHEMBL210097,1 11.178,2 46.8,3 27.7,4 1.053,5 1.131,6 0.754,7 0.749,8 525.36,9 8.5,10 23,11 47,13 24,14 37,16 50,17 22,18 2,20 20,21 2,22 1,23 3,24 13,25 12,26 3,28 4,29 2,31 1,32 34,34 5,35 4.3,36 0.12,37 6,38 49.5,39 49.509,40 53.146,41 35.438,42 35.195,43 10.6,44 4.824}
{0 CHEMBL210487,1 8.41,2 43.6,3 40,4 1.014,5 1.118,6 0.697,7 0.67,8 462.57,9 7.3,10 18,11 55,13 21,14 35,16 57,17 24,19 1,20 18,21 5,22 2,24 22,25 9,26 1,28 4,29 4,31 1,32 33,33 1,35 7.3,36 0.14,37 8,38 48,39 55.745,40 61.488,41 38.341,42 36.873,44 4.222}
{0 CHEMBL210497,1 9.624,2 40.8,3 34.7,4 1.033,5 1.12,6 0.718,7 0.698,8 471.56,9 10.2,10 18,11 49,13 22,14 34,16 51,17 20,19 1,20 17,21 2,22 3,24 17,25 12,26 2,28 5,29 5,31 2,32 32,33 1,35 10.2,36 0.137,37 7,38 48,39 50.6,40 54.87,41 35.165,42 34.216,44 4.398}
{0 CHEMBL210525,1 8.009,2 41.4,3 41.4,4 1.021,5 1.128,6 0.661,7 0.649,8 232.26,9 6.9,10 6,11 29,13 9,14 18,16 30,17 12,20 9,21 3,22 3,24 12,25 5,28 2,29 3,32 17,35 10.3,36 0.1,37 3,38 24,39 29.604,40 32.701,41 19.182,42 18.821,44 4.602}
{0 CHEMBL210612,1 8.399,2 43.2,3 43.2,4 0.997,5 1.111,6 0.724,7 0.667,8 369.55,9 6.8,10 17,11 44,13 18,14 27,16 46,17 19,20 15,21 4,22 1,24 19,25 6,26 2,28 3,29 1,31 2,32 25,35 2.3,36 0.13,37 6,38 36.5,39 43.854,40 48.866,41 31.858,42 29.368,44 4.398}
{0 CHEMBL210632,1 8.868,2 44.9,3 36.7,4 1.02,5 1.115,6 0.711,7 0.69,8 434.51,9 8.2,10 18,11 49,13 21,14 33,16 51,17 22,19 1,20 18,21 3,22 2,24 18,25 9,26 1,28 4,29 4,31 1,32 31,33 1,35 8.2,36 0.137,37 7,38 46,39 49.978,40 54.657,41 34.818,42 33.82,44 4.222}
{0 CHEMBL211969,1 9.205,2 41.7,3 36.1,4 1.031,5 1.12,6 0.702,7 0.687,8 331.38,9 8.3,10 12,11 36,13 17,14 24,16 37,17 15,19 1,20 11,21 3,22 4,24 13,25 8,26 1,28 3,29 4,31 1,32 23,33 1,35 11.1,36 0.081,37 3,38 36,39 37.109,40 40.329,41 25.29,42 24.745,44 4.886}
{0 CHEMBL212019,1 8.119,2 43.2,3 43.2,4 1.003,5 1.115,6 0.7,7 0.658,8 300.41,9 5.4,10 10,11 37,13 12,14 23,16 39,17 16,19 1,20 9,21 6,22 1,24 16,25 5,26 1,28 2,29 2,31 1,32 21,33 1,35 5.4,36 0.077,37 3,38 31,39 37.12,40 41.242,41 25.898,42 24.347,44 4.796}
{0 CHEMBL212080,1 6.641,2 34.7,3 52.6,4 1.004,5 1.139,6 0.612,7 0.578,8 630.87,9 4.2,10 6,11 95,13 12,14 46,16 96,17 33,20 13,21 20,22 6,24 50,25 12,28 4,29 8,32 45,35 8.4,36 0.198,37 19,38 55,39 95.348,40 108.218,41 58.171,42 54.92,44 7.237}
{0 CHEMBL212190,1 8.5,2 37.2,3 44.2,4 1.012,5 1.123,6 0.692,7 0.646,8 365.52,9 7,10 15,11 43,13 17,14 26,16 45,17 16,20 11,21 5,22 2,24 19,25 8,26 2,28 3,29 3,31 2,32 24,35 7,36 0.111,37 5,38 35.5,39 43.509,40 48.285,41 29.767,42 27.797,44 5}
{0 CHEMBL212218,1 13.12,2 40,3 20,4 1.11,5 1.147,6 0.735,7 0.77,8 459.2,9 5.7,10 12,11 35,13 18,14 29,16 36,17 14,18 2,20 12,21 2,22 6,23 3,24 7,25 14,26 3,28 2,29 6,31 1,32 28,34 5,35 17.1,36 0.111,37 4,38 41,39 38.847,40 40.156,41 25.721,42 26.958,43 14.3,44 6.523}
{0 CHEMBL212240,1 15.037,2 44.8,3 27.6,4 1.055,5 1.094,6 0.808,7 0.774,8 436.08,10 12,11 29,13 15,14 22,15 2,16 30,17 13,20 13,22 3,24 8,25 8,26 3,29 5,31 1,32 21,34 2,35 17.2,36 0.1,37 3,38 31,39 30.589,40 31.726,41 23.432,42 22.446,43 6.9,44 4.796}
{0 CHEMBL212399,1 10.013,2 38.9,3 33.3,4 1.03,5 1.125,6 0.737,7 0.709,8 360.46,9 16.7,10 15,11 36,13 18,14 26,16 38,17 14,19 1,20 10,21 3,22 2,24 12,25 10,26 2,28 6,29 2,31 2,32 24,33 1,35 5.6,36 0.105,37 4,38 37.5,39 37.069,40 40.494,41 26.523,42 25.513,44 4.745}
{0 CHEMBL212454,1 14.488,2 46.2,3 20.5,4 1.081,5 1.096,6 0.842,7 0.824,8 565.03,10 12,11 39,13 18,14 32,16 40,17 18,18 6,20 18,22 6,24 8,25 13,26 7,29 6,31 1,32 31,34 6,35 15.4,36 0.2,37 8,38 44,39 42.168,40 42.747,41 32.852,42 32.129,43 15.4,44 6.046}
{0 CHEMBL212504,1 9.617,2 42.4,3 33.3,4 1.037,5 1.119,6 0.713,7 0.704,8 317.35,9 9.1,10 12,11 33,13 17,14 23,16 34,17 14,19 1,20 11,21 2,22 4,24 11,25 8,26 1,28 3,29 4,31 1,32 22,33 1,35 12.1,36 0.088,37 3,38 35,39 34.225,40 36.913,41 23.528,42 23.218,44 4.886}
{0 CHEMBL213054,1 6.603,2 35.2,3 52.7,4 1.002,5 1.138,6 0.615,7 0.579,8 600.84,9 4.4,10 6,11 91,13 11,14 45,16 93,17 32,20 11,21 21,22 5,24 48,25 11,28 4,29 7,32 43,35 7.7,36 0.172,37 16,38 53,39 91.138,40 103.593,41 55.955,42 52.679,44 7.276}
{0 CHEMBL213543,1 6.739,2 35.3,3 51.8,4 1.004,5 1.138,6 0.617,7 0.584,8 572.78,9 4.7,10 6,11 85,13 12,14 42,16 86,17 30,20 13,21 17,22 6,24 44,25 11,28 4,29 7,32 41,35 8.2,36 0.198,37 17,38 51,39 85.37,40 96.763,41 52.432,42 49.625,44 6.18}
{0 CHEMBL213581,1 10.546,2 37,3 33.3,4 1.041,5 1.13,6 0.73,7 0.708,8 284.75,9 14.8,10 12,11 27,13 14,14 19,16 28,17 10,18 1,20 10,22 2,24 9,25 8,26 2,28 4,29 2,31 1,32 18,34 1,35 7.4,36 0.071,37 2,38 27,39 28.113,40 30.522,41 19.722,42 19.11,43 3.7,44 5.222}
{0 CHEMBL214372,1 11.068,2 42.1,3 31.6,4 1.024,5 1.099,6 0.804,7 0.747,8 210.3,9 10.5,10 10,11 19,13 11,14 14,16 20,17 8,20 7,21 1,22 1,24 6,25 5,26 2,28 2,29 1,31 2,32 13,35 5.3,36 0.15,37 3,38 20,39 19.451,40 20.876,41 15.284,42 14.185,44 4.398}
{0 CHEMBL2146517,1 7.869,2 46.5,3 41.9,4 1.014,5 1.111,6 0.677,7 0.658,8 338.38,10 11,11 43,13 14,14 28,16 46,17 20,20 13,21 7,22 3,24 18,25 5,29 5,32 25,35 11.6,36 0.043,37 2,38 36.5,39 43.589,40 47.784,41 29.125,42 28.315,44 4.826}
{0 CHEMBL215254,1 7.57,2 46.3,3 43.9,4 1.006,5 1.112,6 0.675,7 0.649,8 310.37,10 11,11 41,13 13,14 26,16 44,17 19,20 12,21 7,22 2,24 18,25 4,29 4,32 23,35 9.8,36 0.023,37 1,38 33.5,39 41.262,40 45.574,41 27.671,42 26.6,44 4.666}
{0 CHEMBL215397,1 10.631,2 41.4,3 27.6,4 1.065,5 1.118,6 0.713,7 0.728,8 308.29,9 6.9,10 12,11 29,13 18,14 22,16 30,17 12,20 12,22 6,24 8,25 9,26 1,28 2,29 6,31 1,32 21,35 20.7,36 0.133,37 4,38 34,39 30.895,40 32.419,41 20.67,42 21.099,44 4.602}
{0 CHEMBL215732,1 8.677,2 42.1,3 38.6,4 1.025,5 1.121,6 0.689,7 0.672,8 494.57,9 7,10 12,11 57,13 20,14 36,16 58,17 24,19 2,20 18,21 4,22 6,24 22,25 11,26 1,28 4,29 6,31 1,32 35,33 2,35 10.5,36 0.19,37 11,38 52,39 58.4,40 63.906,41 39.25,42 38.303,44 4.796}
{0 CHEMBL215733,1 12.516,2 41.4,3 31,4 1.03,5 1.083,6 0.855,7 0.772,8 362.95,9 3.4,10 15,11 29,13 17,14 22,16 31,17 12,18 1,20 11,21 1,22 2,24 9,25 8,26 5,28 1,29 2,31 4,32 20,34 1,35 6.9,36 0.129,37 4,38 31.5,39 29.862,40 31.41,41 24.79,42 22.398,43 3.4,44 4.745}
{0 CHEMBL222234,1 12.765,2 47.6,3 28.6,4 1.046,5 1.105,6 0.762,7 0.751,8 268.07,9 4.8,10 11,11 21,13 12,14 16,15 1,16 22,17 10,20 10,22 1,24 6,25 5,26 1,28 1,29 3,32 15,34 1,35 14.3,36 0.136,37 3,38 22.5,39 21.964,40 23.214,41 16.006,42 15.771,43 4.8,44 7.301}
{0 CHEMBL222628,1 12.034,2 45,3 25,4 1.051,5 1.105,6 0.797,7 0.777,8 240.68,9 10,10 11,11 20,13 12,14 16,16 21,17 9,18 1,20 9,22 1,24 5,25 6,26 2,28 2,29 2,31 1,32 15,34 1,35 10,36 0.143,37 3,38 22.5,39 21.026,40 22.11,41 15.949,42 15.541,43 5,44 6.569}
{0 CHEMBL222735,1 9.418,2 46.4,3 35.7,4 1.029,5 1.112,6 0.716,7 0.701,8 263.69,9 3.6,10 12,11 28,13 13,14 19,16 29,17 13,18 1,20 12,21 1,22 1,24 10,25 5,26 1,28 1,29 3,32 18,34 1,35 10.7,36 0.138,37 4,38 26,39 28.825,40 31.147,41 20.034,42 19.627,43 3.6,44 6.469}
{0 CHEMBL222769,1 10.779,2 51.6,3 29,4 1.037,5 1.1,6 0.771,7 0.757,8 334.16,9 3.2,10 17,11 31,13 18,14 24,16 33,17 16,18 2,20 16,22 1,24 9,25 6,26 2,28 1,29 3,32 22,34 2,35 9.7,36 0.121,37 4,38 33.5,39 32.149,40 34.091,41 23.892,42 23.455,43 6.5,44 7.201}
{0 CHEMBL222840,1 10.649,2 47.6,3 28.6,4 1.05,5 1.11,6 0.739,7 0.742,8 223.62,9 4.8,10 11,11 21,13 12,14 16,16 22,17 10,18 1,20 10,22 1,24 6,25 5,26 1,28 1,29 3,32 15,34 1,35 14.3,36 0.136,37 3,38 22.5,39 22.058,40 23.316,41 15.511,42 15.574,43 4.8,44 7.222}
{0 CHEMBL222893,1 10.731,2 51.9,3 29.6,4 1.026,5 1.09,6 0.795,7 0.762,8 289.75,9 3.7,10 16,11 27,13 17,14 21,16 29,17 14,18 1,20 14,22 1,24 8,25 5,26 2,28 1,29 2,31 1,32 19,34 1,35 7.4,36 0.103,37 3,38 30,39 27.691,40 29.442,41 21.466,42 20.573,43 3.7,44 7.022}
{0 CHEMBL225515,1 9.739,2 50,3 32.1,4 1.026,5 1.108,6 0.744,7 0.729,8 272.7,9 7.1,10 16,11 28,13 17,14 21,16 30,17 14,18 1,20 14,22 1,24 9,25 5,26 1,28 2,29 2,32 19,34 1,35 7.1,36 0.1,37 3,38 30,39 28.716,40 31.02,41 20.824,42 20.407,43 3.6,44 7.187}
{0 CHEMBL227075,1 7.952,2 51.4,3 40,4 1.005,5 1.101,6 0.706,7 0.681,8 278.32,10 11,11 35,13 14,14 24,16 38,17 18,20 14,21 4,22 3,24 14,25 3,29 3,32 21,35 8.6,38 32.5,39 35.167,40 38.535,41 24.693,42 23.832,44 4.951}
{0 CHEMBL277716,1 7.056,2 38.4,3 48.8,4 1.006,5 1.132,6 0.636,7 0.606,8 606.79,9 4.7,10 12,11 86,13 18,14 46,16 88,17 33,20 19,21 14,22 6,24 42,25 11,28 4,29 7,32 44,35 8.1,36 0.193,37 17,38 58,39 86.487,40 97.348,41 54.671,42 52.098,44 5.646}
{0 CHEMBL348660,1 8.494,2 48.5,3 36.4,4 1.018,5 1.112,6 0.702,7 0.692,8 280.3,9 6.1,10 12,11 33,13 15,14 23,16 35,17 16,20 15,21 1,22 3,24 12,25 5,28 2,29 3,32 21,35 9.1,36 0.086,37 3,38 32,39 33.604,40 36.701,41 23.182,42 22.821,44 4.9}
{0 CHEMBL358279,1 8.471,2 51.3,3 35.9,4 1.012,5 1.106,6 0.716,7 0.701,8 330.36,9 5.1,10 17,11 39,13 20,14 28,16 42,17 20,20 19,21 1,22 3,24 14,25 5,28 2,29 3,32 25,35 7.7,36 0.071,37 3,38 39.5,39 39.487,40 43.116,41 27.943,42 27.348,44 6.92}
{0 CHEMBL363535,1 8.373,2 54.5,3 36.4,4 1.009,5 1.095,6 0.725,7 0.706,8 276.3,10 16,11 33,13 18,14 24,16 36,17 18,20 16,21 2,22 2,24 12,25 3,29 3,32 21,35 9.1,38 34,39 33.284,40 36.119,41 23.932,42 23.305,44 4.863}
{0 CHEMBL365134,1 11.633,2 53.1,3 31.3,4 1.015,5 1.086,6 0.804,7 0.759,8 372.25,9 3.1,10 16,11 32,13 18,14 25,15 1,16 35,17 17,20 16,21 1,22 2,24 10,25 5,26 2,28 1,29 2,31 1,32 22,34 1,35 6.3,36 0.057,37 2,38 35,39 32.48,40 34.755,41 25.722,42 24.297,43 3.1,44 6.009}
{0 CHEMBL365469,1 10.244,2 53.1,3 31.3,4 1.018,5 1.089,6 0.788,7 0.753,8 327.8,9 3.1,10 16,11 32,13 18,14 25,16 35,17 17,18 1,20 16,21 1,22 2,24 10,25 5,26 2,28 1,29 2,31 1,32 22,34 1,35 6.3,36 0.057,37 2,38 35,39 32.575,40 34.857,41 25.227,42 24.1,43 3.1,44 4.951}
{0 CHEMBL370923,1 11.171,2 44.2,3 39.5,4 1.009,5 1.107,6 0.762,7 0.695,8 480.35,9 4.7,10 11,11 43,13 14,14 29,16 46,17 19,20 13,21 6,22 3,24 17,25 7,26 2,27 1,28 2,29 3,31 1,32 26,34 1,35 7,36 0.065,37 3,38 37.5,39 43.4,40 47.587,41 32.773,42 29.906,43 2.3,44 4.757}
{0 CHEMBL375130,1 9.291,2 38.9,3 38.9,4 1.018,5 1.12,6 0.723,7 0.681,8 334.46,9 11.1,10 15,11 36,13 17,14 24,16 38,17 14,20 11,21 3,22 2,24 14,25 8,26 2,28 4,29 2,31 2,32 22,35 5.6,36 0.132,37 5,38 33.5,39 36.633,40 40.328,41 26.034,42 24.523,44 4.699}
{0 CHEMBL377150,1 10.625,2 43.8,3 31.3,4 1.042,5 1.134,6 0.745,7 0.726,8 510,9 10.4,10 22,11 48,13 23,14 36,16 51,17 21,18 1,20 18,21 3,22 1,23 3,24 15,25 12,26 3,28 5,29 1,31 2,32 33,34 4,35 2.1,36 0.118,37 6,38 48,39 50.036,40 54.41,41 35.779,42 34.861,43 8.3,44 5}
{0 CHEMBL377253,1 9.222,2 45.5,3 36.4,4 1.031,5 1.105,6 0.712,7 0.695,8 304.34,10 12,11 33,13 16,14 22,16 34,17 15,20 14,21 1,22 4,24 12,25 6,26 1,29 5,31 1,32 21,35 15.2,36 0.118,37 4,38 32,39 34.015,40 36.458,41 23.489,42 22.922,44 4.796}
{0 CHEMBL378342,1 8.064,2 38.4,3 43.8,4 1.025,5 1.127,6 0.652,7 0.634,8 588.69,9 2.7,10 12,11 73,13 20,14 42,16 74,17 28,20 20,21 8,22 8,24 32,25 13,26 1,28 2,29 10,31 1,32 41,35 13.7,36 0.23,37 17,38 56,39 74.807,40 82.239,41 47.625,42 46.28,44 4.495}
{0 CHEMBL378674,1 10.18,2 43.1,3 37.3,4 1.008,5 1.101,6 0.785,7 0.717,8 519.18,9 7.8,10 22,11 51,13 23,14 35,16 54,17 22,18 1,20 18,21 4,22 1,24 19,25 10,26 5,28 4,29 1,31 4,32 32,34 1,35 2,36 0.13,37 7,38 47,39 51.433,40 56.148,41 40.017,42 36.591,43 2,44 4.921}
{0 CHEMBL378700,1 10.257,2 40.5,3 35.1,4 1.025,5 1.107,6 0.76,7 0.714,8 379.52,9 8.1,10 16,11 37,13 19,14 26,16 39,17 15,20 14,21 1,22 3,24 13,25 9,26 3,28 3,29 3,31 3,32 24,35 8.1,36 0.128,37 5,38 37,39 37.935,40 40.959,41 28.131,42 26.404,44 4.824}
{0 CHEMBL379642,1 11.01,2 48.5,3 24.2,4 1.064,5 1.137,6 0.74,7 0.756,8 363.34,9 9.1,10 16,11 33,13 18,14 27,16 35,17 16,19 2,20 13,21 1,22 1,23 3,24 8,25 9,26 1,28 3,29 2,31 1,32 25,33 1,34 3,35 6.1,36 0.086,37 3,38 38,39 35.109,40 37.514,41 24.432,42 24.938,43 9.1,44 5.523}
{0 CHEMBL379727,1 7.697,2 40.6,3 43.8,4 1.015,5 1.129,6 0.654,7 0.636,8 246.29,9 6.3,10 6,11 32,13 9,14 19,16 33,17 13,20 9,21 4,22 3,24 14,25 5,28 2,29 3,32 18,35 9.4,36 0.121,37 4,38 25,39 32.487,40 36.116,41 20.943,42 20.348,44 4.721}
{0 CHEMBL380403,1 12.191,2 43.3,3 23.3,4 1.092,5 1.143,6 0.732,7 0.756,8 365.73,9 3.3,10 12,11 30,13 16,14 24,16 31,17 13,18 1,20 12,21 1,22 4,23 3,24 7,25 10,26 2,28 1,29 4,31 1,32 23,34 4,35 13.3,36 0.097,37 3,38 34,39 32.767,40 34.295,41 21.949,42 22.679,43 13.3,44 4.921}
{0 CHEMBL380470,1 8.457,2 42.6,3 40.4,4 1.016,5 1.119,6 0.693,7 0.666,8 397.49,9 6.4,10 18,11 47,13 19,14 30,16 49,17 20,20 17,21 3,22 1,24 19,25 8,26 1,28 3,29 4,31 1,32 28,35 8.5,36 0.143,37 7,38 40,39 47.76,40 52.574,41 32.574,42 31.325,44 4.347}
{0 CHEMBL383725,1 11.806,2 54.3,3 34.3,4 1.004,5 1.089,6 0.804,7 0.741,8 413.22,9 2.9,10 17,11 35,13 19,14 26,16 38,17 19,20 18,21 1,22 2,24 12,25 4,26 1,27 1,28 1,29 2,32 23,34 1,35 5.7,36 0.053,37 2,38 36.5,39 35.127,40 38.129,41 28.142,42 25.929,43 2.9,44 5.959}
{0 CHEMBL384739,1 11.656,2 40.7,3 25.9,4 1.07,5 1.117,6 0.743,7 0.749,8 314.72,9 7.4,10 12,11 27,13 17,14 21,16 28,17 11,18 1,20 11,22 5,24 7,25 9,26 2,28 2,29 5,31 1,32 20,34 1,35 18.5,36 0.107,37 3,38 32,39 28.891,40 30.153,41 20.074,42 20.212,43 3.7,44 4.824}
{0 CHEMBL426082,1 9.168,2 53.1,3 34.4,4 1.008,5 1.091,6 0.762,7 0.727,8 293.36,9 3.1,10 16,11 32,13 18,14 24,16 35,17 17,20 16,21 1,22 2,24 11,25 4,26 1,28 1,29 2,31 1,32 21,35 6.3,36 0.057,37 2,38 34,39 32.251,40 34.913,41 24.369,42 23.272,44 4.882}
{0 CHEMBL426898,1 10.136,2 51.9,3 29.6,4 1.035,5 1.101,6 0.751,7 0.744,8 273.68,9 3.7,10 16,11 27,13 17,14 21,16 29,17 14,18 1,20 14,22 1,24 8,25 5,26 1,28 1,29 3,32 19,34 1,35 11.1,36 0.103,37 3,38 30,39 27.942,40 29.731,41 20.273,42 20.101,43 3.7,44 6.77}
{0 CHEMBL427404,1 10.848,2 37.8,3 27,4 1.08,5 1.16,6 0.685,7 0.714,8 401.36,9 13.5,10 15,11 37,13 18,14 29,16 39,17 14,20 11,21 3,22 3,23 3,24 10,25 13,26 1,28 5,29 4,31 1,32 27,34 3,35 10.8,36 0.103,37 4,38 39.5,39 39.967,40 42.929,41 25.352,42 26.41,43 8.1,44 5.301}
{0 CHEMBL45830,1 6.568,2 44.2,3 51.2,4 0.985,5 1.116,6 0.658,7 0.61,8 282.41,10 6,11 43,13 9,14 23,16 45,17 19,20 10,21 9,22 3,24 22,25 2,29 2,32 21,35 4.7,36 0.022,37 1,38 29,39 42.374,40 47.986,41 28.284,42 26.224,44 4.523}
